chemistry-commits mailing list archives

Site index · List index
Message view « Date » · « Thread »
Top « Date » · « Thread »
From Apache Jenkins Server <jenk...@builds.apache.org>
Subject Build failed in Jenkins: Chemistry - OpenCMIS - Workbench #388
Date Sat, 25 Jun 2011 20:02:02 GMT
See <https://builds.apache.org/job/Chemistry%20-%20OpenCMIS%20-%20Workbench/388/>

------------------------------------------
Started by upstream project "Chemistry - OpenCMIS - install" build number 773
Building remotely on ubuntu2
Updating http://svn.apache.org/repos/asf/chemistry/opencmis/trunk/chemistry-opencmis-workbench/chemistry-opencmis-workbench
U         pom.xml
At revision 1139609
no change for http://svn.apache.org/repos/asf/chemistry/opencmis/trunk/chemistry-opencmis-workbench/chemistry-opencmis-workbench
since the previous build
ERROR: Ignore Problem expanding maven opts macros org.jenkinsci.plugins.tokenmacro.TokenMacro
Found mavenVersion 2.2.1 from file jar:file:/home/hudson/tools/maven/latest/lib/maven-2.2.1-uber.jar!/META-INF/maven/org.apache.maven/maven-core/pom.properties
Parsing POMs
ERROR: Failed to parse POMs
hudson.util.IOException2: remote file operation failed: <https://builds.apache.org/job/Chemistry%20-%20OpenCMIS%20-%20Workbench/ws/chemistry-opencmis-workbench>
at hudson.remoting.Channel@4e1a7a90:ubuntu2
	at hudson.FilePath.act(FilePath.java:754)
	at hudson.FilePath.act(FilePath.java:740)
	at hudson.maven.MavenModuleSetBuild$RunnerImpl.parsePoms(MavenModuleSetBuild.java:817)
	at hudson.maven.MavenModuleSetBuild$RunnerImpl.doRun(MavenModuleSetBuild.java:617)
	at hudson.model.AbstractBuild$AbstractRunner.run(AbstractBuild.java:429)
	at hudson.model.Run.run(Run.java:1374)
	at hudson.maven.MavenModuleSetBuild.run(MavenModuleSetBuild.java:467)
	at hudson.model.ResourceController.execute(ResourceController.java:88)
	at hudson.model.Executor.run(Executor.java:145)
Caused by: hudson.remoting.ProxyException: hudson.maven.MavenModuleSetBuild$MavenExecutionException:
org.apache.maven.project.ProjectBuildingException: Some problems were encountered while processing
the POMs:
[FATAL] Non-resolvable parent POM: Could not find artifact org.apache.chemistry.opencmis:chemistry-opencmis:pom:0.5.0-SNAPSHOT
and 'parent.relativePath' points at wrong local POM @ line 20, column 13

	at hudson.maven.MavenModuleSetBuild$PomParser.invoke(MavenModuleSetBuild.java:1327)
	at hudson.maven.MavenModuleSetBuild$PomParser.invoke(MavenModuleSetBuild.java:1110)
	at hudson.FilePath$FileCallableWrapper.call(FilePath.java:1979)
	at hudson.remoting.UserRequest.perform(UserRequest.java:118)
	at hudson.remoting.UserRequest.perform(UserRequest.java:48)
	at hudson.remoting.Request$2.run(Request.java:270)
	at java.util.concurrent.Executors$RunnableAdapter.call(Executors.java:471)
	at java.util.concurrent.FutureTask$Sync.innerRun(FutureTask.java:334)
	at java.util.concurrent.FutureTask.run(FutureTask.java:166)
	at java.util.concurrent.ThreadPoolExecutor.runWorker(ThreadPoolExecutor.java:1110)
	at java.util.concurrent.ThreadPoolExecutor$Worker.run(ThreadPoolExecutor.java:603)
	at java.lang.Thread.run(Thread.java:636)
Caused by: hudson.remoting.ProxyException: org.apache.maven.project.ProjectBuildingException:
Some problems were encountered while processing the POMs:
[FATAL] Non-resolvable parent POM: Could not find artifact org.apache.chemistry.opencmis:chemistry-opencmis:pom:0.5.0-SNAPSHOT
and 'parent.relativePath' points at wrong local POM @ line 20, column 13

	at org.apache.maven.project.DefaultProjectBuilder.build(DefaultProjectBuilder.java:339)
	at hudson.maven.MavenEmbedder.buildProjects(MavenEmbedder.java:360)
	at hudson.maven.MavenEmbedder.readProjects(MavenEmbedder.java:330)
	at hudson.maven.MavenEmbedder.readProject(MavenEmbedder.java:321)
	at hudson.maven.MavenModuleSetBuild$PomParser.invoke(MavenModuleSetBuild.java:1283)
	... 11 more


Mime
View raw message