commons-dev mailing list archives

Site index · List index
Message view « Date » · « Thread »
Top « Date » · « Thread »
From Continuum VMBuild Server <contin...@apache.org>
Subject [continuum] BUILD FAILURE: Commons Lang
Date Wed, 13 Feb 2008 06:44:25 GMT
Online report : http://vmbuild.apache.org/continuum/buildResult.action?buildId=50155&projectId=114

Build statistics:
  State: Failed
  Previous State: Ok
  Started at: Tue 12 Feb 2008 22:43:19 -0800
  Finished at: Tue 12 Feb 2008 22:44:05 -0800
  Total time: 46s
  Build Trigger: Schedule
  Build Number: 53
  Exit code: 1
  Building machine hostname: vmbuild.apache.org
  Operating system : Linux(unknown)
  Java Home version : 
          java version "1.5.0_12"
          Java(TM) 2 Runtime Environment, Standard Edition (build 1.5.0_12-b04)
          Java HotSpot(TM) Client VM (build 1.5.0_12-b04, mixed mode, sharing)
        
  Builder version :
          Maven version: 2.0.7
          Java version: 1.5.0_12
          OS name: "linux" version: "2.6.20-16-server" arch: "i386"
    
****************************************************************************
SCM Changes:
****************************************************************************
Changed: bayard @ Tue 12 Feb 2008 21:44:46 -0800
Comment: Applying my patch from LANG-412; fixing Peter Oxenham's report that the appendFixedWidthPadRight
and appendFixedWidthPadLeft are not null safe if the nullText has not been set
Files changed:
  /commons/proper/lang/trunk/src/java/org/apache/commons/lang/text/StrBuilder.java ( 627248
)
  /commons/proper/lang/trunk/src/test/org/apache/commons/lang/text/StrBuilderTest.java ( 627248
)

****************************************************************************
Dependencies Changes:
****************************************************************************
No dependencies changed


****************************************************************************
Build Defintion:
****************************************************************************
POM filename: pom.xml
Goals: clean deploy   
Arguments: --batch-mode -DaltDeploymentRepository=vmbuild.repo::default::file://localhost/home/continuum/data/commons
-Pci
Build Fresh: false
Always Build: false
Default Build Definition: true
Schedule: COMMONS_SCHEDULE
Profile Name: Java 5
Description: 


****************************************************************************
Test Summary:
****************************************************************************
Tests: 2658
Failures: 1
Total time: 17750

****************************************************************************
Output:
****************************************************************************
[INFO] Scanning for projects...
[INFO] ----------------------------------------------------------------------------
[INFO] Building Commons Lang
[INFO]    task-segment: [clean, deploy]
[INFO] ----------------------------------------------------------------------------
[INFO] [clean:clean]
[INFO] Deleting directory /home/continuum/data/working-directory/114/target
[INFO] Deleting directory /home/continuum/data/working-directory/114/target/classes
[INFO] Deleting directory /home/continuum/data/working-directory/114/target/test-classes
[INFO] Deleting directory /home/continuum/data/working-directory/114/target/site
[INFO] [antrun:run {execution: javadoc.resources}]
[INFO] Executing tasks
     [copy] Copying 2 files to /home/continuum/data/working-directory/114/target/apidocs/META-INF
[INFO] Executed tasks
[INFO] [resources:resources]
[INFO] Using default encoding to copy filtered resources.
[INFO] [compiler:compile]
[INFO] Compiling 88 source files to /home/continuum/data/working-directory/114/target/classes
[INFO] [resources:testResources]
[INFO] Using default encoding to copy filtered resources.
[INFO] [compiler:testCompile]
[INFO] Compiling 148 source files to /home/continuum/data/working-directory/114/target/test-classes
[INFO] [surefire:test]
[INFO] Surefire report directory: /home/continuum/data/working-directory/114/target/surefire-reports

-------------------------------------------------------
 T E S T S
-------------------------------------------------------
Running org.apache.commons.lang.builder.BuilderTestSuite
Tests run: 270, Failures: 0, Errors: 0, Skipped: 0, Time elapsed: 0.435 sec
Running org.apache.commons.lang.enum.EnumTestSuite
Tests run: 63, Failures: 0, Errors: 0, Skipped: 0, Time elapsed: 0.233 sec
Running org.apache.commons.lang.LangTestSuite

Tests run: 680, Failures: 0, Errors: 0, Skipped: 0, Time elapsed: 3.836 sec
Running org.apache.commons.lang.enums.EnumTestSuite
Tests run: 75, Failures: 0, Errors: 0, Skipped: 0, Time elapsed: 0.429 sec
Running org.apache.commons.lang.text.TextTestSuite
Tests run: 1092, Failures: 0, Errors: 0, Skipped: 0, Time elapsed: 2.572 sec
Running org.apache.commons.lang.mutable.MutableTestSuite
Tests run: 97, Failures: 0, Errors: 0, Skipped: 0, Time elapsed: 0.068 sec
Running org.apache.commons.lang.math.MathTestSuite
Tests run: 175, Failures: 1, Errors: 0, Skipped: 0, Time elapsed: 0.305 sec <<< FAILURE!
Running org.apache.commons.lang.time.TimeTestSuite
Tests run: 125, Failures: 0, Errors: 0, Skipped: 0, Time elapsed: 9.828 sec
Running org.apache.commons.lang.exception.ExceptionTestSuite
Tests run: 81, Failures: 0, Errors: 0, Skipped: 0, Time elapsed: 0.205 sec

Results :

Failed tests: 
  testNextDouble2(org.apache.commons.lang.math.RandomUtilsTest)

Tests run: 2658, Failures: 1, Errors: 0, Skipped: 0

[INFO] ------------------------------------------------------------------------
[ERROR] BUILD FAILURE
[INFO] ------------------------------------------------------------------------
[INFO] There are test failures.
[INFO] ------------------------------------------------------------------------
[INFO] For more information, run Maven with the -e switch
[INFO] ------------------------------------------------------------------------
[INFO] Total time: 37 seconds
[INFO] Finished at: Tue Feb 12 22:44:05 PST 2008
[INFO] Final Memory: 8M/27M
[INFO] ------------------------------------------------------------------------

****************************************************************************



---------------------------------------------------------------------
To unsubscribe, e-mail: dev-unsubscribe@commons.apache.org
For additional commands, e-mail: dev-help@commons.apache.org


Mime
View raw message