commons-dev mailing list archives

Site index · List index
Message view « Date » · « Thread »
Top « Date » · « Thread »
From Apache Jenkins Server <jenk...@builds.apache.org>
Subject Build failed in Jenkins: commons-jcs #126
Date Thu, 03 Dec 2015 17:02:22 GMT
See <https://builds.apache.org/job/commons-jcs/126/changes>

Changes:

[tv] Address issues reported by Findbugs

------------------------------------------
[...truncated 687 lines...]

main:
    [mkdir] Created dir: <https://builds.apache.org/job/commons-jcs/ws/commons-jcs-jcache-openjpa/target/generated-resources/notices/META-INF>
     [copy] Copying 2 files to <https://builds.apache.org/job/commons-jcs/ws/commons-jcs-jcache-openjpa/target/generated-resources/notices/META-INF>
     [copy] Copying <https://builds.apache.org/job/commons-jcs/ws/LICENSE.txt> to <https://builds.apache.org/job/commons-jcs/ws/commons-jcs-jcache-openjpa/target/generated-resources/notices/META-INF/LICENSE.txt>
     [copy] Copying <https://builds.apache.org/job/commons-jcs/ws/NOTICE.txt> to <https://builds.apache.org/job/commons-jcs/ws/commons-jcs-jcache-openjpa/target/generated-resources/notices/META-INF/NOTICE.txt>
    [mkdir] Created dir: <https://builds.apache.org/job/commons-jcs/ws/commons-jcs-jcache-openjpa/target/generated-test-resources/notices/META-INF>
     [copy] Copying 2 files to <https://builds.apache.org/job/commons-jcs/ws/commons-jcs-jcache-openjpa/target/generated-test-resources/notices/META-INF>
     [copy] Copying <https://builds.apache.org/job/commons-jcs/ws/LICENSE.txt> to <https://builds.apache.org/job/commons-jcs/ws/commons-jcs-jcache-openjpa/target/generated-test-resources/notices/META-INF/LICENSE.txt>
     [copy] Copying <https://builds.apache.org/job/commons-jcs/ws/NOTICE.txt> to <https://builds.apache.org/job/commons-jcs/ws/commons-jcs-jcache-openjpa/target/generated-test-resources/notices/META-INF/NOTICE.txt>
[INFO] Executed tasks
[INFO] 
[INFO] --- maven-remote-resources-plugin:1.5:process (default) @ commons-jcs-jcache-openjpa
---
[INFO] 
[INFO] --- buildnumber-maven-plugin:1.3:create (default) @ commons-jcs-jcache-openjpa ---
[INFO] Executing: /bin/sh -c cd <https://builds.apache.org/job/commons-jcs/ws/commons-jcs-jcache-openjpa>
&& svn --non-interactive info
[INFO] Working directory: <https://builds.apache.org/job/commons-jcs/ws/commons-jcs-jcache-openjpa>
[INFO] Storing buildNumber: ?????? at timestamp: 1449162074330
[INFO] Executing: /bin/sh -c cd <https://builds.apache.org/job/commons-jcs/ws/commons-jcs-jcache-openjpa>
&& svn --non-interactive info
[INFO] Working directory: <https://builds.apache.org/job/commons-jcs/ws/commons-jcs-jcache-openjpa>
[INFO] Storing buildScmBranch: UNKNOWN_BRANCH
[INFO] 
[INFO] --- build-helper-maven-plugin:1.9.1:add-resource (add-source-notices) @ commons-jcs-jcache-openjpa
---
[INFO] 
[INFO] --- maven-resources-plugin:2.7:resources (default-resources) @ commons-jcs-jcache-openjpa
---
[INFO] Using 'UTF-8' encoding to copy filtered resources.
[INFO] Copying 1 resource to <https://builds.apache.org/job/commons-jcs/ws/commons-jcs-jcache-openjpa/target/classes>
[INFO] Copying 2 resources
[INFO] 
[INFO] --- maven-compiler-plugin:3.2:compile (default-compile) @ commons-jcs-jcache-openjpa
---
[INFO] Changes detected - recompiling the module!
[INFO] Compiling 4 source files to <https://builds.apache.org/job/commons-jcs/ws/commons-jcs-jcache-openjpa/target/classes>
[INFO] 
[INFO] --- maven-bundle-plugin:2.5.3:manifest (bundle-manifest) @ commons-jcs-jcache-openjpa
---
[INFO] 
[INFO] --- build-helper-maven-plugin:1.9.1:add-test-resource (add-test-notices) @ commons-jcs-jcache-openjpa
---
[INFO] 
[INFO] --- maven-resources-plugin:2.7:testResources (default-testResources) @ commons-jcs-jcache-openjpa
---
[INFO] Using 'UTF-8' encoding to copy filtered resources.
[INFO] skip non existing resourceDirectory <https://builds.apache.org/job/commons-jcs/ws/commons-jcs-jcache-openjpa/src/test/resources>
[INFO] Copying 2 resources to META-INF
[INFO] Copying 2 resources
[INFO] 
[INFO] --- maven-compiler-plugin:3.2:testCompile (default-testCompile) @ commons-jcs-jcache-openjpa
---
[INFO] Changes detected - recompiling the module!
[INFO] Compiling 1 source file to <https://builds.apache.org/job/commons-jcs/ws/commons-jcs-jcache-openjpa/target/test-classes>
[INFO] 
[INFO] --- maven-surefire-plugin:2.18:test (default-test) @ commons-jcs-jcache-openjpa ---
[JENKINS] Recording test results
[INFO] 
[INFO] --- maven-jar-plugin:2.5:jar (default-jar) @ commons-jcs-jcache-openjpa ---
[INFO] Building jar: <https://builds.apache.org/job/commons-jcs/ws/commons-jcs-jcache-openjpa/target/commons-jcs-jcache-openjpa-2.0-SNAPSHOT.jar>
[INFO] 
[INFO] --- maven-jar-plugin:2.5:test-jar (attach-test-jar) @ commons-jcs-jcache-openjpa ---
[INFO] Building jar: <https://builds.apache.org/job/commons-jcs/ws/commons-jcs-jcache-openjpa/target/commons-jcs-jcache-openjpa-2.0-SNAPSHOT-tests.jar>
[INFO] 
[INFO] --- maven-site-plugin:3.4:attach-descriptor (attach-descriptor) @ commons-jcs-jcache-openjpa
---
[INFO] 
[INFO] --- maven-enforcer-plugin:1.3.1:enforce (enforce-maven-3) @ commons-jcs-jcache-openjpa
---
[INFO] 
[INFO] --- maven-antrun-plugin:1.7:run (javadoc.resources) @ commons-jcs-jcache-openjpa ---
[INFO] Executing tasks

main:
[INFO] Executed tasks
[INFO] 
[INFO] --- maven-antrun-plugin:1.7:run (copy-notices) @ commons-jcs-jcache-openjpa ---
[INFO] Executing tasks

main:
[INFO] Executed tasks
[WARNING] Failed to getClass for org.apache.maven.plugin.javadoc.JavadocReport
[INFO] 
[INFO] --- maven-javadoc-plugin:2.10.1:javadoc (create-javadoc-jar) @ commons-jcs-jcache-openjpa
---
[INFO] 
1 warning
[WARNING] Javadoc Warnings
[WARNING] warning: [options] bootstrap class path not set in conjunction with -source 1.6
[JENKINS] Archiving  javadoc
[INFO] 
[INFO] --- maven-javadoc-plugin:2.10.1:jar (create-javadoc-jar) @ commons-jcs-jcache-openjpa
---
[INFO] 
1 warning
[WARNING] Javadoc Warnings
[WARNING] warning: [options] bootstrap class path not set in conjunction with -source 1.6
[INFO] Building jar: <https://builds.apache.org/job/commons-jcs/ws/commons-jcs-jcache-openjpa/target/commons-jcs-jcache-openjpa-2.0-SNAPSHOT-javadoc.jar>
[INFO] 
[INFO] --- maven-source-plugin:2.4:jar-no-fork (attach-sources) @ commons-jcs-jcache-openjpa
---
[INFO] Building jar: <https://builds.apache.org/job/commons-jcs/ws/commons-jcs-jcache-openjpa/target/commons-jcs-jcache-openjpa-2.0-SNAPSHOT-sources.jar>
[INFO] 
[INFO] --- maven-source-plugin:2.4:test-jar-no-fork (attach-test-sources) @ commons-jcs-jcache-openjpa
---
[INFO] Building jar: <https://builds.apache.org/job/commons-jcs/ws/commons-jcs-jcache-openjpa/target/commons-jcs-jcache-openjpa-2.0-SNAPSHOT-test-sources.jar>
[INFO] 
[INFO] --- maven-install-plugin:2.5.2:install (default-install) @ commons-jcs-jcache-openjpa
---
[INFO] Installing <https://builds.apache.org/job/commons-jcs/ws/commons-jcs-jcache-openjpa/target/commons-jcs-jcache-openjpa-2.0-SNAPSHOT.jar>
to /home/jenkins/jenkins-slave/maven-repositories/1/org/apache/commons/commons-jcs-jcache-openjpa/2.0-SNAPSHOT/commons-jcs-jcache-openjpa-2.0-SNAPSHOT.jar
[INFO] Installing <https://builds.apache.org/job/commons-jcs/ws/commons-jcs-jcache-openjpa/pom.xml>
to /home/jenkins/jenkins-slave/maven-repositories/1/org/apache/commons/commons-jcs-jcache-openjpa/2.0-SNAPSHOT/commons-jcs-jcache-openjpa-2.0-SNAPSHOT.pom
[INFO] Installing <https://builds.apache.org/job/commons-jcs/ws/commons-jcs-jcache-openjpa/target/commons-jcs-jcache-openjpa-2.0-SNAPSHOT-tests.jar>
to /home/jenkins/jenkins-slave/maven-repositories/1/org/apache/commons/commons-jcs-jcache-openjpa/2.0-SNAPSHOT/commons-jcs-jcache-openjpa-2.0-SNAPSHOT-tests.jar
[INFO] Installing <https://builds.apache.org/job/commons-jcs/ws/commons-jcs-jcache-openjpa/target/commons-jcs-jcache-openjpa-2.0-SNAPSHOT-javadoc.jar>
to /home/jenkins/jenkins-slave/maven-repositories/1/org/apache/commons/commons-jcs-jcache-openjpa/2.0-SNAPSHOT/commons-jcs-jcache-openjpa-2.0-SNAPSHOT-javadoc.jar
[INFO] Installing <https://builds.apache.org/job/commons-jcs/ws/commons-jcs-jcache-openjpa/target/commons-jcs-jcache-openjpa-2.0-SNAPSHOT-sources.jar>
to /home/jenkins/jenkins-slave/maven-repositories/1/org/apache/commons/commons-jcs-jcache-openjpa/2.0-SNAPSHOT/commons-jcs-jcache-openjpa-2.0-SNAPSHOT-sources.jar
[INFO] Installing <https://builds.apache.org/job/commons-jcs/ws/commons-jcs-jcache-openjpa/target/commons-jcs-jcache-openjpa-2.0-SNAPSHOT-test-sources.jar>
to /home/jenkins/jenkins-slave/maven-repositories/1/org/apache/commons/commons-jcs-jcache-openjpa/2.0-SNAPSHOT/commons-jcs-jcache-openjpa-2.0-SNAPSHOT-test-sources.jar
[INFO] ------------------------------------------------------------------------
[INFO] Reactor Summary:
[INFO] 
[INFO] Apache Commons JCS ................................ SUCCESS [9.612s]
[INFO] Apache Commons JCS :: Core ........................ SUCCESS [1:01.747s]
[INFO] Apache Commons JCS :: JCache ...................... SUCCESS [10.525s]
[INFO] Apache Commons JCS :: JCache TCK .................. SUCCESS [3.507s]
[INFO] Apache Commons JCS :: JCache Extras ............... SUCCESS [8.889s]
[INFO] Apache Commons JCS :: JCache OpenJPA .............. SUCCESS [7.303s]
[INFO] ------------------------------------------------------------------------
[INFO] BUILD SUCCESS
[INFO] ------------------------------------------------------------------------
[INFO] Total time: 1:48.041s
[INFO] Finished at: Thu Dec 03 17:01:21 UTC 2015
[INFO] Final Memory: 43M/267M
[INFO] ------------------------------------------------------------------------
Waiting for Jenkins to finish collecting data
[JENKINS] Archiving <https://builds.apache.org/job/commons-jcs/ws/commons-jcs-core/pom.xml>
to org.apache.commons/commons-jcs-core/2.0-SNAPSHOT/commons-jcs-core-2.0-SNAPSHOT.pom
[JENKINS] Archiving <https://builds.apache.org/job/commons-jcs/ws/commons-jcs-core/target/commons-jcs-core-2.0-SNAPSHOT.jar>
to org.apache.commons/commons-jcs-core/2.0-SNAPSHOT/commons-jcs-core-2.0-SNAPSHOT.jar
[JENKINS] Archiving <https://builds.apache.org/job/commons-jcs/ws/commons-jcs-core/target/commons-jcs-core-2.0-SNAPSHOT-tests.jar>
to org.apache.commons/commons-jcs-core/2.0-SNAPSHOT/commons-jcs-core-2.0-SNAPSHOT-tests.jar
[JENKINS] Archiving <https://builds.apache.org/job/commons-jcs/ws/commons-jcs-core/target/commons-jcs-core-2.0-SNAPSHOT-javadoc.jar>
to org.apache.commons/commons-jcs-core/2.0-SNAPSHOT/commons-jcs-core-2.0-SNAPSHOT-javadoc.jar
[JENKINS] Archiving <https://builds.apache.org/job/commons-jcs/ws/commons-jcs-core/target/commons-jcs-core-2.0-SNAPSHOT-sources.jar>
to org.apache.commons/commons-jcs-core/2.0-SNAPSHOT/commons-jcs-core-2.0-SNAPSHOT-sources.jar
[JENKINS] Archiving <https://builds.apache.org/job/commons-jcs/ws/commons-jcs-core/target/commons-jcs-core-2.0-SNAPSHOT-test-sources.jar>
to org.apache.commons/commons-jcs-core/2.0-SNAPSHOT/commons-jcs-core-2.0-SNAPSHOT-test-sources.jar
[JENKINS] Archiving <https://builds.apache.org/job/commons-jcs/ws/commons-jcs-jcache/pom.xml>
to org.apache.commons/commons-jcs-jcache/2.0-SNAPSHOT/commons-jcs-jcache-2.0-SNAPSHOT.pom
[JENKINS] Archiving <https://builds.apache.org/job/commons-jcs/ws/commons-jcs-jcache/target/commons-jcs-jcache-2.0-SNAPSHOT.jar>
to org.apache.commons/commons-jcs-jcache/2.0-SNAPSHOT/commons-jcs-jcache-2.0-SNAPSHOT.jar
[JENKINS] Archiving <https://builds.apache.org/job/commons-jcs/ws/commons-jcs-jcache/target/commons-jcs-jcache-2.0-SNAPSHOT-tests.jar>
to org.apache.commons/commons-jcs-jcache/2.0-SNAPSHOT/commons-jcs-jcache-2.0-SNAPSHOT-tests.jar
[JENKINS] Archiving <https://builds.apache.org/job/commons-jcs/ws/commons-jcs-jcache/target/commons-jcs-jcache-2.0-SNAPSHOT-cdi.jar>
to org.apache.commons/commons-jcs-jcache/2.0-SNAPSHOT/commons-jcs-jcache-2.0-SNAPSHOT-cdi.jar
[JENKINS] Archiving <https://builds.apache.org/job/commons-jcs/ws/commons-jcs-jcache/target/commons-jcs-jcache-2.0-SNAPSHOT-nocdi.jar>
to org.apache.commons/commons-jcs-jcache/2.0-SNAPSHOT/commons-jcs-jcache-2.0-SNAPSHOT-nocdi.jar
[JENKINS] Archiving <https://builds.apache.org/job/commons-jcs/ws/commons-jcs-jcache/target/commons-jcs-jcache-2.0-SNAPSHOT-javadoc.jar>
to org.apache.commons/commons-jcs-jcache/2.0-SNAPSHOT/commons-jcs-jcache-2.0-SNAPSHOT-javadoc.jar
[JENKINS] Archiving <https://builds.apache.org/job/commons-jcs/ws/commons-jcs-jcache/target/commons-jcs-jcache-2.0-SNAPSHOT-sources.jar>
to org.apache.commons/commons-jcs-jcache/2.0-SNAPSHOT/commons-jcs-jcache-2.0-SNAPSHOT-sources.jar
[JENKINS] Archiving <https://builds.apache.org/job/commons-jcs/ws/commons-jcs-jcache/target/commons-jcs-jcache-2.0-SNAPSHOT-test-sources.jar>
to org.apache.commons/commons-jcs-jcache/2.0-SNAPSHOT/commons-jcs-jcache-2.0-SNAPSHOT-test-sources.jar
[JENKINS] Archiving <https://builds.apache.org/job/commons-jcs/ws/pom.xml> to org.apache.commons/commons-jcs/2.0-SNAPSHOT/commons-jcs-2.0-SNAPSHOT.pom
[JENKINS] Archiving <https://builds.apache.org/job/commons-jcs/ws/target/commons-jcs-2.0-SNAPSHOT-site.xml>
to org.apache.commons/commons-jcs/2.0-SNAPSHOT/commons-jcs-2.0-SNAPSHOT-site.xml
[JENKINS] Archiving <https://builds.apache.org/job/commons-jcs/ws/commons-jcs-jcache-extras/pom.xml>
to org.apache.commons/commons-jcs-jcache-extras/2.0-SNAPSHOT/commons-jcs-jcache-extras-2.0-SNAPSHOT.pom
[JENKINS] Archiving <https://builds.apache.org/job/commons-jcs/ws/commons-jcs-jcache-extras/target/commons-jcs-jcache-extras-2.0-SNAPSHOT.jar>
to org.apache.commons/commons-jcs-jcache-extras/2.0-SNAPSHOT/commons-jcs-jcache-extras-2.0-SNAPSHOT.jar
[JENKINS] Archiving <https://builds.apache.org/job/commons-jcs/ws/commons-jcs-jcache-extras/target/commons-jcs-jcache-extras-2.0-SNAPSHOT-tests.jar>
to org.apache.commons/commons-jcs-jcache-extras/2.0-SNAPSHOT/commons-jcs-jcache-extras-2.0-SNAPSHOT-tests.jar
[JENKINS] Archiving <https://builds.apache.org/job/commons-jcs/ws/commons-jcs-jcache-extras/target/commons-jcs-jcache-extras-2.0-SNAPSHOT-javadoc.jar>
to org.apache.commons/commons-jcs-jcache-extras/2.0-SNAPSHOT/commons-jcs-jcache-extras-2.0-SNAPSHOT-javadoc.jar
[JENKINS] Archiving <https://builds.apache.org/job/commons-jcs/ws/commons-jcs-jcache-extras/target/commons-jcs-jcache-extras-2.0-SNAPSHOT-sources.jar>
to org.apache.commons/commons-jcs-jcache-extras/2.0-SNAPSHOT/commons-jcs-jcache-extras-2.0-SNAPSHOT-sources.jar
[JENKINS] Archiving <https://builds.apache.org/job/commons-jcs/ws/commons-jcs-jcache-extras/target/commons-jcs-jcache-extras-2.0-SNAPSHOT-test-sources.jar>
to org.apache.commons/commons-jcs-jcache-extras/2.0-SNAPSHOT/commons-jcs-jcache-extras-2.0-SNAPSHOT-test-sources.jar
[JENKINS] Archiving <https://builds.apache.org/job/commons-jcs/ws/commons-jcs-tck-tests/pom.xml>
to org.apache.commons/commons-jcs-jcache-tck/2.0-SNAPSHOT/commons-jcs-jcache-tck-2.0-SNAPSHOT.pom
[JENKINS] Archiving <https://builds.apache.org/job/commons-jcs/ws/commons-jcs-tck-tests/target/commons-jcs-jcache-tck-2.0-SNAPSHOT.jar>
to org.apache.commons/commons-jcs-jcache-tck/2.0-SNAPSHOT/commons-jcs-jcache-tck-2.0-SNAPSHOT.jar
[JENKINS] Archiving <https://builds.apache.org/job/commons-jcs/ws/commons-jcs-jcache-openjpa/pom.xml>
to org.apache.commons/commons-jcs-jcache-openjpa/2.0-SNAPSHOT/commons-jcs-jcache-openjpa-2.0-SNAPSHOT.pom
[JENKINS] Archiving <https://builds.apache.org/job/commons-jcs/ws/commons-jcs-jcache-openjpa/target/commons-jcs-jcache-openjpa-2.0-SNAPSHOT.jar>
to org.apache.commons/commons-jcs-jcache-openjpa/2.0-SNAPSHOT/commons-jcs-jcache-openjpa-2.0-SNAPSHOT.jar
[JENKINS] Archiving <https://builds.apache.org/job/commons-jcs/ws/commons-jcs-jcache-openjpa/target/commons-jcs-jcache-openjpa-2.0-SNAPSHOT-tests.jar>
to org.apache.commons/commons-jcs-jcache-openjpa/2.0-SNAPSHOT/commons-jcs-jcache-openjpa-2.0-SNAPSHOT-tests.jar
[JENKINS] Archiving <https://builds.apache.org/job/commons-jcs/ws/commons-jcs-jcache-openjpa/target/commons-jcs-jcache-openjpa-2.0-SNAPSHOT-javadoc.jar>
to org.apache.commons/commons-jcs-jcache-openjpa/2.0-SNAPSHOT/commons-jcs-jcache-openjpa-2.0-SNAPSHOT-javadoc.jar
[JENKINS] Archiving <https://builds.apache.org/job/commons-jcs/ws/commons-jcs-jcache-openjpa/target/commons-jcs-jcache-openjpa-2.0-SNAPSHOT-sources.jar>
to org.apache.commons/commons-jcs-jcache-openjpa/2.0-SNAPSHOT/commons-jcs-jcache-openjpa-2.0-SNAPSHOT-sources.jar
[JENKINS] Archiving <https://builds.apache.org/job/commons-jcs/ws/commons-jcs-jcache-openjpa/target/commons-jcs-jcache-openjpa-2.0-SNAPSHOT-test-sources.jar>
to org.apache.commons/commons-jcs-jcache-openjpa/2.0-SNAPSHOT/commons-jcs-jcache-openjpa-2.0-SNAPSHOT-test-sources.jar
channel stopped
Maven RedeployPublisher use remote ubuntu-1 maven settings from : /home/jenkins/.m2/settings.xml
[INFO] Deployment in https://repository.apache.org/content/repositories/snapshots (id=apache.snapshots.https,uniqueVersion=true)
Deploying the main artifact commons-jcs-2.0-SNAPSHOT.pom
Downloading: https://repository.apache.org/content/repositories/snapshots/org/apache/commons/commons-jcs/2.0-SNAPSHOT/maven-metadata.xml
Downloaded: https://repository.apache.org/content/repositories/snapshots/org/apache/commons/commons-jcs/2.0-SNAPSHOT/maven-metadata.xml
(817 B at 0.2 KB/sec)
Uploading: https://repository.apache.org/content/repositories/snapshots/org/apache/commons/commons-jcs/2.0-SNAPSHOT/commons-jcs-2.0-20151203.170127-234.pom
Uploaded: https://repository.apache.org/content/repositories/snapshots/org/apache/commons/commons-jcs/2.0-SNAPSHOT/commons-jcs-2.0-20151203.170127-234.pom
(25 KB at 35.8 KB/sec)
Downloading: https://repository.apache.org/content/repositories/snapshots/org/apache/commons/commons-jcs/maven-metadata.xml
Downloaded: https://repository.apache.org/content/repositories/snapshots/org/apache/commons/commons-jcs/maven-metadata.xml
(345 B at 0.7 KB/sec)
Uploading: https://repository.apache.org/content/repositories/snapshots/org/apache/commons/commons-jcs/2.0-SNAPSHOT/maven-metadata.xml
Uploaded: https://repository.apache.org/content/repositories/snapshots/org/apache/commons/commons-jcs/2.0-SNAPSHOT/maven-metadata.xml
(817 B at 0.9 KB/sec)
Uploading: https://repository.apache.org/content/repositories/snapshots/org/apache/commons/commons-jcs/maven-metadata.xml
Uploaded: https://repository.apache.org/content/repositories/snapshots/org/apache/commons/commons-jcs/maven-metadata.xml
(345 B at 0.1 KB/sec)
Deploying the main artifact commons-jcs-2.0-SNAPSHOT-site.xml
Uploading: https://repository.apache.org/content/repositories/snapshots/org/apache/commons/commons-jcs/2.0-SNAPSHOT/commons-jcs-2.0-20151203.170127-234-site.xml
Uploaded: https://repository.apache.org/content/repositories/snapshots/org/apache/commons/commons-jcs/2.0-SNAPSHOT/commons-jcs-2.0-20151203.170127-234-site.xml
(4 KB at 2.2 KB/sec)
Uploading: https://repository.apache.org/content/repositories/snapshots/org/apache/commons/commons-jcs/2.0-SNAPSHOT/maven-metadata.xml
Uploaded: https://repository.apache.org/content/repositories/snapshots/org/apache/commons/commons-jcs/2.0-SNAPSHOT/maven-metadata.xml
(817 B at 0.6 KB/sec)
[INFO] Deployment in https://repository.apache.org/content/repositories/snapshots (id=apache.snapshots.https,uniqueVersion=true)
Deploying the main artifact commons-jcs-core-2.0-SNAPSHOT.jar
Downloading: https://repository.apache.org/content/repositories/snapshots/org/apache/commons/commons-jcs-core/2.0-SNAPSHOT/maven-metadata.xml
Downloaded: https://repository.apache.org/content/repositories/snapshots/org/apache/commons/commons-jcs-core/2.0-SNAPSHOT/maven-metadata.xml
(2 KB at 3.3 KB/sec)
Uploading: https://repository.apache.org/content/repositories/snapshots/org/apache/commons/commons-jcs-core/2.0-SNAPSHOT/commons-jcs-core-2.0-20151203.170137-165.jar
Uploaded: https://repository.apache.org/content/repositories/snapshots/org/apache/commons/commons-jcs-core/2.0-SNAPSHOT/commons-jcs-core-2.0-20151203.170137-165.jar
(534 KB at 112.9 KB/sec)
Uploading: https://repository.apache.org/content/repositories/snapshots/org/apache/commons/commons-jcs-core/2.0-SNAPSHOT/commons-jcs-core-2.0-20151203.170137-165.pom
Uploaded: https://repository.apache.org/content/repositories/snapshots/org/apache/commons/commons-jcs-core/2.0-SNAPSHOT/commons-jcs-core-2.0-20151203.170137-165.pom
(6 KB at 18.2 KB/sec)
Downloading: https://repository.apache.org/content/repositories/snapshots/org/apache/commons/commons-jcs-core/maven-metadata.xml
Downloaded: https://repository.apache.org/content/repositories/snapshots/org/apache/commons/commons-jcs-core/maven-metadata.xml
(292 B at 0.6 KB/sec)
Uploading: https://repository.apache.org/content/repositories/snapshots/org/apache/commons/commons-jcs-core/2.0-SNAPSHOT/maven-metadata.xml
Uploaded: https://repository.apache.org/content/repositories/snapshots/org/apache/commons/commons-jcs-core/2.0-SNAPSHOT/maven-metadata.xml
(2 KB at 3.5 KB/sec)
Uploading: https://repository.apache.org/content/repositories/snapshots/org/apache/commons/commons-jcs-core/maven-metadata.xml
Uploaded: https://repository.apache.org/content/repositories/snapshots/org/apache/commons/commons-jcs-core/maven-metadata.xml
(292 B at 0.1 KB/sec)
Deploying the main artifact commons-jcs-core-2.0-SNAPSHOT-tests.jar
Uploading: https://repository.apache.org/content/repositories/snapshots/org/apache/commons/commons-jcs-core/2.0-SNAPSHOT/commons-jcs-core-2.0-20151203.170137-165-tests.jar
Uploaded: https://repository.apache.org/content/repositories/snapshots/org/apache/commons/commons-jcs-core/2.0-SNAPSHOT/commons-jcs-core-2.0-20151203.170137-165-tests.jar
(421 KB at 137.0 KB/sec)
Uploading: https://repository.apache.org/content/repositories/snapshots/org/apache/commons/commons-jcs-core/2.0-SNAPSHOT/maven-metadata.xml
Uploaded: https://repository.apache.org/content/repositories/snapshots/org/apache/commons/commons-jcs-core/2.0-SNAPSHOT/maven-metadata.xml
(2 KB at 4.3 KB/sec)
Deploying the main artifact commons-jcs-core-2.0-SNAPSHOT-javadoc.jar
Uploading: https://repository.apache.org/content/repositories/snapshots/org/apache/commons/commons-jcs-core/2.0-SNAPSHOT/commons-jcs-core-2.0-20151203.170137-165-javadoc.jar
ERROR: Failed to deploy artifacts: Could not transfer artifact org.apache.commons:commons-jcs-core:jar:javadoc:2.0-20151203.170137-165
from/to apache.snapshots.https (https://repository.apache.org/content/repositories/snapshots):
Connection reset
org.apache.maven.artifact.deployer.ArtifactDeploymentException: Failed to deploy artifacts:
Could not transfer artifact org.apache.commons:commons-jcs-core:jar:javadoc:2.0-20151203.170137-165
from/to apache.snapshots.https (https://repository.apache.org/content/repositories/snapshots):
Connection reset
	at org.apache.maven.artifact.deployer.DefaultArtifactDeployer.deploy(DefaultArtifactDeployer.java:143)
	at hudson.maven.reporters.MavenArtifactRecord.deploy(MavenArtifactRecord.java:208)
	at hudson.maven.RedeployPublisher.perform(RedeployPublisher.java:176)
	at hudson.tasks.BuildStepMonitor$1.perform(BuildStepMonitor.java:20)
	at hudson.model.AbstractBuild$AbstractBuildExecution.perform(AbstractBuild.java:776)
	at hudson.model.AbstractBuild$AbstractBuildExecution.performAllBuildSteps(AbstractBuild.java:723)
	at hudson.maven.MavenModuleSetBuild$MavenModuleSetBuildExecution.post2(MavenModuleSetBuild.java:1047)
	at hudson.model.AbstractBuild$AbstractBuildExecution.post(AbstractBuild.java:670)
	at hudson.model.Run.execute(Run.java:1763)
	at hudson.maven.MavenModuleSetBuild.run(MavenModuleSetBuild.java:531)
	at hudson.model.ResourceController.execute(ResourceController.java:98)
	at hudson.model.Executor.run(Executor.java:381)
Caused by: org.eclipse.aether.deployment.DeploymentException: Failed to deploy artifacts:
Could not transfer artifact org.apache.commons:commons-jcs-core:jar:javadoc:2.0-20151203.170137-165
from/to apache.snapshots.https (https://repository.apache.org/content/repositories/snapshots):
Connection reset
	at org.eclipse.aether.internal.impl.DefaultDeployer.deploy(DefaultDeployer.java:341)
	at org.eclipse.aether.internal.impl.DefaultDeployer.deploy(DefaultDeployer.java:269)
	at org.eclipse.aether.internal.impl.DefaultRepositorySystem.deploy(DefaultRepositorySystem.java:413)
	at org.apache.maven.artifact.deployer.DefaultArtifactDeployer.deploy(DefaultArtifactDeployer.java:139)
	... 11 more
Caused by: org.eclipse.aether.transfer.ArtifactTransferException: Could not transfer artifact
org.apache.commons:commons-jcs-core:jar:javadoc:2.0-20151203.170137-165 from/to apache.snapshots.https
(https://repository.apache.org/content/repositories/snapshots): Connection reset
	at org.eclipse.aether.connector.wagon.WagonRepositoryConnector$6.wrap(WagonRepositoryConnector.java:1016)
	at org.eclipse.aether.connector.wagon.WagonRepositoryConnector$6.wrap(WagonRepositoryConnector.java:1004)
	at org.eclipse.aether.connector.wagon.WagonRepositoryConnector$PutTask.run(WagonRepositoryConnector.java:895)
	at org.eclipse.aether.connector.wagon.WagonRepositoryConnector.put(WagonRepositoryConnector.java:522)
	at org.eclipse.aether.internal.impl.DefaultDeployer.deploy(DefaultDeployer.java:335)
	... 14 more
Caused by: org.apache.maven.wagon.TransferFailedException: Connection reset
	at org.apache.maven.wagon.shared.http4.AbstractHttpClientWagon.put(AbstractHttpClientWagon.java:580)
	at org.apache.maven.wagon.shared.http4.AbstractHttpClientWagon.put(AbstractHttpClientWagon.java:524)
	at org.apache.maven.wagon.shared.http4.AbstractHttpClientWagon.put(AbstractHttpClientWagon.java:505)
	at org.apache.maven.wagon.shared.http4.AbstractHttpClientWagon.put(AbstractHttpClientWagon.java:485)
	at org.eclipse.aether.connector.wagon.WagonRepositoryConnector$PutTask.run(WagonRepositoryConnector.java:871)
	... 16 more
Caused by: java.net.SocketException: Connection reset
	at java.net.SocketInputStream.read(SocketInputStream.java:196)
	at java.net.SocketInputStream.read(SocketInputStream.java:122)
	at sun.security.ssl.InputRecord.readFully(InputRecord.java:442)
	at sun.security.ssl.InputRecord.read(InputRecord.java:480)
	at sun.security.ssl.SSLSocketImpl.readRecord(SSLSocketImpl.java:927)
	at sun.security.ssl.SSLSocketImpl.readDataRecord(SSLSocketImpl.java:884)
	at sun.security.ssl.AppInputStream.read(AppInputStream.java:102)
	at org.apache.http.impl.io.AbstractSessionInputBuffer.fillBuffer(AbstractSessionInputBuffer.java:166)
	at org.apache.http.impl.io.SocketInputBuffer.fillBuffer(SocketInputBuffer.java:90)
	at org.apache.http.impl.io.AbstractSessionInputBuffer.readLine(AbstractSessionInputBuffer.java:281)
	at org.apache.http.impl.conn.DefaultHttpResponseParser.parseHead(DefaultHttpResponseParser.java:92)
	at org.apache.http.impl.conn.DefaultHttpResponseParser.parseHead(DefaultHttpResponseParser.java:62)
	at org.apache.http.impl.io.AbstractMessageParser.parse(AbstractMessageParser.java:254)
	at org.apache.http.impl.AbstractHttpClientConnection.receiveResponseHeader(AbstractHttpClientConnection.java:289)
	at org.apache.http.impl.conn.DefaultClientConnection.receiveResponseHeader(DefaultClientConnection.java:252)
	at org.apache.http.impl.conn.ManagedClientConnectionImpl.receiveResponseHeader(ManagedClientConnectionImpl.java:191)
	at org.apache.http.protocol.HttpRequestExecutor.doReceiveResponse(HttpRequestExecutor.java:300)
	at org.apache.http.protocol.HttpRequestExecutor.execute(HttpRequestExecutor.java:127)
	at org.apache.http.impl.client.DefaultRequestDirector.tryExecute(DefaultRequestDirector.java:715)
	at org.apache.http.impl.client.DefaultRequestDirector.execute(DefaultRequestDirector.java:520)
	at org.apache.http.impl.client.AbstractHttpClient.execute(AbstractHttpClient.java:906)
	at org.apache.http.impl.client.AbstractHttpClient.execute(AbstractHttpClient.java:805)
	at org.apache.maven.wagon.shared.http4.AbstractHttpClientWagon.execute(AbstractHttpClientWagon.java:746)
	at org.apache.maven.wagon.shared.http4.AbstractHttpClientWagon.put(AbstractHttpClientWagon.java:574)
	... 20 more
[INFO] Deployment failed after 58 sec
Build step 'Deploy artifacts to Maven repository' changed build result to FAILURE

---------------------------------------------------------------------
To unsubscribe, e-mail: dev-unsubscribe@commons.apache.org
For additional commands, e-mail: dev-help@commons.apache.org


Mime
View raw message