commons-dev mailing list archives

Site index · List index
Message view « Date » · « Thread »
Top « Date » · « Thread »
From Apache Jenkins Server <jenk...@builds.apache.org>
Subject Build failed in Jenkins: Commons-Compress #60
Date Thu, 17 Mar 2016 10:17:37 GMT
See <https://builds.apache.org/job/Commons-Compress/60/changes>

Changes:

[bodewig] Bugfix for COMPRESS-343

[bodewig] test if end() is invoked when stream is closing

[bodewig] COMPRESS-343 try to free native memory even if close fails

[bodewig] record fix for COMPRESS-343

[bodewig] plug a few more native memory leaks

------------------------------------------
Started by an SCM change
[EnvInject] - Loading node environment variables.
Building remotely on mac-mini-1 (osx mac) in workspace <https://builds.apache.org/job/Commons-Compress/ws/>
 > git rev-parse --is-inside-work-tree # timeout=10
Fetching changes from the remote Git repository
 > git config remote.origin.url https://git-wip-us.apache.org/repos/asf/commons-compress.git
# timeout=10
Fetching upstream changes from https://git-wip-us.apache.org/repos/asf/commons-compress.git
 > git --version # timeout=10
 > git -c core.askpass=true fetch --tags --progress https://git-wip-us.apache.org/repos/asf/commons-compress.git
+refs/heads/*:refs/remotes/origin/*
 > git rev-parse refs/remotes/origin/master^{commit} # timeout=10
 > git rev-parse refs/remotes/origin/origin/master^{commit} # timeout=10
Checking out Revision f9334473bd9993f38458ecee137ba9e7f7b79abb (refs/remotes/origin/master)
 > git config core.sparsecheckout # timeout=10
 > git checkout -f f9334473bd9993f38458ecee137ba9e7f7b79abb
 > git rev-list c02b2d50ebc6609518841321bdc8edad80e2ef87 # timeout=10
Setting JDK_1_5_LATEST__HOME=/home/jenkins/tools/java/latest1.5
Parsing POMs
Modules changed, recalculating dependency graph
Established TCP socket on 50082
maven3-agent.jar already up to date
maven3-interceptor.jar already up to date
maven3-interceptor-commons.jar already up to date
[Commons-Compress] $ /Users/jenkins/jenkins-home/tools/hudson.model.JDK/JDK_1.7_latest_/bin/java
-Xmx2g -Xms256m -XX:MaxPermSize=512m -cp /Users/jenkins/jenkins-home/maven3-agent.jar:/home/jenkins/tools/maven/apache-maven-3.0.4/boot/plexus-classworlds-2.4.jar
org.jvnet.hudson.maven3.agent.Maven3Main /home/jenkins/tools/maven/apache-maven-3.0.4 /Users/jenkins/jenkins-home/slave.jar
/Users/jenkins/jenkins-home/maven3-interceptor.jar /Users/jenkins/jenkins-home/maven3-interceptor-commons.jar
50082
<===[JENKINS REMOTING CAPACITY]===>   channel started
Executing Maven:  -B -f <https://builds.apache.org/job/Commons-Compress/ws/pom.xml>
-Dmaven.repo.local=/Users/jenkins/jenkins-home/maven-repositories/0 clean deploy --batch-mode
-Dgpg.skip -Prelease -Pjava-1.5 -DJAVA_1_5_HOME=/home/jenkins/tools/java/latest1.5
[INFO] Scanning for projects...
[INFO]                                                                         
[INFO] ------------------------------------------------------------------------
[INFO] Building Apache Commons Compress 1.11-SNAPSHOT
[INFO] ------------------------------------------------------------------------
Downloading: http://repo.maven.apache.org/maven2/org/powermock/powermock-module-junit4/1.6.4/powermock-module-junit4-1.6.4.pom
Downloaded: http://repo.maven.apache.org/maven2/org/powermock/powermock-module-junit4/1.6.4/powermock-module-junit4-1.6.4.pom
(2 KB at 3.2 KB/sec)
Downloading: http://repo.maven.apache.org/maven2/org/powermock/powermock-modules/1.6.4/powermock-modules-1.6.4.pom
Downloaded: http://repo.maven.apache.org/maven2/org/powermock/powermock-modules/1.6.4/powermock-modules-1.6.4.pom
(770 B at 10.9 KB/sec)
Downloading: http://repo.maven.apache.org/maven2/org/powermock/powermock/1.6.4/powermock-1.6.4.pom
Downloaded: http://repo.maven.apache.org/maven2/org/powermock/powermock/1.6.4/powermock-1.6.4.pom
(15 KB at 147.4 KB/sec)
Downloading: http://repo.maven.apache.org/maven2/org/powermock/powermock-module-junit4-common/1.6.4/powermock-module-junit4-common-1.6.4.pom
Downloaded: http://repo.maven.apache.org/maven2/org/powermock/powermock-module-junit4-common/1.6.4/powermock-module-junit4-common-1.6.4.pom
(2 KB at 18.8 KB/sec)
Downloading: http://repo.maven.apache.org/maven2/junit/junit/4.4/junit-4.4.pom
Downloaded: http://repo.maven.apache.org/maven2/junit/junit/4.4/junit-4.4.pom (2 KB at 17.3
KB/sec)
Downloading: http://repo.maven.apache.org/maven2/org/powermock/powermock-core/1.6.4/powermock-core-1.6.4.pom
Downloaded: http://repo.maven.apache.org/maven2/org/powermock/powermock-core/1.6.4/powermock-core-1.6.4.pom
(3 KB at 29.4 KB/sec)
Downloading: http://repo.maven.apache.org/maven2/org/powermock/powermock-reflect/1.6.4/powermock-reflect-1.6.4.pom
Downloaded: http://repo.maven.apache.org/maven2/org/powermock/powermock-reflect/1.6.4/powermock-reflect-1.6.4.pom
(987 B at 13.6 KB/sec)
Downloading: http://repo.maven.apache.org/maven2/org/objenesis/objenesis/2.1/objenesis-2.1.pom
Downloaded: http://repo.maven.apache.org/maven2/org/objenesis/objenesis/2.1/objenesis-2.1.pom
(3 KB at 34.4 KB/sec)
Downloading: http://repo.maven.apache.org/maven2/org/objenesis/objenesis-parent/2.1/objenesis-parent-2.1.pom
Downloaded: http://repo.maven.apache.org/maven2/org/objenesis/objenesis-parent/2.1/objenesis-parent-2.1.pom
(17 KB at 194.2 KB/sec)
Downloading: http://repo.maven.apache.org/maven2/org/javassist/javassist/3.20.0-GA/javassist-3.20.0-GA.pom
Downloaded: http://repo.maven.apache.org/maven2/org/javassist/javassist/3.20.0-GA/javassist-3.20.0-GA.pom
(10 KB at 124.6 KB/sec)
Downloading: http://repo.maven.apache.org/maven2/org/powermock/powermock-api-mockito/1.6.4/powermock-api-mockito-1.6.4.pom
Downloaded: http://repo.maven.apache.org/maven2/org/powermock/powermock-api-mockito/1.6.4/powermock-api-mockito-1.6.4.pom
(2 KB at 17.9 KB/sec)
Downloading: http://repo.maven.apache.org/maven2/org/powermock/powermock-api/1.6.4/powermock-api-1.6.4.pom
Downloaded: http://repo.maven.apache.org/maven2/org/powermock/powermock-api/1.6.4/powermock-api-1.6.4.pom
(781 B at 10.9 KB/sec)
Downloading: http://repo.maven.apache.org/maven2/org/mockito/mockito-core/1.10.19/mockito-core-1.10.19.pom
Downloaded: http://repo.maven.apache.org/maven2/org/mockito/mockito-core/1.10.19/mockito-core-1.10.19.pom
(2 KB at 17.8 KB/sec)
Downloading: http://repo.maven.apache.org/maven2/org/powermock/powermock-api-support/1.6.4/powermock-api-support-1.6.4.pom
Downloaded: http://repo.maven.apache.org/maven2/org/powermock/powermock-api-support/1.6.4/powermock-api-support-1.6.4.pom
(2 KB at 16.4 KB/sec)
Downloading: http://repo.maven.apache.org/maven2/org/powermock/powermock-module-junit4/1.6.4/powermock-module-junit4-1.6.4.jar
Downloading: http://repo.maven.apache.org/maven2/org/powermock/powermock-module-junit4-common/1.6.4/powermock-module-junit4-common-1.6.4.jar
Downloading: http://repo.maven.apache.org/maven2/org/javassist/javassist/3.20.0-GA/javassist-3.20.0-GA.jar
Downloading: http://repo.maven.apache.org/maven2/org/powermock/powermock-core/1.6.4/powermock-core-1.6.4.jar
Downloading: http://repo.maven.apache.org/maven2/org/powermock/powermock-reflect/1.6.4/powermock-reflect-1.6.4.jar
Downloaded: http://repo.maven.apache.org/maven2/org/powermock/powermock-module-junit4/1.6.4/powermock-module-junit4-1.6.4.jar
(46 KB at 442.8 KB/sec)
Downloading: http://repo.maven.apache.org/maven2/org/powermock/powermock-api-mockito/1.6.4/powermock-api-mockito-1.6.4.jar
Downloaded: http://repo.maven.apache.org/maven2/org/powermock/powermock-module-junit4-common/1.6.4/powermock-module-junit4-common-1.6.4.jar
(15 KB at 98.2 KB/sec)
Downloading: http://repo.maven.apache.org/maven2/org/mockito/mockito-core/1.10.19/mockito-core-1.10.19.jar
Downloaded: http://repo.maven.apache.org/maven2/org/powermock/powermock-reflect/1.6.4/powermock-reflect-1.6.4.jar
(47 KB at 273.2 KB/sec)
Downloading: http://repo.maven.apache.org/maven2/org/objenesis/objenesis/2.1/objenesis-2.1.jar
Downloaded: http://repo.maven.apache.org/maven2/org/powermock/powermock-core/1.6.4/powermock-core-1.6.4.jar
(103 KB at 533.6 KB/sec)
Downloading: http://repo.maven.apache.org/maven2/org/powermock/powermock-api-support/1.6.4/powermock-api-support-1.6.4.jar
Downloaded: http://repo.maven.apache.org/maven2/org/powermock/powermock-api-mockito/1.6.4/powermock-api-mockito-1.6.4.jar
(97 KB at 905.1 KB/sec)
Downloaded: http://repo.maven.apache.org/maven2/org/powermock/powermock-api-support/1.6.4/powermock-api-support-1.6.4.jar
(20 KB at 296.9 KB/sec)
Downloaded: http://repo.maven.apache.org/maven2/org/objenesis/objenesis/2.1/objenesis-2.1.jar
(41 KB at 424.8 KB/sec)
Downloaded: http://repo.maven.apache.org/maven2/org/javassist/javassist/3.20.0-GA/javassist-3.20.0-GA.jar
(733 KB at 2181.5 KB/sec)
Downloaded: http://repo.maven.apache.org/maven2/org/mockito/mockito-core/1.10.19/mockito-core-1.10.19.jar
(1146 KB at 3079.3 KB/sec)
[INFO] 
[INFO] --- maven-clean-plugin:2.6.1:clean (default-clean) @ commons-compress ---
[INFO] Deleting <https://builds.apache.org/job/Commons-Compress/ws/target>
[INFO] 
[INFO] --- maven-enforcer-plugin:1.3.1:enforce (enforce-maven-3) @ commons-compress ---
[INFO] 
[INFO] --- build-helper-maven-plugin:1.9.1:parse-version (parse-version) @ commons-compress
---
[INFO] 
[INFO] --- maven-antrun-plugin:1.8:run (javadoc.resources) @ commons-compress ---
[INFO] Executing tasks

main:
     [copy] Copying 2 files to <https://builds.apache.org/job/Commons-Compress/ws/target/apidocs/META-INF>
[INFO] Executed tasks
[INFO] 
[INFO] --- maven-remote-resources-plugin:1.5:process (default) @ commons-compress ---
[INFO] 
[INFO] --- buildnumber-maven-plugin:1.3:create (default) @ commons-compress ---
[INFO] Executing: /bin/sh -c cd <https://builds.apache.org/job/Commons-Compress/ws/>
&& git rev-parse --verify HEAD
[INFO] Working directory: <https://builds.apache.org/job/Commons-Compress/ws/>
[INFO] Storing buildNumber: null at timestamp: 1458210527984
[WARNING] Cannot get the branch information from the git repository: 
Detecting the current branch failed: fatal: ref HEAD is not a symbolic ref

[INFO] Executing: /bin/sh -c cd <https://builds.apache.org/job/Commons-Compress/ws/>
&& git rev-parse --verify HEAD
[INFO] Working directory: <https://builds.apache.org/job/Commons-Compress/ws/>
[INFO] Storing buildScmBranch: UNKNOWN
[INFO] 
[INFO] --- maven-resources-plugin:2.7:resources (default-resources) @ commons-compress ---
[INFO] Using 'iso-8859-1' encoding to copy filtered resources.
[INFO] skip non existing resourceDirectory <https://builds.apache.org/job/Commons-Compress/ws/src/main/resources>
[INFO] Copying 2 resources to META-INF
[INFO] 
[INFO] --- maven-compiler-plugin:3.3:compile (default-compile) @ commons-compress ---
[INFO] Changes detected - recompiling the module!
[INFO] Compiling 165 source files to <https://builds.apache.org/job/Commons-Compress/ws/target/classes>
[INFO] ------------------------------------------------------------------------
[INFO] BUILD FAILURE
[INFO] ------------------------------------------------------------------------
[INFO] Total time: 11.483s
[INFO] Finished at: Thu Mar 17 03:28:49 PDT 2016
[INFO] Final Memory: 20M/251M
[INFO] ------------------------------------------------------------------------
Waiting for Jenkins to finish collecting data
[ERROR] Failed to execute goal org.apache.maven.plugins:maven-compiler-plugin:3.3:compile
(default-compile) on project commons-compress: Compilation failure -> [Help 1]
[ERROR] 
[ERROR] To see the full stack trace of the errors, re-run Maven with the -e switch.
[ERROR] Re-run Maven using the -X switch to enable full debug logging.
[ERROR] 
[ERROR] For more information about the errors and possible solutions, please read the following
articles:
[ERROR] [Help 1] http://cwiki.apache.org/confluence/display/MAVEN/MojoFailureException
[JENKINS] Archiving <https://builds.apache.org/job/Commons-Compress/ws/pom.xml> to org.apache.commons/commons-compress/1.11-SNAPSHOT/commons-compress-1.11-SNAPSHOT.pom
Sending e-mails to: dev@commons.apache.org
channel stopped

---------------------------------------------------------------------
To unsubscribe, e-mail: dev-unsubscribe@commons.apache.org
For additional commands, e-mail: dev-help@commons.apache.org


Mime
View raw message