commons-dev mailing list archives

Site index · List index
Message view « Date » · « Thread »
Top « Date » · « Thread »
From Apache Jenkins Server <>
Subject Build failed in Jenkins: Commons-Compress #64
Date Wed, 23 Mar 2016 18:11:24 GMT
See <>


[bodewig] COMPRESS-345 add support for GNU sparse files using PAX dialects

[bodewig] emit almost as much information as "tar tv"

Started by an SCM change
[EnvInject] - Loading node environment variables.
Building remotely on mac-mini-1 (osx mac) in workspace <>
 > git rev-parse --is-inside-work-tree # timeout=10
Fetching changes from the remote Git repository
 > git config remote.origin.url
# timeout=10
Fetching upstream changes from
 > git --version # timeout=10
 > git -c core.askpass=true fetch --tags --progress
 > git rev-parse refs/remotes/origin/master^{commit} # timeout=10
 > git rev-parse refs/remotes/origin/origin/master^{commit} # timeout=10
Checking out Revision bf20428c567fb7155e282c30ac305ef3e5593f1d (refs/remotes/origin/master)
 > git config core.sparsecheckout # timeout=10
 > git checkout -f bf20428c567fb7155e282c30ac305ef3e5593f1d
 > git rev-list 02e0f9ae63a1d1db2d4c644ddbaa0a18e6b748fa # timeout=10
Setting JDK_1_5_LATEST__HOME=/home/jenkins/tools/java/latest1.5
Parsing POMs
Established TCP socket on 50453
maven3-agent.jar already up to date
maven3-interceptor.jar already up to date
maven3-interceptor-commons.jar already up to date
[Commons-Compress] $ /Users/jenkins/jenkins-home/tools/hudson.model.JDK/JDK_1.7_latest_/bin/java
-Xmx2g -Xms256m -XX:MaxPermSize=512m -cp /Users/jenkins/jenkins-home/maven3-agent.jar:/home/jenkins/tools/maven/apache-maven-3.0.4/boot/plexus-classworlds-2.4.jar
org.jvnet.hudson.maven3.agent.Maven3Main /home/jenkins/tools/maven/apache-maven-3.0.4 /Users/jenkins/jenkins-home/slave.jar
/Users/jenkins/jenkins-home/maven3-interceptor.jar /Users/jenkins/jenkins-home/maven3-interceptor-commons.jar
<===[JENKINS REMOTING CAPACITY]===>   channel started
Executing Maven:  -B -f <>
-Dmaven.repo.local=/Users/jenkins/jenkins-home/maven-repositories/0 clean deploy --batch-mode
-Dgpg.skip -Prelease -Pjava-1.5 -DJAVA_1_5_HOME=/home/jenkins/tools/java/latest1.5
[INFO] Scanning for projects...
[INFO] ------------------------------------------------------------------------
[INFO] Building Apache Commons Compress 1.11-SNAPSHOT
[INFO] ------------------------------------------------------------------------
[INFO] --- maven-clean-plugin:2.6.1:clean (default-clean) @ commons-compress ---
[INFO] Deleting <>
[INFO] --- maven-enforcer-plugin:1.3.1:enforce (enforce-maven-3) @ commons-compress ---
[INFO] --- build-helper-maven-plugin:1.9.1:parse-version (parse-version) @ commons-compress
[INFO] --- maven-antrun-plugin:1.8:run (javadoc.resources) @ commons-compress ---
[INFO] Executing tasks

     [copy] Copying 2 files to <>
[INFO] Executed tasks
[INFO] --- maven-remote-resources-plugin:1.5:process (default) @ commons-compress ---
[INFO] --- buildnumber-maven-plugin:1.3:create (default) @ commons-compress ---
[INFO] Executing: /bin/sh -c cd <>
&& git rev-parse --verify HEAD
[INFO] Working directory: <>
[INFO] Storing buildNumber: null at timestamp: 1458757650228
[WARNING] Cannot get the branch information from the git repository: 
Detecting the current branch failed: fatal: ref HEAD is not a symbolic ref

[INFO] Executing: /bin/sh -c cd <>
&& git rev-parse --verify HEAD
[INFO] Working directory: <>
[INFO] Storing buildScmBranch: UNKNOWN
[INFO] --- maven-resources-plugin:2.7:resources (default-resources) @ commons-compress ---
[INFO] Using 'iso-8859-1' encoding to copy filtered resources.
[INFO] skip non existing resourceDirectory <>
[INFO] Copying 2 resources to META-INF
[INFO] --- maven-compiler-plugin:3.3:compile (default-compile) @ commons-compress ---
[INFO] Changes detected - recompiling the module!
[INFO] Compiling 165 source files to <>
[INFO] ------------------------------------------------------------------------
[INFO] ------------------------------------------------------------------------
[INFO] Total time: 8.673s
[INFO] Finished at: Wed Mar 23 11:27:32 PDT 2016
[INFO] Final Memory: 16M/250M
[INFO] ------------------------------------------------------------------------
Waiting for Jenkins to finish collecting data
[ERROR] Failed to execute goal org.apache.maven.plugins:maven-compiler-plugin:3.3:compile
(default-compile) on project commons-compress: Compilation failure -> [Help 1]
[ERROR] To see the full stack trace of the errors, re-run Maven with the -e switch.
[ERROR] Re-run Maven using the -X switch to enable full debug logging.
[ERROR] For more information about the errors and possible solutions, please read the following
[ERROR] [Help 1]
[JENKINS] Archiving <> to org.apache.commons/commons-compress/1.11-SNAPSHOT/commons-compress-1.11-SNAPSHOT.pom
Sending e-mails to:
channel stopped

To unsubscribe, e-mail:
For additional commands, e-mail:

View raw message