commons-dev mailing list archives

Site index · List index
Message view « Date » · « Thread »
Top « Date » · « Thread »
From Pascal Schumacher <pascalschumac...@gmx.net>
Subject Re: [VOTE] Release Compress 1.17 based on RC1
Date Fri, 01 Jun 2018 15:47:21 GMT
I guess the build fails on java 11 because jacoco does not support java 
11 yet, see: https://github.com/jacoco/jacoco/issues/663

Cheers,
Pascal

Am 01.06.2018 um 17:19 schrieb Gary Gregory:
> +1
>
>  From src zip file: ASC, SHA-1, SHA-256 OK.
>
> mvn apache-rat:check OK
> mvn japicmp:cmp OK
>
> mvn clean site OK
>
> Generated site RAT report OK.
> NO JApiCmp report generated for me but present on
> https://stefan.samaflost.de/staging/commons-compress-1.17/
> Other reports OK.
>
> Typos already report in release notes.
>
> Tested 'mvn clean test' OK with (mvn -version):
>
> Apache Maven 3.5.3 (3383c37e1f9e9b3bc3df5050c29c8aff9f295297;
> 2018-02-24T12:49:05-07:00)
> Maven home: C:\Java\apache-maven-3.5.3\bin\..
> Java version: *1.7.0_80*, vendor: *Oracle *Corporation
> Java home: C:\Program Files\Java\jdk1.7.0_80\jre
> Default locale: en_US, platform encoding: Cp1252
> OS name: "windows 8.1", version: "6.3", arch: "amd64", family: "windows"
>
> Apache Maven 3.5.3 (3383c37e1f9e9b3bc3df5050c29c8aff9f295297;
> 2018-02-24T12:49:05-07:00)
> Maven home: C:\Java\apache-maven-3.5.3\bin\..
> Java version: *1.8.0_172*, vendor: *Oracle *Corporation
> Java home: C:\Program Files\Java\jdk1.8.0_172\jre
> Default locale: en_US, platform encoding: Cp1252
> OS name: "windows 10", version: "10.0", arch: "amd64", family: "windows"
>
> Apache Maven 3.5.3 (3383c37e1f9e9b3bc3df5050c29c8aff9f295297;
> 2018-02-24T12:49:05-07:00)
> Maven home: C:\Java\apache-maven-3.5.3\bin\..
> Java version: *1.8.0*, vendor: *IBM* Corporation
> Java home: C:\eclipse\IBM-6.4.5\ibm_sdk80\jre
> Default locale: en_US, platform encoding: Cp1252
> OS name: "windows 10", version: "10.0", arch: "x86", family: "windows"
>
> Apache Maven 3.5.3 (3383c37e1f9e9b3bc3df5050c29c8aff9f295297;
> 2018-02-24T12:49:05-07:00)
> Maven home: C:\Java\apache-maven-3.5.3\bin\..
> Java version: *9.0.4*, vendor: *Oracle *Corporation
> Java home: C:\Program Files\Java\jdk-9.0.4
> Default locale: en_US, platform encoding: Cp1252
> OS name: "windows 10", version: "10.0", arch: "amd64", family: "windows"
>
> Apache Maven 3.5.3 (3383c37e1f9e9b3bc3df5050c29c8aff9f295297;
> 2018-02-24T12:49:05-07:00)
> Maven home: C:\Java\apache-maven-3.5.3\bin\..
> Java version: *10.0.1*, vendor: *Oracle *Corporation
> Java home: C:\Program Files\Java\jdk-10.0.1
> Default locale: en_US, platform encoding: Cp1252
> OS name: "windows 10", version: "10.0", arch: "amd64", family: "windows"
>
> FAIL:
>
> Apache Maven 3.5.3 (3383c37e1f9e9b3bc3df5050c29c8aff9f295297;
> 2018-02-24T12:49:05-07:00)
> Maven home: C:\Java\apache-maven-3.5.3\bin\..
> Java version: *11-ea*, vendor: *Oracle* Corporation
> Java home: C:\Program Files\Java\jdk-11
> Default locale: en_US, platform encoding: Cp1252
> OS name: "windows 10", version: "10.0", arch: "amd64", family: "windows"
>
> [INFO] -------------------------------------------------------
> [INFO]  T E S T S
> [INFO] -------------------------------------------------------
> [WARNING] Corrupted STDOUT by directly writing to native stream in forked
> JVM 1. See FAQ web page and the dump file
> C:\temp\rc\commons-compress-1.17-src\target\surefire-reports\2018-06-01T09-16-26_459-jvmRun1.dumpstream
> [INFO]
> [INFO] Results:
> [INFO]
> [INFO] Tests run: 0, Failures: 0, Errors: 0, Skipped: 0
> [INFO]
> [INFO]
> ------------------------------------------------------------------------
> [INFO] BUILD FAILURE
> [INFO]
> ------------------------------------------------------------------------
> [INFO] Total time: 29.645 s
> [INFO] Finished at: 2018-06-01T09:16:27-06:00
> [INFO]
> ------------------------------------------------------------------------
> [ERROR] Failed to execute goal
> org.apache.maven.plugins:maven-surefire-plugin:2.21.0:test (default-test)
> on project commons-compress: There are test failures.
> [ERROR]
> [ERROR] Please refer to
> C:\temp\rc\commons-compress-1.17-src\target\surefire-reports for the
> individual test results.
> [ERROR] Please refer to dump files (if any exist) [date]-jvmRun[N].dump,
> [date].dumpstream and [date]-jvmRun[N].dumpstream.
> [ERROR] The forked VM terminated without properly saying goodbye. VM crash
> or System.exit called?
> [ERROR] Command was cmd.exe /X /C ""C:\Program Files\Java\jdk-11\bin\java"
> -javaagent:C:\\Users\\ggregory\\.m2\\repository\\org\\jacoco\\org.jacoco.agent\\0.8.1\\org.jacoco.agent-0.8.1-runtime.jar=destfile=C:\\temp\\rc\\commons-compress-1.17-src\\target\\jacoco.exec
> -jar
> C:\Users\ggregory\AppData\Local\Temp\surefire17035750934386353788\surefirebooter16013684410808460129.jar
> C:\Users\ggregory\AppData\Local\Temp\surefire17035750934386353788
> 2018-06-01T09-16-26_459-jvmRun1 surefire785711158982866484tmp
> surefire_03368209078764932780tmp"
> [ERROR] Error occurred in starting fork, check output in log
> [ERROR] Process Exit Code: 1
> [ERROR] org.apache.maven.surefire.booter.SurefireBooterForkException: The
> forked VM terminated without properly saying goodbye. VM crash or
> System.exit called?
> [ERROR] Command was cmd.exe /X /C ""C:\Program Files\Java\jdk-11\bin\java"
> -javaagent:C:\\Users\\ggregory\\.m2\\repository\\org\\jacoco\\org.jacoco.agent\\0.8.1\\org.jacoco.agent-0.8.1-runtime.jar=destfile=C:\\temp\\rc\\commons-compress-1.17-src\\target\\jacoco.exec
> -jar
> C:\Users\ggregory\AppData\Local\Temp\surefire17035750934386353788\surefirebooter16013684410808460129.jar
> C:\Users\ggregory\AppData\Local\Temp\surefire17035750934386353788
> 2018-06-01T09-16-26_459-jvmRun1 surefire785711158982866484tmp
> surefire_03368209078764932780tmp"
> [ERROR] Error occurred in starting fork, check output in log
> [ERROR] Process Exit Code: 1
> [ERROR]         at
> org.apache.maven.plugin.surefire.booterclient.ForkStarter.fork(ForkStarter.java:671)
> [ERROR]         at
> org.apache.maven.plugin.surefire.booterclient.ForkStarter.fork(ForkStarter.java:533)
> [ERROR]         at
> org.apache.maven.plugin.surefire.booterclient.ForkStarter.run(ForkStarter.java:278)
> [ERROR]         at
> org.apache.maven.plugin.surefire.booterclient.ForkStarter.run(ForkStarter.java:244)
> [ERROR]         at
> org.apache.maven.plugin.surefire.AbstractSurefireMojo.executeProvider(AbstractSurefireMojo.java:1149)
> [ERROR]         at
> org.apache.maven.plugin.surefire.AbstractSurefireMojo.executeAfterPreconditionsChecked(AbstractSurefireMojo.java:978)
> [ERROR]         at
> org.apache.maven.plugin.surefire.AbstractSurefireMojo.execute(AbstractSurefireMojo.java:854)
> [ERROR]         at
> org.apache.maven.plugin.DefaultBuildPluginManager.executeMojo(DefaultBuildPluginManager.java:137)
> [ERROR]         at
> org.apache.maven.lifecycle.internal.MojoExecutor.execute(MojoExecutor.java:208)
> [ERROR]         at
> org.apache.maven.lifecycle.internal.MojoExecutor.execute(MojoExecutor.java:154)
> [ERROR]         at
> org.apache.maven.lifecycle.internal.MojoExecutor.execute(MojoExecutor.java:146)
> [ERROR]         at
> org.apache.maven.lifecycle.internal.LifecycleModuleBuilder.buildProject(LifecycleModuleBuilder.java:117)
> [ERROR]         at
> org.apache.maven.lifecycle.internal.LifecycleModuleBuilder.buildProject(LifecycleModuleBuilder.java:81)
> [ERROR]         at
> org.apache.maven.lifecycle.internal.builder.singlethreaded.SingleThreadedBuilder.build(SingleThreadedBuilder.java:56)
> [ERROR]         at
> org.apache.maven.lifecycle.internal.LifecycleStarter.execute(LifecycleStarter.java:128)
> [ERROR]         at
> org.apache.maven.DefaultMaven.doExecute(DefaultMaven.java:305)
> [ERROR]         at
> org.apache.maven.DefaultMaven.doExecute(DefaultMaven.java:192)
> [ERROR]         at
> org.apache.maven.DefaultMaven.execute(DefaultMaven.java:105)
> [ERROR]         at org.apache.maven.cli.MavenCli.execute(MavenCli.java:956)
> [ERROR]         at org.apache.maven.cli.MavenCli.doMain(MavenCli.java:290)
> [ERROR]         at org.apache.maven.cli.MavenCli.main(MavenCli.java:194)
> [ERROR]         at
> java.base/jdk.internal.reflect.NativeMethodAccessorImpl.invoke0(Native
> Method)
> [ERROR]         at
> java.base/jdk.internal.reflect.NativeMethodAccessorImpl.invoke(NativeMethodAccessorImpl.java:62)
> [ERROR]         at
> java.base/jdk.internal.reflect.DelegatingMethodAccessorImpl.invoke(DelegatingMethodAccessorImpl.java:43)
> [ERROR]         at
> java.base/java.lang.reflect.Method.invoke(Method.java:566)
> [ERROR]         at
> org.codehaus.plexus.classworlds.launcher.Launcher.launchEnhanced(Launcher.java:289)
> [ERROR]         at
> org.codehaus.plexus.classworlds.launcher.Launcher.launch(Launcher.java:229)
> [ERROR]         at
> org.codehaus.plexus.classworlds.launcher.Launcher.mainWithExitCode(Launcher.java:415)
> [ERROR]         at
> org.codehaus.plexus.classworlds.launcher.Launcher.main(Launcher.java:356)
> [ERROR]
> [ERROR] -> [Help 1]
> [ERROR]
> [ERROR] To see the full stack trace of the errors, re-run Maven with the -e
> switch.
> [ERROR] Re-run Maven using the -X switch to enable full debug logging.
> [ERROR]
> [ERROR] For more information about the errors and possible solutions,
> please read the following articles:
> [ERROR] [Help 1]
> http://cwiki.apache.org/confluence/display/MAVEN/MojoExecutionException
>
> Gary
>
> On Thu, May 31, 2018 at 6:57 AM, Stefan Bodewig <bodewig@apache.org> wrote:
>
>> Hi all,
>>
>> I would like to release Compress 1.17.
>>
>> Compress 1.17 RC1 is available for review here:
>>      https://dist.apache.org/repos/dist/dev/commons/compress/ (svn
>> revision 27187)
>>
>> The tag is here:
>>      tag 54e86f951 on commit d9993f8f
>>      https://git-wip-us.apache.org/repos/asf?p=commons-compress.
>> git;a=commit;h=d9993f8ff119d4a3eb1259b460c53401f619d655
>>
>> Maven artifacts are here:
>>      https://repository.apache.org/content/repositories/
>> orgapachecommons-1328/org/apache/commons/commons-compress/1.17/
>>
>> These are the Maven artifacts and their SHA256 hashes
>>
>> 474c20609032e7f815ef534cd8174d2e400d9a8d  commons-compress-1.17.jar
>> b9225416371a8cd195f344f081f68862cb7f69a3  commons-compress-1.17-javadoc.
>> jar
>> 9d064d7d42ee1d04ae07ad23025b4f9616652eed  commons-compress-1.17-sources.
>> jar
>> 3a2c468a8723aebc196ddf234dade6fed9405b50  commons-compress-1.17-tests.jar
>> 45195f4e822582297aff2e9c6cb9e6cef4c52625  commons-compress-1.17-test-
>> sources.jar
>> 55c712b1d481d454b191f6aa66ce44e16cb876dd  commons-compress-1.17.pom
>>
>> I have tested this with JDK 8 using Maven 3.5.0.
>>
>> Details of changes since 1.16 are in the release notes:
>>      https://dist.apache.org/repos/dist/dev/commons/compress/
>> RELEASE-NOTES.txt
>>      https://stefan.samaflost.de/staging/commons-compress-1.17/
>> changes-report.html
>>
>> Site:
>>      https://stefan.samaflost.de/staging/commons-compress-1.17/
>>
>>      as usual this is not the site I'm going to publish after the
>>      release, I'll re-create the site when the release date is
>>      clear. The download link and 1.17 javadoc link won't work right
>>      now.
>>
>> japicmp Report (compared to 1.16):
>>      https://stefan.samaflost.de/staging/commons-compress-1.17/japicmp.html
>>
>> RAT Report:
>>      https://stefan.samaflost.de/staging/commons-compress-1.17/
>> rat-report.html
>>
>> KEYS:
>>    https://www.apache.org/dist/commons/KEYS
>>
>> Please review the release candidate and vote.
>> This vote will close no sooner that 72 hours from now,
>> i.e. sometime after 14:00 UTC 03-June 2018
>>
>>    [ ] +1 Release these artifacts
>>    [ ] +0 OK, but...
>>    [ ] -0 OK, but really should fix...
>>    [ ] -1 I oppose this release because...
>>
>> Thanks!
>>
>>          Stefan
>>
>> ---------------------------------------------------------------------
>> To unsubscribe, e-mail: dev-unsubscribe@commons.apache.org
>> For additional commands, e-mail: dev-help@commons.apache.org
>>
>>


---------------------------------------------------------------------
To unsubscribe, e-mail: dev-unsubscribe@commons.apache.org
For additional commands, e-mail: dev-help@commons.apache.org


Mime
View raw message