commons-dev mailing list archives

Site index · List index
Message view « Date » · « Thread »
Top « Date » · « Thread »
From Gary Gregory <garydgreg...@gmail.com>
Subject [configuration]
Date Tue, 21 May 2019 23:53:08 GMT
Hi All:

Has anyone seen this:

[INFO] Generating "JDepend" report       ---
jdepend-maven-plugin:2.0:generate-no-fork
[INFO]
------------------------------------------------------------------------
[INFO] BUILD FAILURE
[INFO]
------------------------------------------------------------------------
[INFO] Total time:  02:40 min
[INFO] Finished at: 2019-05-21T19:50:56-04:00
[INFO]
------------------------------------------------------------------------
[ERROR] Failed to execute goal
org.apache.maven.plugins:maven-site-plugin:3.7.1:site (default-site) on
project commons-configuration2: Error during site generation:
C:\git\commons-configuration\target\site\org.apache.commons_commons-configuration2_2.4C:\git\commons-configuration\target\commons-configuration2-2.5-SNAPSHOT.jar_output.html
(The filename, directory name, or volume label syntax is incorrect) ->
[Help 1]
org.apache.maven.lifecycle.LifecycleExecutionException: Failed to execute
goal org.apache.maven.plugins:maven-site-plugin:3.7.1:site (default-site)
on project commons-configuration2: Error during site generation
    at org.apache.maven.lifecycle.internal.MojoExecutor.execute
(MojoExecutor.java:215)
    at org.apache.maven.lifecycle.internal.MojoExecutor.execute
(MojoExecutor.java:156)
    at org.apache.maven.lifecycle.internal.MojoExecutor.execute
(MojoExecutor.java:148)
    at
org.apache.maven.lifecycle.internal.LifecycleModuleBuilder.buildProject
(LifecycleModuleBuilder.java:117)
    at
org.apache.maven.lifecycle.internal.LifecycleModuleBuilder.buildProject
(LifecycleModuleBuilder.java:81)
    at
org.apache.maven.lifecycle.internal.builder.singlethreaded.SingleThreadedBuilder.build
(SingleThreadedBuilder.java:56)
    at org.apache.maven.lifecycle.internal.LifecycleStarter.execute
(LifecycleStarter.java:128)
    at org.apache.maven.DefaultMaven.doExecute (DefaultMaven.java:305)
    at org.apache.maven.DefaultMaven.doExecute (DefaultMaven.java:192)
    at org.apache.maven.DefaultMaven.execute (DefaultMaven.java:105)
    at org.apache.maven.cli.MavenCli.execute (MavenCli.java:956)
    at org.apache.maven.cli.MavenCli.doMain (MavenCli.java:288)
    at org.apache.maven.cli.MavenCli.main (MavenCli.java:192)
    at sun.reflect.NativeMethodAccessorImpl.invoke0 (Native Method)
    at sun.reflect.NativeMethodAccessorImpl.invoke
(NativeMethodAccessorImpl.java:62)
    at sun.reflect.DelegatingMethodAccessorImpl.invoke
(DelegatingMethodAccessorImpl.java:43)
    at java.lang.reflect.Method.invoke (Method.java:498)
    at org.codehaus.plexus.classworlds.launcher.Launcher.launchEnhanced
(Launcher.java:282)
    at org.codehaus.plexus.classworlds.launcher.Launcher.launch
(Launcher.java:225)
    at org.codehaus.plexus.classworlds.launcher.Launcher.mainWithExitCode
(Launcher.java:406)
    at org.codehaus.plexus.classworlds.launcher.Launcher.main
(Launcher.java:347)
Caused by: org.apache.maven.plugin.MojoExecutionException: Error during
site generation
    at org.apache.maven.plugins.site.render.SiteMojo.execute
(SiteMojo.java:161)
    at org.apache.maven.plugin.DefaultBuildPluginManager.executeMojo
(DefaultBuildPluginManager.java:137)
    at org.apache.maven.lifecycle.internal.MojoExecutor.execute
(MojoExecutor.java:210)
    at org.apache.maven.lifecycle.internal.MojoExecutor.execute
(MojoExecutor.java:156)
    at org.apache.maven.lifecycle.internal.MojoExecutor.execute
(MojoExecutor.java:148)
    at
org.apache.maven.lifecycle.internal.LifecycleModuleBuilder.buildProject
(LifecycleModuleBuilder.java:117)
    at
org.apache.maven.lifecycle.internal.LifecycleModuleBuilder.buildProject
(LifecycleModuleBuilder.java:81)
    at
org.apache.maven.lifecycle.internal.builder.singlethreaded.SingleThreadedBuilder.build
(SingleThreadedBuilder.java:56)
    at org.apache.maven.lifecycle.internal.LifecycleStarter.execute
(LifecycleStarter.java:128)
    at org.apache.maven.DefaultMaven.doExecute (DefaultMaven.java:305)
    at org.apache.maven.DefaultMaven.doExecute (DefaultMaven.java:192)
    at org.apache.maven.DefaultMaven.execute (DefaultMaven.java:105)
    at org.apache.maven.cli.MavenCli.execute (MavenCli.java:956)
    at org.apache.maven.cli.MavenCli.doMain (MavenCli.java:288)
    at org.apache.maven.cli.MavenCli.main (MavenCli.java:192)
    at sun.reflect.NativeMethodAccessorImpl.invoke0 (Native Method)
    at sun.reflect.NativeMethodAccessorImpl.invoke
(NativeMethodAccessorImpl.java:62)
    at sun.reflect.DelegatingMethodAccessorImpl.invoke
(DelegatingMethodAccessorImpl.java:43)
    at java.lang.reflect.Method.invoke (Method.java:498)
    at org.codehaus.plexus.classworlds.launcher.Launcher.launchEnhanced
(Launcher.java:282)
    at org.codehaus.plexus.classworlds.launcher.Launcher.launch
(Launcher.java:225)
    at org.codehaus.plexus.classworlds.launcher.Launcher.mainWithExitCode
(Launcher.java:406)
    at org.codehaus.plexus.classworlds.launcher.Launcher.main
(Launcher.java:347)
Caused by: java.io.FileNotFoundException:
C:\git\commons-configuration\target\site\org.apache.commons_commons-configuration2_2.4C:\git\commons-configuration\target\commons-configuration2-2.5-SNAPSHOT.jar_output.html
(The filename, directory name, or volume label syntax is incorrect)
    at java.io.FileOutputStream.open0 (Native Method)
    at java.io.FileOutputStream.open (FileOutputStream.java:270)
    at java.io.FileOutputStream.<init> (FileOutputStream.java:213)
    at java.io.FileOutputStream.<init> (FileOutputStream.java:162)
    at org.codehaus.plexus.util.WriterFactory.newWriter
(WriterFactory.java:175)
    at org.apache.maven.doxia.siterenderer.DefaultSiteRenderer.render
(DefaultSiteRenderer.java:347)
    at org.apache.maven.plugins.site.render.SiteMojo.renderLocale
(SiteMojo.java:198)
    at org.apache.maven.plugins.site.render.SiteMojo.execute
(SiteMojo.java:147)
    at org.apache.maven.plugin.DefaultBuildPluginManager.executeMojo
(DefaultBuildPluginManager.java:137)
    at org.apache.maven.lifecycle.internal.MojoExecutor.execute
(MojoExecutor.java:210)
    at org.apache.maven.lifecycle.internal.MojoExecutor.execute
(MojoExecutor.java:156)
    at org.apache.maven.lifecycle.internal.MojoExecutor.execute
(MojoExecutor.java:148)
    at
org.apache.maven.lifecycle.internal.LifecycleModuleBuilder.buildProject
(LifecycleModuleBuilder.java:117)
    at
org.apache.maven.lifecycle.internal.LifecycleModuleBuilder.buildProject
(LifecycleModuleBuilder.java:81)
    at
org.apache.maven.lifecycle.internal.builder.singlethreaded.SingleThreadedBuilder.build
(SingleThreadedBuilder.java:56)
    at org.apache.maven.lifecycle.internal.LifecycleStarter.execute
(LifecycleStarter.java:128)
    at org.apache.maven.DefaultMaven.doExecute (DefaultMaven.java:305)
    at org.apache.maven.DefaultMaven.doExecute (DefaultMaven.java:192)
    at org.apache.maven.DefaultMaven.execute (DefaultMaven.java:105)
    at org.apache.maven.cli.MavenCli.execute (MavenCli.java:956)
    at org.apache.maven.cli.MavenCli.doMain (MavenCli.java:288)
    at org.apache.maven.cli.MavenCli.main (MavenCli.java:192)
    at sun.reflect.NativeMethodAccessorImpl.invoke0 (Native Method)
    at sun.reflect.NativeMethodAccessorImpl.invoke
(NativeMethodAccessorImpl.java:62)
    at sun.reflect.DelegatingMethodAccessorImpl.invoke
(DelegatingMethodAccessorImpl.java:43)
    at java.lang.reflect.Method.invoke (Method.java:498)
    at org.codehaus.plexus.classworlds.launcher.Launcher.launchEnhanced
(Launcher.java:282)
    at org.codehaus.plexus.classworlds.launcher.Launcher.launch
(Launcher.java:225)
    at org.codehaus.plexus.classworlds.launcher.Launcher.mainWithExitCode
(Launcher.java:406)
    at org.codehaus.plexus.classworlds.launcher.Launcher.main
(Launcher.java:347)
[ERROR]
[ERROR] Re-run Maven using the -X switch to enable full debug logging.
[ERROR]
[ERROR] For more information about the errors and possible solutions,
please read the following articles:
[ERROR] [Help 1]
http://cwiki.apache.org/confluence/display/MAVEN/MojoExecutionException

I get it when I run:

mvn install site -DskipTests -Ddoclint=none -e

Using:

Apache Maven 3.6.1 (d66c9c0b3152b2e69ee9bac180bb8fcc8e6af555;
2019-04-04T15:00:29-04:00)
Maven home: C:\Java\apache-maven-3.6.1\bin\..
Java version: 1.8.0_212, vendor: Oracle Corporation, runtime: C:\Program
Files\Java\jdk1.8.0_212\jre
Default locale: en_US, platform encoding: Cp1252
OS name: "windows 10", version: "10.0", arch: "amd64", family: "windows"

Gary

Mime
  • Unnamed multipart/alternative (inline, None, 0 bytes)
View raw message