commons-issues mailing list archives

Site index · List index
Message view « Date » · « Thread »
Top « Date » · « Thread »
From "Emmanuel Bourg (JIRA)" <j...@apache.org>
Subject [jira] [Created] (EXEC-86) Test failure with Java 8
Date Fri, 06 Jun 2014 09:37:01 GMT
Emmanuel Bourg created EXEC-86:
----------------------------------

             Summary: Test failure with Java 8
                 Key: EXEC-86
                 URL: https://issues.apache.org/jira/browse/EXEC-86
             Project: Commons Exec
          Issue Type: Bug
    Affects Versions: 1.2
            Reporter: Emmanuel Bourg
             Fix For: 1.3


Exec57Test.testExec_57 fails on Linux with OpenJDK 8u5:

{code}
-------------------------------------------------------------------------------
Test set: org.apache.commons.exec.issues.Exec57Test
-------------------------------------------------------------------------------
Tests run: 1, Failures: 1, Errors: 0, Skipped: 0, Time elapsed: 0.002 sec <<< FAILURE!
- in org.apache.commons.exec.issues.Exec57Test
testExec_57(org.apache.commons.exec.issues.Exec57Test)  Time elapsed: 0.001 sec  <<<
FAILURE!
java.lang.AssertionError: Expecting an ExecuteException
        at org.junit.Assert.fail(Assert.java:88)
        at org.apache.commons.exec.issues.Exec57Test.testExec_57(Exec57Test.java:82)

{code}



--
This message was sent by Atlassian JIRA
(v6.2#6252)

Mime
View raw message