cordova-issues mailing list archives

Site index · List index
Message view « Date » · « Thread »
Top « Date » · « Thread »
From "Joe Bowser (JIRA)" <j...@apache.org>
Subject [jira] [Comment Edited] (CB-11943) :CordovaLib:processDebugResources FAILED
Date Mon, 03 Oct 2016 18:20:20 GMT

    [ https://issues.apache.org/jira/browse/CB-11943?page=com.atlassian.jira.plugin.system.issuetabpanels:comment-tabpanel&focusedCommentId=15543052#comment-15543052
] 

Joe Bowser edited comment on CB-11943 at 10/3/16 6:20 PM:
----------------------------------------------------------

What version of Cordova Android are you attempting to build? Have you tried doing a clean
and building again? We can't reproduce the error on this end without knowing what you were
trying to do.


was (Author: bowserj):
What version of Cordova are you attempting to build? Have you tried doing a clean and building
again? We can't reproduce the error on this end without knowing what you were trying to do.

> :CordovaLib:processDebugResources FAILED
> ----------------------------------------
>
>                 Key: CB-11943
>                 URL: https://issues.apache.org/jira/browse/CB-11943
>             Project: Apache Cordova
>          Issue Type: Bug
>          Components: Android, App Hello World, CordovaLib
>    Affects Versions: 6.3.1
>         Environment: Window 10 +ionic
>            Reporter: Gourav
>
> :CordovaLib:processDebugResources FAILED
> 15:56:32.082 [INFO] [org.gradle.execution.taskgraph.AbstractTaskPlanExecutor] :CordovaLib:processDebugResources
(Thread[main,5,main]) completed. Took 2.964 secs.
> 15:56:32.082 [DEBUG] [org.gradle.execution.taskgraph.AbstractTaskPlanExecutor] Task worker
[Thread[main,5,main]] finished, busy: 3.314 secs, idle: 0.505 secs
> 15:56:32.092 [ERROR] [org.gradle.BuildExceptionReporter]
> 15:56:32.092 [ERROR] [org.gradle.BuildExceptionReporter] FAILURE: Build failed with an
exception.
> 15:56:32.092 [ERROR] [org.gradle.BuildExceptionReporter]
> 15:56:32.092 [ERROR] [org.gradle.BuildExceptionReporter] * What went wrong:
> 15:56:32.092 [ERROR] [org.gradle.BuildExceptionReporter] Execution failed for task ':CordovaLib:processDebugResources'.
> 15:56:32.092 [ERROR] [org.gradle.BuildExceptionReporter] > com.android.ide.common.process.ProcessException:
org.gradle.process.internal.ExecException: Process 'command 'C:\Users\niitadmin\AppData\Local\Android\sdk\build-tools\24.0.3\aapt.exe''
finished with non-zero exit value -1073741819
> 15:56:32.092 [ERROR] [org.gradle.BuildExceptionReporter]
> 15:56:32.092 [ERROR] [org.gradle.BuildExceptionReporter] * Try:
> 15:56:32.092 [ERROR] [org.gradle.BuildExceptionReporter] Run with --stacktrace option
to get the stack trace.
> 15:56:32.093 [LIFECYCLE] [org.gradle.BuildResultLogger]
> 15:56:32.093 [LIFECYCLE] [org.gradle.BuildResAultLogger] BUILD FAILED



--
This message was sent by Atlassian JIRA
(v6.3.4#6332)

---------------------------------------------------------------------
To unsubscribe, e-mail: issues-unsubscribe@cordova.apache.org
For additional commands, e-mail: issues-help@cordova.apache.org


Mime
View raw message