cxf-notifications mailing list archives

Site index · List index
Message view « Date » · « Thread »
Top « Date » · « Thread »
From "Continuum@vmbuild.apache.org" <cxf-notificati...@incubator.apache.org>
Subject [continuum] BUILD FAILURE: Apache CXF
Date Thu, 07 Jun 2007 11:05:47 GMT
Online report : http://vmbuild.apache.org/continuum/servlet/continuum/target/ProjectBuild.vm/view/ProjectBuild/id/216/buildId/175140
Build statistics:
  State: Failed
  Previous State: Failed
  Started at: Thu, 7 Jun 2007 03:29:51 -0700
  Finished at: Thu, 7 Jun 2007 04:05:44 -0700
  Total time: 35m 52s
  Build Trigger: Schedule
  Exit code: 1
  Building machine hostname: vmbuild.apache.org
  Operating system : Linux(unknown)
  Java version : 1.5.0_06(Sun Microsystems Inc.)

Changes
         ema          Fixed issue CXF-704 and CXF-705
             /incubator/cxf/trunk/api/src/main/java/org/apache/cxf/tools/common/ToolConstants.java
            /incubator/cxf/trunk/tools/javato/src/main/java/org/apache/cxf/tools/java2wsdl/generator/wsdl11/BeanGenerator.java
            /incubator/cxf/trunk/tools/javato/src/main/java/org/apache/cxf/tools/java2wsdl/generator/wsdl11/FaultBeanGenerator.java
            /incubator/cxf/trunk/tools/javato/src/main/java/org/apache/cxf/tools/java2wsdl/processor/internal/jaxws/Wrapper.java
            /incubator/cxf/trunk/tools/javato/src/test/java/org/apache/cxf/tools/fortest/Hello.java
            /incubator/cxf/trunk/tools/javato/src/test/java/org/apache/cxf/tools/java2wsdl/generator/wsdl11/FaultBeanGeneratorTest.java
            /incubator/cxf/trunk/tools/javato/src/test/java/org/apache/cxf/tools/java2wsdl/generator/wsdl11/WrapperBeanGeneratorTest.java
            /incubator/cxf/trunk/tools/javato/src/test/java/org/apache/cxf/tools/java2wsdl/processor/JavaToProcessorTest.java
           ningjiang          CXF-706 applied Polar's patch for https configuration
             /incubator/cxf/trunk/common/schemas/src/main/resources/schemas/configuration/security.xsd
            /incubator/cxf/trunk/parent/pom.xml
            /incubator/cxf/trunk/rt/frontend/simple/src/main/java/org/apache/cxf/service/factory/ReflectionServiceFactoryBean.java
            /incubator/cxf/trunk/rt/transports/http/src/main/java/org/apache/cxf/configuration/jsse/spring/TLSClientParametersConfig.java
            /incubator/cxf/trunk/rt/transports/http/src/main/java/org/apache/cxf/configuration/jsse/spring/TLSParameterJaxBUtils.java
            /incubator/cxf/trunk/rt/transports/http/src/main/java/org/apache/cxf/configuration/jsse/spring/TLSServerParametersConfig.java
            /incubator/cxf/trunk/rt/transports/http/src/main/java/org/apache/cxf/transport/http/AbstractHTTPDestination.java
            /incubator/cxf/trunk/rt/transports/http/src/main/java/org/apache/cxf/transport/http/AbstractHTTPTransportFactory.java
            /incubator/cxf/trunk/rt/transports/http/src/main/java/org/apache/cxf/transport/http/HTTPConduit.java
            /incubator/cxf/trunk/rt/transports/http/src/main/java/org/apache/cxf/transport/http/spring/HttpConduitBeanDefinitionParser.java
            /incubator/cxf/trunk/rt/transports/http/src/main/java/org/apache/cxf/transport/http/spring/HttpDestinationBeanDefinitionParser.java
            /incubator/cxf/trunk/rt/transports/http/src/main/java/org/apache/cxf/transport/https/HttpsURLConnectionFactory.java
            /incubator/cxf/trunk/rt/transports/http/src/main/resources/META-INF/spring.schemas
            /incubator/cxf/trunk/rt/transports/http/src/main/resources/schemas/configuration/http-conf.xsd
            /incubator/cxf/trunk/rt/transports/http/src/main/resources/schemas/configuration/http-listener.xsd
            /incubator/cxf/trunk/rt/transports/http/src/main/resources/schemas/wsdl/http-conf.xsd
            /incubator/cxf/trunk/rt/transports/http/src/test/java/org/apache/cxf/transport/http/HTTPConduitURLConnectionTest.java
            /incubator/cxf/trunk/rt/transports/http/src/test/java/org/apache/cxf/transport/https/HttpsURLConnectionFactoryTest.java
            /incubator/cxf/trunk/rt/transports/http/src/test/java/org/apache/cxf/transport/https/TestHttpsURLConnection.java
            /incubator/cxf/trunk/rt/transports/http/src/test/java/org/apache/cxf/transport/https/TestLogHandler.java
            /incubator/cxf/trunk/rt/transports/http/src/test/java/org/apache/cxf/transport/https/resources/abigcompany_ca.pem
            /incubator/cxf/trunk/rt/transports/http-jetty/pom.xml
            /incubator/cxf/trunk/rt/transports/http-jetty/src/main/java/org/apache/cxf/transport/http_jetty/JettyHTTPDestination.java
            /incubator/cxf/trunk/rt/transports/http-jetty/src/main/java/org/apache/cxf/transport/http_jetty/JettyHTTPServerEngine.java
            /incubator/cxf/trunk/rt/transports/http-jetty/src/main/java/org/apache/cxf/transport/http_jetty/JettyHTTPServerEngineFactory.java
            /incubator/cxf/trunk/rt/transports/http-jetty/src/main/java/org/apache/cxf/transport/http_jetty/JettyHTTPTransportFactory.java
            /incubator/cxf/trunk/rt/transports/http-jetty/src/main/java/org/apache/cxf/transport/http_jetty/ThreadingParameters.java
            /incubator/cxf/trunk/rt/transports/http-jetty/src/main/java/org/apache/cxf/transport/http_jetty/spring/JettyHTTPServerEngineFactoryBeanDefinitionParser.java
            /incubator/cxf/trunk/rt/transports/http-jetty/src/main/java/org/apache/cxf/transport/http_jetty/spring/JettyHTTPServerEngineFactoryConfig.java
            /incubator/cxf/trunk/rt/transports/http-jetty/src/main/java/org/apache/cxf/transport/http_jetty/spring/ListenerBeanDefinitionParser.java
            /incubator/cxf/trunk/rt/transports/http-jetty/src/main/java/org/apache/cxf/transport/http_jetty/spring/NamespaceHandler.java
            /incubator/cxf/trunk/rt/transports/http-jetty/src/main/java/org/apache/cxf/transport/https_jetty/CXFJettySslSocketConnector.java
            /incubator/cxf/trunk/rt/transports/http-jetty/src/main/java/org/apache/cxf/transport/https_jetty/JettySslConnectorFactory.java
            /incubator/cxf/trunk/rt/transports/http-jetty/src/main/resources/META-INF/spring.handlers
            /incubator/cxf/trunk/rt/transports/http-jetty/src/main/resources/META-INF/spring.schemas
            /incubator/cxf/trunk/rt/transports/http-jetty/src/main/resources/catalog.cat
            /incubator/cxf/trunk/rt/transports/http-jetty/src/main/resources/schemas
            /incubator/cxf/trunk/rt/transports/http-jetty/src/main/resources/schemas/configuration
            /incubator/cxf/trunk/rt/transports/http-jetty/src/main/resources/schemas/configuration/http-jetty.xsd
            /incubator/cxf/trunk/rt/transports/http-jetty/src/test/java/org/apache/cxf/transport/http_jetty/JettyHTTPDestinationTest.java
            /incubator/cxf/trunk/rt/transports/http-jetty/src/test/java/org/apache/cxf/transport/http_jetty/JettyHTTPServerEngineTest.java
            /incubator/cxf/trunk/rt/transports/http-jetty/src/test/java/org/apache/cxf/transport/http_jetty/spring/ApplicationContextTest.java
            /incubator/cxf/trunk/rt/transports/http-jetty/src/test/java/org/apache/cxf/transport/http_jetty/spring/BeanDefinitionParsersTest.java
            /incubator/cxf/trunk/rt/transports/http-jetty/src/test/java/org/apache/cxf/transport/http_jetty/spring/beans.xml
            /incubator/cxf/trunk/rt/transports/http-jetty/src/test/java/org/apache/cxf/transport/http_jetty/spring/listener.xml
            /incubator/cxf/trunk/rt/transports/http-jetty/src/test/java/org/apache/cxf/transport/http_jetty/spring/serverenginefactory.xml
            /incubator/cxf/trunk/rt/transports/http-jetty/src/test/java/org/apache/cxf/transport/https_jetty/JettySslConnectorFactoryTest.java
            /incubator/cxf/trunk/systests/src/test/java/org/apache/cxf/systest/http/HTTPConduit2Test.java
            /incubator/cxf/trunk/systests/src/test/java/org/apache/cxf/systest/http/HTTPConduitTest.java
            /incubator/cxf/trunk/systests/src/test/java/org/apache/cxf/systest/http/resources/Abost-2.cxf
            /incubator/cxf/trunk/systests/src/test/java/org/apache/cxf/systest/http/resources/Abost.cxf
            /incubator/cxf/trunk/systests/src/test/java/org/apache/cxf/systest/http/resources/Bethal-2.cxf
            /incubator/cxf/trunk/systests/src/test/java/org/apache/cxf/systest/http/resources/Bethal.cxf
            /incubator/cxf/trunk/systests/src/test/java/org/apache/cxf/systest/http/resources/BethalClientConfig.cxf
            /incubator/cxf/trunk/systests/src/test/java/org/apache/cxf/systest/http/resources/Gordy-2.cxf
            /incubator/cxf/trunk/systests/src/test/java/org/apache/cxf/systest/http/resources/Gordy.cxf
            /incubator/cxf/trunk/systests/src/test/java/org/apache/cxf/systest/http/resources/Http2HttpLoopRedirectFail-2.cxf
            /incubator/cxf/trunk/systests/src/test/java/org/apache/cxf/systest/http/resources/Http2HttpLoopRedirectFail.cxf
            /incubator/cxf/trunk/systests/src/test/java/org/apache/cxf/systest/http/resources/Http2HttpRedirect-2.cxf
            /incubator/cxf/trunk/systests/src/test/java/org/apache/cxf/systest/http/resources/Http2HttpRedirect.cxf
            /incubator/cxf/trunk/systests/src/test/java/org/apache/cxf/systest/http/resources/Hurlon-2.cxf
            /incubator/cxf/trunk/systests/src/test/java/org/apache/cxf/systest/http/resources/Hurlon.cxf
            /incubator/cxf/trunk/systests/src/test/java/org/apache/cxf/systest/http/resources/Morpit-2.cxf
            /incubator/cxf/trunk/systests/src/test/java/org/apache/cxf/systest/http/resources/Morpit.cxf
            /incubator/cxf/trunk/systests/src/test/java/org/apache/cxf/systest/http/resources/Mortimer-2.cxf
            /incubator/cxf/trunk/systests/src/test/java/org/apache/cxf/systest/http/resources/Mortimer.cxf
            /incubator/cxf/trunk/systests/src/test/java/org/apache/cxf/systest/http/resources/Poltim-2.cxf
            /incubator/cxf/trunk/systests/src/test/java/org/apache/cxf/systest/http/resources/Poltim.cxf
            /incubator/cxf/trunk/systests/src/test/java/org/apache/cxf/systest/http/resources/Rethwel-2.cxf
            /incubator/cxf/trunk/systests/src/test/java/org/apache/cxf/systest/http/resources/Rethwel.cxf
            /incubator/cxf/trunk/systests/src/test/java/org/apache/cxf/systest/http/resources/Tarpin-2.cxf
            /incubator/cxf/trunk/systests/src/test/java/org/apache/cxf/systest/http/resources/Tarpin.cxf
            /incubator/cxf/trunk/systests/src/test/java/org/apache/cxf/systest/http/resources/client1.xml
            /incubator/cxf/trunk/tools/wsdlto/test/pom.xml
        
****************************************************************************
Output:
****************************************************************************
[INFO] Scanning for projects...
[INFO] Reactor build order: 
[INFO]   Apache CXF
[INFO]   Apache CXF Buildtools
[INFO]   Apache CXF Parent
[INFO]   Apache CXF Common Utilities
[INFO]   Apache CXF Common XSD2Java  Plugins
[INFO]   Apache CXF Common Schemas
[INFO]   Apache CXF XJC Default Value Plugin
[INFO]   Apache CXF XJC Default Value Plugin Tests
[INFO]   Apache CXF XJC Plugins
[INFO]   Apache CXF Common
[INFO]   Apache CXF API
[INFO]   Apache CXF Command Line Tools Common
[INFO]   Apache CXF Runtime Core
[INFO]   Apache CXF Command Line Tools Validator
[INFO]   Apache CXF Command Line Tools WSDLTo Core
[INFO]   Apache CXF Command Line Tools WSDLTo JAXWS Frontend
[INFO]   Apache CXF Command Line Tools WSDLTo JAXB Databinding
[INFO]   Apache CXF Code Generation Maven2 Plugins
[INFO]   Apache CXF Test Utilities
[INFO]   Apache CXF Runtime JAXB DataBinding
[INFO]   Apache CXF Runtime SOAP Binding
[INFO]   Apache CXF Runtime Management
[INFO]   Apache CXF Runtime JMS Transport
[INFO]   Apache CXF Runtime XML Binding
[INFO]   Apache CXF Command Line Tools WSDLTo Test
[INFO]   Apache CXF Command Line Tools WSDLTo Misctools
[INFO]   Apache CXF Command Line Tools
[INFO]   Apache CXF Command Line Tools WSDLTo
[INFO]   Apache CXF Runtime Local transport
[INFO]   Apache CXF Runtime Simple Frontend
[INFO]   Apache CXF Runtime JAX-WS Frontend
[INFO]   Apache CXF Command Line Tools JavaTo
[INFO]   Apache CXF WSDL Generation Maven2 Plugin
[INFO]   Apache CXF Runtime HTTP transport
[INFO]   Apache CXF Runtime HTTP Jetty transport
[INFO]   Apache CXF Runtime Aegis Databinding
[INFO]   Apache CXF Runtime HTTP Binding
[INFO]   Apache CXF Runtime Object Binding
[INFO]   Apache CXF Colocated Binding
[INFO]   Apache CXF Runtime JBI Binding
[INFO]   Apache CXF Runtime
[INFO]   Apache CXF Runtime Bindings
[INFO]   Apache CXF Runtime JavaScript Frontend
[INFO]   Apache CXF Runtime JBI transport
[INFO]   Apache CXF Runtime WS Policy
[INFO]   Apache CXF Runtime WS Addressing
[INFO]   Apache CXF Runtime WS Reliable Messaging
[INFO]   Apache CXF Runtime WS Security
[INFO]   Apache CXF JBI Integration
[INFO]   Apache CXF JCA Connection
[INFO]   Apache CXF Integration
[INFO]   Apache CXF System Tests
[INFO] ----------------------------------------------------------------------------
[INFO] Building Apache CXF
[INFO]    task-segment: [clean, install]
[INFO] ----------------------------------------------------------------------------
[INFO] [clean:clean]
[INFO] Deleting directory /x1/continuum/working-directory/216/target
[INFO] Deleting directory /x1/continuum/working-directory/216/target/classes
[INFO] Deleting directory /x1/continuum/working-directory/216/target/test-classes
[INFO] [site:attach-descriptor]
[INFO] [install:install]
[INFO] Installing /x1/continuum/working-directory/216/pom.xml to /home/continuum/.m2/repository/org/apache/cxf/cxf/2.0-incubator-SNAPSHOT/cxf-2.0-incubator-SNAPSHOT.pom
[INFO] ----------------------------------------------------------------------------
[INFO] Building Apache CXF Buildtools
[INFO]    task-segment: [clean, install]
[INFO] ----------------------------------------------------------------------------
[INFO] [clean:clean]
[INFO] Deleting directory /x1/continuum/working-directory/216/buildtools/target
[INFO] Deleting directory /x1/continuum/working-directory/216/buildtools/target/classes
[INFO] Deleting directory /x1/continuum/working-directory/216/buildtools/target/test-classes
[INFO] [resources:resources]
[INFO] Using default encoding to copy filtered resources.
[INFO] [compiler:compile]
[INFO] Compiling 1 source file to /x1/continuum/working-directory/216/buildtools/target/classes
[INFO] [resources:testResources]
[INFO] Using default encoding to copy filtered resources.
[INFO] [compiler:testCompile]
[INFO] Not compiling test sources
[INFO] [surefire:test]
[INFO] Tests are skipped.
[INFO] [jar:jar]
[INFO] Building jar: /x1/continuum/working-directory/216/buildtools/target/cxf-buildtools-2.0-incubator-SNAPSHOT.jar
[INFO] [install:install]
[INFO] Installing /x1/continuum/working-directory/216/buildtools/target/cxf-buildtools-2.0-incubator-SNAPSHOT.jar to /home/continuum/.m2/repository/org/apache/cxf/cxf-buildtools/2.0-incubator-SNAPSHOT/cxf-buildtools-2.0-incubator-SNAPSHOT.jar
[INFO] ----------------------------------------------------------------------------
[INFO] Building Apache CXF Parent
[INFO]    task-segment: [clean, install]
[INFO] ----------------------------------------------------------------------------
[INFO] [clean:clean]
[INFO] Deleting directory /x1/continuum/working-directory/216/parent/target
[INFO] Deleting directory /x1/continuum/working-directory/216/parent/target/classes
[INFO] Deleting directory /x1/continuum/working-directory/216/parent/target/test-classes
[INFO] Setting property: classpath.resource.loader.class => 'org.codehaus.plexus.velocity.ContextClassLoaderResourceLoader'.
[INFO] Setting property: velocimacro.messages.on => 'false'.
[INFO] Setting property: resource.loader => 'classpath'.
[INFO] Setting property: resource.manager.logwhenfound => 'false'.
[INFO] ************************************************************** 
[INFO] Starting Jakarta Velocity v1.4
[INFO] RuntimeInstance initializing.
[INFO] Default Properties File: org/apache/velocity/runtime/defaults/velocity.properties
[INFO] Default ResourceManager initializing. (class org.apache.velocity.runtime.resource.ResourceManagerImpl)
[INFO] Resource Loader Instantiated: org.codehaus.plexus.velocity.ContextClassLoaderResourceLoader
[INFO] ClasspathResourceLoader : initialization starting.
[INFO] ClasspathResourceLoader : initialization complete.
[INFO] ResourceCache : initialized. (class org.apache.velocity.runtime.resource.ResourceCacheImpl)
[INFO] Default ResourceManager initialization complete.
[INFO] Loaded System Directive: org.apache.velocity.runtime.directive.Literal
[INFO] Loaded System Directive: org.apache.velocity.runtime.directive.Macro
[INFO] Loaded System Directive: org.apache.velocity.runtime.directive.Parse
[INFO] Loaded System Directive: org.apache.velocity.runtime.directive.Include
[INFO] Loaded System Directive: org.apache.velocity.runtime.directive.Foreach
[INFO] Created: 20 parsers.
[INFO] Velocimacro : initialization starting.
[INFO] Velocimacro : adding VMs from VM library template : VM_global_library.vm
[ERROR] ResourceManager : unable to find resource 'VM_global_library.vm' in any resource loader.
[INFO] Velocimacro : error using  VM library template VM_global_library.vm : org.apache.velocity.exception.ResourceNotFoundException: Unable to find resource 'VM_global_library.vm'
[INFO] Velocimacro :  VM library template macro registration complete.
[INFO] Velocimacro : allowInline = true : VMs can be defined inline in templates
[INFO] Velocimacro : allowInlineToOverride = false : VMs defined inline may NOT replace previous VM definitions
[INFO] Velocimacro : allowInlineLocal = false : VMs defined inline will be  global in scope if allowed.
[INFO] Velocimacro : initialization complete.
[INFO] Velocity successfully started.
[INFO] [checkstyle:checkstyle {execution: validate}]
[INFO] Source directory does not exist - skipping report.
[INFO] Preparing pmd:check
[INFO] [pmd:pmd]
[INFO] [pmd:check {execution: validate}]
[INFO] Setting property: classpath.resource.loader.class => 'org.codehaus.plexus.velocity.ContextClassLoaderResourceLoader'.
[INFO] Setting property: velocimacro.messages.on => 'false'.
[INFO] Setting property: resource.loader => 'classpath'.
[INFO] Setting property: resource.manager.logwhenfound => 'false'.
[INFO] [remote-resources:process {execution: default}]
[INFO] [site:attach-descriptor]
[INFO] [install:install]
[INFO] Installing /x1/continuum/working-directory/216/parent/pom.xml to /home/continuum/.m2/repository/org/apache/cxf/cxf-parent/2.0-incubator-SNAPSHOT/cxf-parent-2.0-incubator-SNAPSHOT.pom
[INFO] ----------------------------------------------------------------------------
[INFO] Building Apache CXF Common Utilities
[INFO]    task-segment: [clean, install]
[INFO] ----------------------------------------------------------------------------
[INFO] [clean:clean]
[INFO] Deleting directory /x1/continuum/working-directory/216/common/common/target
[INFO] Deleting directory /x1/continuum/working-directory/216/common/common/target/classes
[INFO] Deleting directory /x1/continuum/working-directory/216/common/common/target/test-classes
[INFO] [checkstyle:checkstyle {execution: validate}]
[INFO] Starting audit...
Audit done.

[INFO] Preparing pmd:check
[INFO] [pmd:pmd]
[INFO] [pmd:check {execution: validate}]
[INFO] 
[INFO] [remote-resources:process {execution: default}]
[INFO] [resources:resources]
[INFO] Using default encoding to copy filtered resources.
[INFO] [compiler:compile]
[INFO] Compiling 97 source files to /x1/continuum/working-directory/216/common/common/target/classes
[INFO] [resources:testResources]
[INFO] Using default encoding to copy filtered resources.
[INFO] [compiler:testCompile]
[INFO] Compiling 36 source files to /x1/continuum/working-directory/216/common/common/target/test-classes
[INFO] [surefire:test]
[INFO] Surefire report directory: /x1/continuum/working-directory/216/common/common/target/surefire-reports

-------------------------------------------------------
 T E S T S
-------------------------------------------------------
Running org.apache.cxf.helpers.ServiceUtilsTest
Tests run: 1, Failures: 0, Errors: 0, Skipped: 0, Time elapsed: 0.07 sec
Running org.apache.cxf.common.commands.ForkedCommandTest
Tests run: 4, Failures: 0, Errors: 0, Skipped: 0, Time elapsed: 1.837 sec
Running org.apache.cxf.common.classloader.FireWallClassLoaderTest
Tests run: 4, Failures: 0, Errors: 0, Skipped: 0, Time elapsed: 0.039 sec
Running org.apache.cxf.common.util.Base64UtilityTest
Tests run: 3, Failures: 0, Errors: 0, Skipped: 0, Time elapsed: 0.049 sec
Running org.apache.cxf.version.VersionTest
Tests run: 2, Failures: 0, Errors: 0, Skipped: 0, Time elapsed: 0.018 sec
Running org.apache.cxf.common.util.CollectionUtilsTest
Tests run: 2, Failures: 0, Errors: 0, Skipped: 0, Time elapsed: 0.021 sec
Running org.apache.cxf.common.util.PackageUtilsTest
Tests run: 2, Failures: 0, Errors: 0, Skipped: 0, Time elapsed: 0.021 sec
Running org.apache.cxf.configuration.spring.SpringBeanMapTest
Tests run: 1, Failures: 0, Errors: 0, Skipped: 0, Time elapsed: 1.294 sec
Running org.apache.cxf.common.annotation.AnnotationProcessorTest
Tests run: 5, Failures: 0, Errors: 0, Skipped: 0, Time elapsed: 0.181 sec
Running org.apache.cxf.resource.ClassLoaderResolverTest
Tests run: 2, Failures: 0, Errors: 0, Skipped: 0, Time elapsed: 0.041 sec
Running org.apache.cxf.helpers.XMLUtilsTest
Tests run: 1, Failures: 0, Errors: 0, Skipped: 0, Time elapsed: 0.111 sec
Running org.apache.cxf.helpers.NameSpaceTest
Tests run: 2, Failures: 0, Errors: 0, Skipped: 0, Time elapsed: 0.091 sec
Running org.apache.cxf.common.util.TwoStageCacheTest
Tests run: 4, Failures: 0, Errors: 0, Skipped: 0, Time elapsed: 2.658 sec
Running org.apache.cxf.common.i18n.BundleUtilsTest
Tests run: 2, Failures: 0, Errors: 0, Skipped: 0, Time elapsed: 0.03 sec
Running org.apache.cxf.jaxb.JAXBUtilsTest
Tests run: 4, Failures: 0, Errors: 0, Skipped: 0, Time elapsed: 0.078 sec
Running org.apache.cxf.resource.URIResolverTest
Tests run: 2, Failures: 0, Errors: 0, Skipped: 0, Time elapsed: 0.04 sec
Running org.apache.cxf.common.injection.ResourceInjectorTest
Tests run: 8, Failures: 0, Errors: 0, Skipped: 0, Time elapsed: 0.165 sec
Running org.apache.cxf.staxutils.FragmentStreamReaderTest
Tests run: 1, Failures: 0, Errors: 0, Skipped: 0, Time elapsed: 0.405 sec
Running org.apache.cxf.staxutils.W3CDOMStreamReaderTest
Tests run: 1, Failures: 0, Errors: 0, Skipped: 0, Time elapsed: 0.292 sec
Running org.apache.cxf.configuration.spring.SpringBeanQNameMapTest
Tests run: 1, Failures: 0, Errors: 0, Skipped: 0, Time elapsed: 0.197 sec
Running org.apache.cxf.staxutils.StaxUtilsTest
Tests run: 5, Failures: 0, Errors: 0, Skipped: 0, Time elapsed: 0.087 sec
Running org.apache.cxf.jaxb.DatatypeFactoryTest
Tests run: 1, Failures: 0, Errors: 0, Skipped: 0, Time elapsed: 0.046 sec
Running org.apache.cxf.common.i18n.MessageTest
Tests run: 2, Failures: 0, Errors: 0, Skipped: 0, Time elapsed: 0.007 sec
Running org.apache.cxf.common.logging.LogUtilsTest
Tests run: 7, Failures: 0, Errors: 0, Skipped: 0, Time elapsed: 0.163 sec
Running org.apache.cxf.staxutils.DepthXMLStreamReaderTest
Tests run: 1, Failures: 0, Errors: 0, Skipped: 0, Time elapsed: 0.006 sec
Running org.apache.cxf.common.util.PropertiesLoaderUtilsTest
Tests run: 2, Failures: 0, Errors: 0, Skipped: 0, Time elapsed: 0.075 sec
Running org.apache.cxf.common.util.StringUtilsTest
Tests run: 6, Failures: 0, Errors: 0, Skipped: 0, Time elapsed: 0.044 sec
Running org.apache.cxf.jaxb.WrapperHelperTest
Tests run: 1, Failures: 0, Errors: 0, Skipped: 0, Time elapsed: 0.021 sec
Running org.apache.cxf.common.commands.ResultBufferedCommandTest
Tests run: 2, Failures: 0, Errors: 0, Skipped: 0, Time elapsed: 0.786 sec
Running org.apache.cxf.staxutils.StaxStreamFilterTest
Tests run: 2, Failures: 0, Errors: 0, Skipped: 0, Time elapsed: 0.033 sec

Results :

Tests run: 81, Failures: 0, Errors: 0, Skipped: 0

[INFO] [jar:jar]
[INFO] Building jar: /x1/continuum/working-directory/216/common/common/target/cxf-common-utilities-2.0-incubator-SNAPSHOT.jar
[INFO] [install:install]
[INFO] Installing /x1/continuum/working-directory/216/common/common/target/cxf-common-utilities-2.0-incubator-SNAPSHOT.jar to /home/continuum/.m2/repository/org/apache/cxf/cxf-common-utilities/2.0-incubator-SNAPSHOT/cxf-common-utilities-2.0-incubator-SNAPSHOT.jar
[INFO] ----------------------------------------------------------------------------
[INFO] Building Apache CXF Common XSD2Java  Plugins
[INFO]    task-segment: [clean, install]
[INFO] ----------------------------------------------------------------------------
[INFO] [clean:clean]
[INFO] Deleting directory /x1/continuum/working-directory/216/common/xsd/target
[INFO] Deleting directory /x1/continuum/working-directory/216/common/xsd/target/classes
[INFO] Deleting directory /x1/continuum/working-directory/216/common/xsd/target/test-classes
[INFO] [checkstyle:checkstyle {execution: validate}]
[INFO] Starting audit...
Audit done.

[INFO] Preparing pmd:check
[INFO] [pmd:pmd]
[INFO] [pmd:check {execution: validate}]
[INFO] 
[INFO] [plugin:descriptor]
[INFO] Using 2 extractors.
[INFO] Applying extractor for language: java
[INFO] Extractor for language: java found 1 mojo descriptors.
[INFO] Applying extractor for language: bsh
[INFO] Extractor for language: bsh found 0 mojo descriptors.
[INFO] [remote-resources:process {execution: default}]
[INFO] [resources:resources]
[INFO] Using default encoding to copy filtered resources.
[INFO] [compiler:compile]
[INFO] Compiling 3 source files to /x1/continuum/working-directory/216/common/xsd/target/classes
[INFO] [resources:testResources]
[INFO] Using default encoding to copy filtered resources.
[INFO] [compiler:testCompile]
[INFO] No sources to compile
[INFO] [surefire:test]
[INFO] Surefire report directory: /x1/continuum/working-directory/216/common/xsd/target/surefire-reports

-------------------------------------------------------
 T E S T S
-------------------------------------------------------
There are no tests to run.

Results :

Tests run: 0, Failures: 0, Errors: 0, Skipped: 0

[INFO] [jar:jar]
[INFO] Building jar: /x1/continuum/working-directory/216/common/xsd/target/cxf-common-xsd-2.0-incubator-SNAPSHOT.jar
[INFO] [plugin:addPluginArtifactMetadata]
[INFO] [install:install]
[INFO] Installing /x1/continuum/working-directory/216/common/xsd/target/cxf-common-xsd-2.0-incubator-SNAPSHOT.jar to /home/continuum/.m2/repository/org/apache/cxf/cxf-common-xsd/2.0-incubator-SNAPSHOT/cxf-common-xsd-2.0-incubator-SNAPSHOT.jar
[INFO] [plugin:updateRegistry]
[INFO] ----------------------------------------------------------------------------
[INFO] Building Apache CXF Common Schemas
[INFO]    task-segment: [clean, install]
[INFO] ----------------------------------------------------------------------------
[INFO] [clean:clean]
[INFO] Deleting directory /x1/continuum/working-directory/216/common/schemas/target
[INFO] Deleting directory /x1/continuum/working-directory/216/common/schemas/target/classes
[INFO] Deleting directory /x1/continuum/working-directory/216/common/schemas/target/test-classes
[INFO] [checkstyle:checkstyle {execution: validate}]
[INFO] Starting audit...
Audit done.

[INFO] Preparing pmd:check
[INFO] [pmd:pmd]
[INFO] [pmd:check {execution: validate}]
[INFO] 
[INFO] [remote-resources:process {execution: default}]
[INFO] [resources:resources]
[INFO] Using default encoding to copy filtered resources.
[INFO] [compiler:compile]
[INFO] No sources to compile
[INFO] [resources:testResources]
[INFO] Using default encoding to copy filtered resources.
[INFO] [compiler:testCompile]
[INFO] Not compiling test sources
[INFO] [surefire:test]
[INFO] Tests are skipped.
[INFO] [jar:jar]
[INFO] Building jar: /x1/continuum/working-directory/216/common/schemas/target/cxf-common-schemas-2.0-incubator-SNAPSHOT.jar
[INFO] [install:install]
[INFO] Installing /x1/continuum/working-directory/216/common/schemas/target/cxf-common-schemas-2.0-incubator-SNAPSHOT.jar to /home/continuum/.m2/repository/org/apache/cxf/cxf-common-schemas/2.0-incubator-SNAPSHOT/cxf-common-schemas-2.0-incubator-SNAPSHOT.jar
[INFO] ----------------------------------------------------------------------------
[INFO] Building Apache CXF XJC Default Value Plugin
[INFO]    task-segment: [clean, install]
[INFO] ----------------------------------------------------------------------------
[INFO] [clean:clean]
[INFO] Deleting directory /x1/continuum/working-directory/216/common/xjc/dv/target
[INFO] Deleting directory /x1/continuum/working-directory/216/common/xjc/dv/target/classes
[INFO] Deleting directory /x1/continuum/working-directory/216/common/xjc/dv/target/test-classes
[INFO] [checkstyle:checkstyle {execution: validate}]
[INFO] Starting audit...
Audit done.

[INFO] Preparing pmd:check
[INFO] [pmd:pmd]
[INFO] [pmd:check {execution: validate}]
[INFO] 
[INFO] [remote-resources:process {execution: default}]
[INFO] [resources:resources]
[INFO] Using default encoding to copy filtered resources.
[INFO] [compiler:compile]
[INFO] Compiling 1 source file to /x1/continuum/working-directory/216/common/xjc/dv/target/classes
[INFO] [resources:testResources]
[INFO] Using default encoding to copy filtered resources.
[INFO] [compiler:testCompile]
[INFO] Not compiling test sources
[INFO] [surefire:test]
[INFO] Tests are skipped.
[INFO] [jar:jar]
[INFO] Building jar: /x1/continuum/working-directory/216/common/xjc/dv/target/cxf-xjc-dv-2.0-incubator-SNAPSHOT.jar
[INFO] [install:install]
[INFO] Installing /x1/continuum/working-directory/216/common/xjc/dv/target/cxf-xjc-dv-2.0-incubator-SNAPSHOT.jar to /home/continuum/.m2/repository/org/apache/cxf/cxf-xjc-dv/2.0-incubator-SNAPSHOT/cxf-xjc-dv-2.0-incubator-SNAPSHOT.jar
[INFO] ----------------------------------------------------------------------------
[INFO] Building Apache CXF XJC Default Value Plugin Tests
[INFO]    task-segment: [clean, install]
[INFO] ----------------------------------------------------------------------------
[INFO] [clean:clean]
[INFO] Deleting directory /x1/continuum/working-directory/216/common/xjc/dv-test/target
[INFO] Deleting directory /x1/continuum/working-directory/216/common/xjc/dv-test/target/classes
[INFO] Deleting directory /x1/continuum/working-directory/216/common/xjc/dv-test/target/test-classes
[INFO] [checkstyle:checkstyle {execution: validate}]
[INFO] Starting audit...
Audit done.

[INFO] Preparing pmd:check
[INFO] [pmd:pmd]
[INFO] [pmd:check {execution: validate}]
[INFO] 
[INFO] [jaxb:generate {execution: default}]
[INFO] Compiling file:/x1/continuum/working-directory/216/common/xjc/dv-test/src/test/resources/schemas/configuration/foo.xsd
[INFO] Writing output to /x1/continuum/working-directory/216/common/xjc/dv-test/target/generated/src/test/java
[INFO] [remote-resources:process {execution: default}]
[INFO] [resources:resources]
[INFO] Using default encoding to copy filtered resources.
[INFO] [compiler:compile]
[INFO] Compiling 4 source files to /x1/continuum/working-directory/216/common/xjc/dv-test/target/classes
[INFO] [resources:testResources]
[INFO] Using default encoding to copy filtered resources.
[INFO] [compiler:testCompile]
[INFO] Compiling 1 source file to /x1/continuum/working-directory/216/common/xjc/dv-test/target/test-classes
[INFO] [surefire:test]
[INFO] Surefire report directory: /x1/continuum/working-directory/216/common/xjc/dv-test/target/surefire-reports

-------------------------------------------------------
 T E S T S
-------------------------------------------------------
Running org.apache.cxf.xjc.dv.DefaultValueTest
Tests run: 1, Failures: 0, Errors: 0, Skipped: 0, Time elapsed: 0.195 sec

Results :

Tests run: 1, Failures: 0, Errors: 0, Skipped: 0

[INFO] [jar:jar]
[INFO] Building jar: /x1/continuum/working-directory/216/common/xjc/dv-test/target/cxf-xjc-dv-test-2.0-incubator-SNAPSHOT.jar
[INFO] [install:install]
[INFO] Installing /x1/continuum/working-directory/216/common/xjc/dv-test/target/cxf-xjc-dv-test-2.0-incubator-SNAPSHOT.jar to /home/continuum/.m2/repository/org/apache/cxf/cxf-xjc-dv-test/2.0-incubator-SNAPSHOT/cxf-xjc-dv-test-2.0-incubator-SNAPSHOT.jar
[INFO] ----------------------------------------------------------------------------
[INFO] Building Apache CXF XJC Plugins
[INFO]    task-segment: [clean, install]
[INFO] ----------------------------------------------------------------------------
[INFO] [clean:clean]
[INFO] Deleting directory /x1/continuum/working-directory/216/common/xjc/target
[INFO] Deleting directory /x1/continuum/working-directory/216/common/xjc/target/classes
[INFO] Deleting directory /x1/continuum/working-directory/216/common/xjc/target/test-classes
[INFO] [checkstyle:checkstyle {execution: validate}]
[INFO] Source directory does not exist - skipping report.
[INFO] Preparing pmd:check
[INFO] [pmd:pmd]
[INFO] [pmd:check {execution: validate}]
[INFO] [remote-resources:process {execution: default}]
[INFO] [site:attach-descriptor]
[INFO] [install:install]
[INFO] Installing /x1/continuum/working-directory/216/common/xjc/pom.xml to /home/continuum/.m2/repository/org/apache/cxf/cxf-xjc/2.0-incubator-SNAPSHOT/cxf-xjc-2.0-incubator-SNAPSHOT.pom
[INFO] ----------------------------------------------------------------------------
[INFO] Building Apache CXF Common
[INFO]    task-segment: [clean, install]
[INFO] ----------------------------------------------------------------------------
[INFO] [clean:clean]
[INFO] Deleting directory /x1/continuum/working-directory/216/common/target
[INFO] Deleting directory /x1/continuum/working-directory/216/common/target/classes
[INFO] Deleting directory /x1/continuum/working-directory/216/common/target/test-classes
[INFO] [site:attach-descriptor]
[INFO] [install:install]
[INFO] Installing /x1/continuum/working-directory/216/common/pom.xml to /home/continuum/.m2/repository/org/apache/cxf/cxf-common/2.0-incubator-SNAPSHOT/cxf-common-2.0-incubator-SNAPSHOT.pom
[INFO] ----------------------------------------------------------------------------
[INFO] Building Apache CXF API
[INFO]    task-segment: [clean, install]
[INFO] ----------------------------------------------------------------------------
[INFO] [clean:clean]
[INFO] Deleting directory /x1/continuum/working-directory/216/api/target
[INFO] Deleting directory /x1/continuum/working-directory/216/api/target/classes
[INFO] Deleting directory /x1/continuum/working-directory/216/api/target/test-classes
[INFO] [checkstyle:checkstyle {execution: validate}]
[INFO] Starting audit...
Audit done.

[INFO] Preparing pmd:check
[INFO] [pmd:pmd]
[INFO] [pmd:check {execution: validate}]
[INFO] 
[INFO] [dependency:unpack {execution: unpack-schemas}]
[INFO] Configured Artifact: org.apache.cxf:cxf-common-schemas:2.0-incubator-SNAPSHOT:jar
[INFO] Expanding: /home/continuum/.m2/repository/org/apache/cxf/cxf-common-schemas/2.0-incubator-SNAPSHOT/cxf-common-schemas-2.0-incubator-SNAPSHOT.jar into /x1/continuum/working-directory/216/api/target/schemas
[INFO] [cxf-common-xsd:xsdtojava {execution: generate-sources}]
[INFO] [remote-resources:process {execution: default}]
[INFO] [resources:resources]
[INFO] Using default encoding to copy filtered resources.
[INFO] [compiler:compile]
[INFO] Compiling 218 source files to /x1/continuum/working-directory/216/api/target/classes
[INFO] [cxf-common-xsd:xsdtojava {execution: generate-test-sources}]
[INFO] [resources:testResources]
[INFO] Using default encoding to copy filtered resources.
[INFO] [compiler:testCompile]
[INFO] Compiling 28 source files to /x1/continuum/working-directory/216/api/target/test-classes
[INFO] [surefire:test]
[INFO] Surefire report directory: /x1/continuum/working-directory/216/api/target/surefire-reports

-------------------------------------------------------
 T E S T S
-------------------------------------------------------
Running org.apache.cxf.wsdl.JAXBExtensionHelperTest
Tests run: 2, Failures: 0, Errors: 0, Skipped: 0, Time elapsed: 4.933 sec
Running org.apache.cxf.service.model.BindingMessageInfoTest
Tests run: 1, Failures: 0, Errors: 0, Skipped: 0, Time elapsed: 0.029 sec
Running org.apache.cxf.ws.policy.IntersectorTest
Tests run: 3, Failures: 0, Errors: 0, Skipped: 0, Time elapsed: 0.151 sec
Running org.apache.cxf.ws.policy.builder.jaxb.JaxbAssertionTest
Tests run: 3, Failures: 0, Errors: 0, Skipped: 0, Time elapsed: 0.899 sec
Running org.apache.cxf.ws.policy.builder.jaxb.JaxbAssertionBuilderTest
Tests run: 3, Failures: 0, Errors: 0, Skipped: 0, Time elapsed: 0.206 sec
Running org.apache.cxf.service.model.OperationInfoTest
Tests run: 5, Failures: 0, Errors: 0, Skipped: 0, Time elapsed: 0.272 sec
Running org.apache.cxf.ws.policy.AssertionInfoMapTest
Tests run: 3, Failures: 0, Errors: 0, Skipped: 0, Time elapsed: 0.125 sec
Running org.apache.cxf.BusFactoryTest
Tests run: 1, Failures: 0, Errors: 0, Skipped: 0, Time elapsed: 0.021 sec
Running org.apache.cxf.service.model.FaultInfoTest
Tests run: 1, Failures: 0, Errors: 0, Skipped: 0, Time elapsed: 0.026 sec
Running org.apache.cxf.service.model.SchemaInfoTest
Tests run: 2, Failures: 0, Errors: 0, Skipped: 0, Time elapsed: 0.032 sec
Running org.apache.cxf.service.model.MessagePartInfoTest
Tests run: 3, Failures: 0, Errors: 0, Skipped: 0, Time elapsed: 0.065 sec
Running org.apache.cxf.ws.policy.builder.primitive.NestedPrimitiveAssertionTest
Tests run: 1, Failures: 0, Errors: 0, Skipped: 0, Time elapsed: 0.078 sec
Running org.apache.cxf.service.model.BindingFaultInfoTest
Tests run: 1, Failures: 0, Errors: 0, Skipped: 0, Time elapsed: 0.027 sec
Running org.apache.cxf.ws.policy.builder.primitive.NestedPrimitiveAssertionBuilderTest
Tests run: 5, Failures: 0, Errors: 0, Skipped: 0, Time elapsed: 0.381 sec
Running org.apache.cxf.service.model.InterfaceInfoTest
Tests run: 2, Failures: 0, Errors: 0, Skipped: 0, Time elapsed: 0.069 sec
Running org.apache.cxf.phase.PhaseInterceptorChainTest
Tests run: 16, Failures: 0, Errors: 0, Skipped: 0, Time elapsed: 0.758 sec
Running org.apache.cxf.service.model.BindingOperationInfoTest
Tests run: 6, Failures: 0, Errors: 0, Skipped: 0, Time elapsed: 0.088 sec
Running org.apache.cxf.service.model.MessageInfoTest
Tests run: 2, Failures: 0, Errors: 0, Skipped: 0, Time elapsed: 0.038 sec

Results :

Tests run: 60, Failures: 0, Errors: 0, Skipped: 0

[INFO] [jar:jar]
[INFO] Building jar: /x1/continuum/working-directory/216/api/target/cxf-api-2.0-incubator-SNAPSHOT.jar
[INFO] Preparing javadoc:jar
[WARNING] Removing: check from forked lifecycle, to prevent recursive invocation.
[WARNING] Removing: jar from forked lifecycle, to prevent recursive invocation.
[INFO] [checkstyle:checkstyle {execution: validate}]
[INFO] Starting audit...
Audit done.

[INFO] [dependency:unpack {execution: unpack-schemas}]
[INFO] Configured Artifact: org.apache.cxf:cxf-common-schemas:2.0-incubator-SNAPSHOT:jar
[INFO] cxf-common-schemas-2.0-incubator-SNAPSHOT.jar already unpacked.
[INFO] [cxf-common-xsd:xsdtojava {execution: generate-sources}]
[INFO] [javadoc:jar {execution: package}]
11 warnings
[INFO] Javadoc Warnings
[WARNING] javadoc: warning - Multiple sources of package comments found for package "org.apache.cxf.endpoint"
[WARNING] javadoc: warning - Multiple sources of package comments found for package "org.apache.cxf.transport"
[WARNING] javadoc: warning - Multiple sources of package comments found for package "org.apache.cxf.interceptor"
[WARNING] javadoc: warning - Multiple sources of package comments found for package "org.apache.cxf.service"
[WARNING] javadoc: warning - Multiple sources of package comments found for package "org.apache.cxf.phase"
[WARNING] javadoc: warning - Multiple sources of package comments found for package "org.apache.cxf.binding"
[WARNING] javadoc: warning - Multiple sources of package comments found for package "org.apache.cxf"
[WARNING] /x1/continuum/working-directory/216/api/src/main/java/org/apache/cxf/endpoint/EndpointResolver.java:72: warning - @param argument "serviceName" is not a parameter name.
[WARNING] /x1/continuum/working-directory/216/api/src/main/java/org/apache/cxf/endpoint/EndpointResolverRegistry.java:99: warning - @param argument "serviceName" is not a parameter name.
[WARNING] /x1/continuum/working-directory/216/api/src/main/java/org/apache/cxf/clustering/FailoverStrategy.java:39: warning - @param argument "invocation" is not a parameter name.
[WARNING] /x1/continuum/working-directory/216/api/src/main/java/org/apache/cxf/clustering/FailoverStrategy.java:47: warning - @param argument "a" is not a parameter name.
[INFO] Building jar: /x1/continuum/working-directory/216/api/target/cxf-api-2.0-incubator-SNAPSHOT-javadoc.jar
[INFO] [install:install]
[INFO] Installing /x1/continuum/working-directory/216/api/target/cxf-api-2.0-incubator-SNAPSHOT.jar to /home/continuum/.m2/repository/org/apache/cxf/cxf-api/2.0-incubator-SNAPSHOT/cxf-api-2.0-incubator-SNAPSHOT.jar
[INFO] Installing /x1/continuum/working-directory/216/api/target/cxf-api-2.0-incubator-SNAPSHOT-javadoc.jar to /home/continuum/.m2/repository/org/apache/cxf/cxf-api/2.0-incubator-SNAPSHOT/cxf-api-2.0-incubator-SNAPSHOT-javadoc.jar
[INFO] ----------------------------------------------------------------------------
[INFO] Building Apache CXF Command Line Tools Common
[INFO]    task-segment: [clean, install]
[INFO] ----------------------------------------------------------------------------
[INFO] [clean:clean]
[INFO] Deleting directory /x1/continuum/working-directory/216/tools/common/target
[INFO] Deleting directory /x1/continuum/working-directory/216/tools/common/target/classes
[INFO] Deleting directory /x1/continuum/working-directory/216/tools/common/target/test-classes
[INFO] [checkstyle:checkstyle {execution: validate}]
[INFO] Starting audit...
Audit done.

[INFO] Preparing pmd:check
[INFO] [pmd:pmd]
[INFO] [pmd:check {execution: validate}]
[INFO] 
[INFO] [remote-resources:process {execution: default}]
[INFO] [resources:resources]
[INFO] Using default encoding to copy filtered resources.
[INFO] [compiler:compile]
[INFO] Compiling 70 source files to /x1/continuum/working-directory/216/tools/common/target/classes
[INFO] [resources:testResources]
[INFO] Using default encoding to copy filtered resources.
[INFO] [compiler:testCompile]
[INFO] Compiling 20 source files to /x1/continuum/working-directory/216/tools/common/target/test-classes
[INFO] [surefire:test]
[INFO] Surefire report directory: /x1/continuum/working-directory/216/tools/common/target/surefire-reports

-------------------------------------------------------
 T E S T S
-------------------------------------------------------
Running org.apache.cxf.tools.common.ToolContextTest
Tests run: 1, Failures: 0, Errors: 0, Skipped: 0, Time elapsed: 0.072 sec
Running org.apache.cxf.tools.common.toolspec.parser.CommandLineParserTest
Tests run: 16, Failures: 0, Errors: 0, Skipped: 0, Time elapsed: 6.707 sec
Running org.apache.cxf.tools.common.ProcessorEnvironmentTest
Tests run: 7, Failures: 0, Errors: 0, Skipped: 0, Time elapsed: 0.073 sec
Running org.apache.cxf.tools.common.model.JavaClassTest
Tests run: 2, Failures: 0, Errors: 0, Skipped: 0, Time elapsed: 0.061 sec
Running org.apache.cxf.tools.common.toolspec.ToolSupportTest
Tests run: 1, Failures: 0, Errors: 0, Skipped: 0, Time elapsed: 0.017 sec
Running org.apache.cxf.tools.common.model.JavaParameterTest
Tests run: 1, Failures: 0, Errors: 0, Skipped: 0, Time elapsed: 0.026 sec
Running org.apache.cxf.tools.util.URIParserUtilTest
Tests run: 3, Failures: 0, Errors: 0, Skipped: 0, Time elapsed: 0.081 sec
Running org.apache.cxf.tools.common.model.JavaTypeTest
Tests run: 3, Failures: 0, Errors: 0, Skipped: 0, Time elapsed: 0.079 sec
Running org.apache.cxf.tools.common.toolspec.AbstractToolContainerTest
Tests run: 3, Failures: 0, Errors: 0, Skipped: 0, Time elapsed: 0.389 sec
Running org.apache.cxf.tools.common.dom.SchemaValidatingSAXParserTest
Tests run: 1, Failures: 0, Errors: 0, Skipped: 0, Time elapsed: 0.151 sec
Running org.apache.cxf.tools.common.dom.ExtendedDocumentBuilderTest
Tests run: 2, Failures: 0, Errors: 0, Skipped: 0, Time elapsed: 0.041 sec
Running org.apache.cxf.tools.common.WSDLVersionTest
Tests run: 1, Failures: 0, Errors: 0, Skipped: 0, Time elapsed: 0.061 sec
Running org.apache.cxf.tools.util.BuiltInTypesJavaMappingUtilTest
Tests run: 1, Failures: 0, Errors: 0, Skipped: 0, Time elapsed: 0.031 sec
Running org.apache.cxf.tools.util.NameUtilTest
Tests run: 3, Failures: 0, Errors: 0, Skipped: 0, Time elapsed: 0.074 sec
Running org.apache.cxf.tools.util.FileWriterUtilTest
Tests run: 2, Failures: 0, Errors: 0, Skipped: 0, Time elapsed: 0.051 sec
Running org.apache.cxf.tools.common.toolspec.ToolExceptionTest
Tests run: 1, Failures: 0, Errors: 0, Skipped: 0, Time elapsed: 0.011 sec
Running org.apache.cxf.tools.common.dom.DocumentTest
Tests run: 1, Failures: 0, Errors: 0, Skipped: 1, Time elapsed: 0.018 sec
Running org.apache.cxf.tools.common.model.JavaInterfaceTest
Tests run: 1, Failures: 0, Errors: 0, Skipped: 0, Time elapsed: 0.025 sec
Running org.apache.cxf.tools.common.toolspec.ToolSpecTest
Tests run: 8, Failures: 0, Errors: 0, Skipped: 0, Time elapsed: 0.394 sec

Results :

Tests run: 58, Failures: 0, Errors: 0, Skipped: 1

[INFO] [jar:jar]
[INFO] Building jar: /x1/continuum/working-directory/216/tools/common/target/cxf-tools-common-2.0-incubator-SNAPSHOT.jar
[INFO] [install:install]
[INFO] Installing /x1/continuum/working-directory/216/tools/common/target/cxf-tools-common-2.0-incubator-SNAPSHOT.jar to /home/continuum/.m2/repository/org/apache/cxf/cxf-tools-common/2.0-incubator-SNAPSHOT/cxf-tools-common-2.0-incubator-SNAPSHOT.jar
[INFO] ----------------------------------------------------------------------------
[INFO] Building Apache CXF Runtime Core
[INFO]    task-segment: [clean, install]
[INFO] ----------------------------------------------------------------------------
[INFO] [clean:clean]
[INFO] Deleting directory /x1/continuum/working-directory/216/rt/core/target
[INFO] Deleting directory /x1/continuum/working-directory/216/rt/core/target/classes
[INFO] Deleting directory /x1/continuum/working-directory/216/rt/core/target/test-classes
[INFO] [checkstyle:checkstyle {execution: validate}]
[INFO] Starting audit...
Audit done.

[INFO] Preparing pmd:check
[INFO] [pmd:pmd]
[INFO] [pmd:check {execution: validate}]
[INFO] 
[INFO] [remote-resources:process {execution: default}]
[INFO] [resources:resources]
[INFO] Using default encoding to copy filtered resources.
[INFO] [compiler:compile]
[INFO] Compiling 132 source files to /x1/continuum/working-directory/216/rt/core/target/classes
[INFO] [resources:testResources]
[INFO] Using default encoding to copy filtered resources.
[INFO] [compiler:testCompile]
[INFO] Compiling 30 source files to /x1/continuum/working-directory/216/rt/core/target/test-classes
[INFO] [surefire:test]
[INFO] Surefire report directory: /x1/continuum/working-directory/216/rt/core/target/surefire-reports

-------------------------------------------------------
 T E S T S
-------------------------------------------------------
Running org.apache.cxf.interceptor.OutgoingChainInterceptorTest
Tests run: 1, Failures: 0, Errors: 0, Skipped: 0, Time elapsed: 2.36 sec
Running org.apache.cxf.test.XPathAssertTest
Tests run: 2, Failures: 0, Errors: 0, Skipped: 0, Time elapsed: 0.843 sec
Running org.apache.cxf.buslifecycle.CXFBusLifeCycleManagerTest
Tests run: 5, Failures: 0, Errors: 0, Skipped: 0, Time elapsed: 0.108 sec
Running org.apache.cxf.endpoint.EndpointResolverRegistryImplTest
Tests run: 6, Failures: 0, Errors: 0, Skipped: 0, Time elapsed: 0.259 sec
Running org.apache.cxf.bus.extension.ExtensionTest
Tests run: 3, Failures: 0, Errors: 0, Skipped: 0, Time elapsed: 0.073 sec
Running org.apache.cxf.attachment.AttachmentSerializerTest
Tests run: 2, Failures: 0, Errors: 0, Skipped: 0, Time elapsed: 0.674 sec
Running org.apache.cxf.wsdl11.WSDLManagerImplTest
Tests run: 2, Failures: 0, Errors: 0, Skipped: 0, Time elapsed: 0.612 sec
Running org.apache.cxf.configuration.spring.ConfigurerImplTest
Tests run: 4, Failures: 0, Errors: 0, Skipped: 0, Time elapsed: 1.987 sec
Running org.apache.cxf.transport.CachedOutputStreamTest
Tests run: 1, Failures: 0, Errors: 0, Skipped: 0, Time elapsed: 0.104 sec
Running org.apache.cxf.workqueue.AutomaticWorkQueueTest
Tests run: 10, Failures: 0, Errors: 0, Skipped: 1, Time elapsed: 21.349 sec
Running org.apache.cxf.bus.CXFBusImplTest
Tests run: 7, Failures: 0, Errors: 0, Skipped: 0, Time elapsed: 0.916 sec
Running org.apache.cxf.endpoint.ServerRegistryImpTest
Tests run: 1, Failures: 0, Errors: 0, Skipped: 0, Time elapsed: 0.007 sec
Running org.apache.cxf.bus.spring.SpringBusFactoryTest
Tests run: 7, Failures: 0, Errors: 0, Skipped: 0, Time elapsed: 2.063 sec
Running org.apache.cxf.interceptor.ServiceInvokerInterceptorTest
Tests run: 1, Failures: 0, Errors: 0, Skipped: 0, Time elapsed: 0.022 sec
Running org.apache.cxf.wsdl11.WSDLDefinitionBuilderTest
Tests run: 2, Failures: 0, Errors: 0, Skipped: 0, Time elapsed: 0.241 sec
Running org.apache.cxf.bus.spring.BusApplicationContextTest
Tests run: 1, Failures: 0, Errors: 0, Skipped: 0, Time elapsed: 0.485 sec
Running org.apache.cxf.bus.extension.ExtensionFragmentParserTest
Tests run: 1, Failures: 0, Errors: 0, Skipped: 0, Time elapsed: 0.019 sec
Running org.apache.cxf.transport.HttpUriMapperTest
Tests run: 2, Failures: 0, Errors: 0, Skipped: 0, Time elapsed: 0.016 sec
Running org.apache.cxf.bus.extension.ExtensionManagerTest
Tests run: 2, Failures: 0, Errors: 0, Skipped: 0, Time elapsed: 0.026 sec
Running org.apache.cxf.wsdl11.ServiceWSDLBuilderTest
Tests run: 8, Failures: 0, Errors: 0, Skipped: 0, Time elapsed: 1.039 sec
Running org.apache.cxf.attachment.AttachmentDeserializerTest
Tests run: 4, Failures: 0, Errors: 0, Skipped: 0, Time elapsed: 0.043 sec
Running org.apache.cxf.wsdl11.WSDLServiceBuilderTest
Tests run: 14, Failures: 0, Errors: 0, Skipped: 0, Time elapsed: 1.07 sec

Results :

Tests run: 86, Failures: 0, Errors: 0, Skipped: 1

[INFO] [jar:jar]
[INFO] Building jar: /x1/continuum/working-directory/216/rt/core/target/cxf-rt-core-2.0-incubator-SNAPSHOT.jar
[INFO] [install:install]
[INFO] Installing /x1/continuum/working-directory/216/rt/core/target/cxf-rt-core-2.0-incubator-SNAPSHOT.jar to /home/continuum/.m2/repository/org/apache/cxf/cxf-rt-core/2.0-incubator-SNAPSHOT/cxf-rt-core-2.0-incubator-SNAPSHOT.jar
[INFO] ----------------------------------------------------------------------------
[INFO] Building Apache CXF Command Line Tools Validator
[INFO]    task-segment: [clean, install]
[INFO] ----------------------------------------------------------------------------
[INFO] [clean:clean]
[INFO] Deleting directory /x1/continuum/working-directory/216/tools/validator/target
[INFO] Deleting directory /x1/continuum/working-directory/216/tools/validator/target/classes
[INFO] Deleting directory /x1/continuum/working-directory/216/tools/validator/target/test-classes
[INFO] [checkstyle:checkstyle {execution: validate}]
[INFO] Starting audit...
Audit done.

[INFO] Preparing pmd:check
[INFO] [pmd:pmd]
[INFO] [pmd:check {execution: validate}]
[INFO] 
[INFO] [remote-resources:process {execution: default}]
[INFO] [resources:resources]
[INFO] Using default encoding to copy filtered resources.
[INFO] [compiler:compile]
[INFO] Compiling 24 source files to /x1/continuum/working-directory/216/tools/validator/target/classes
[INFO] [resources:testResources]
[INFO] Using default encoding to copy filtered resources.
[INFO] [compiler:testCompile]
[INFO] Compiling 5 source files to /x1/continuum/working-directory/216/tools/validator/target/test-classes
[INFO] [surefire:test]
[INFO] Surefire report directory: /x1/continuum/working-directory/216/tools/validator/target/surefire-reports

-------------------------------------------------------
 T E S T S
-------------------------------------------------------
Running org.apache.cxf.tools.validator.WSDLValidationTest
Tests run: 11, Failures: 0, Errors: 0, Skipped: 0, Time elapsed: 5.977 sec
Running org.apache.cxf.tools.validator.internal.WSDLRefValidatorTest
Tests run: 7, Failures: 0, Errors: 0, Skipped: 0, Time elapsed: 1.557 sec
Running org.apache.cxf.tools.validator.internal.WSDL11ValidatorTest
Tests run: 1, Failures: 0, Errors: 0, Skipped: 0, Time elapsed: 0.114 sec
Running org.apache.cxf.tools.validator.internal.Stax2DOMTest
Tests run: 1, Failures: 0, Errors: 0, Skipped: 0, Time elapsed: 0.085 sec
Running org.apache.cxf.tools.validator.internal.model.XNodeTest
Tests run: 3, Failures: 0, Errors: 0, Skipped: 0, Time elapsed: 0.025 sec

Results :

Tests run: 23, Failures: 0, Errors: 0, Skipped: 0

[INFO] [jar:jar]
[INFO] Building jar: /x1/continuum/working-directory/216/tools/validator/target/cxf-tools-validator-2.0-incubator-SNAPSHOT.jar
[INFO] [install:install]
[INFO] Installing /x1/continuum/working-directory/216/tools/validator/target/cxf-tools-validator-2.0-incubator-SNAPSHOT.jar to /home/continuum/.m2/repository/org/apache/cxf/cxf-tools-validator/2.0-incubator-SNAPSHOT/cxf-tools-validator-2.0-incubator-SNAPSHOT.jar
[INFO] ----------------------------------------------------------------------------
[INFO] Building Apache CXF Command Line Tools WSDLTo Core
[INFO]    task-segment: [clean, install]
[INFO] ----------------------------------------------------------------------------
[INFO] [clean:clean]
[INFO] Deleting directory /x1/continuum/working-directory/216/tools/wsdlto/core/target
[INFO] Deleting directory /x1/continuum/working-directory/216/tools/wsdlto/core/target/classes
[INFO] Deleting directory /x1/continuum/working-directory/216/tools/wsdlto/core/target/test-classes
[INFO] [checkstyle:checkstyle {execution: validate}]
[INFO] Starting audit...
Audit done.

[INFO] Preparing pmd:check
[INFO] [pmd:pmd]
[INFO] [pmd:check {execution: validate}]
[INFO] 
[INFO] [cxf-common-xsd:xsdtojava {execution: generate-sources}]
[INFO] [remote-resources:process {execution: default}]
[INFO] [resources:resources]
[INFO] Using default encoding to copy filtered resources.
[INFO] [compiler:compile]
[INFO] Compiling 18 source files to /x1/continuum/working-directory/216/tools/wsdlto/core/target/classes
[INFO] [resources:testResources]
[INFO] Using default encoding to copy filtered resources.
[INFO] [compiler:testCompile]
[INFO] Compiling 1 source file to /x1/continuum/working-directory/216/tools/wsdlto/core/target/test-classes
[INFO] [surefire:test]
[INFO] Surefire report directory: /x1/continuum/working-directory/216/tools/wsdlto/core/target/surefire-reports

-------------------------------------------------------
 T E S T S
-------------------------------------------------------
Running org.apache.cxf.tools.wsdlto.WSDLToJavaContainerTest
Tests run: 1, Failures: 0, Errors: 0, Skipped: 0, Time elapsed: 0.199 sec

Results :

Tests run: 1, Failures: 0, Errors: 0, Skipped: 0

[INFO] [jar:jar]
[INFO] Building jar: /x1/continuum/working-directory/216/tools/wsdlto/core/target/cxf-tools-wsdlto-core-2.0-incubator-SNAPSHOT.jar
[INFO] [install:install]
[INFO] Installing /x1/continuum/working-directory/216/tools/wsdlto/core/target/cxf-tools-wsdlto-core-2.0-incubator-SNAPSHOT.jar to /home/continuum/.m2/repository/org/apache/cxf/cxf-tools-wsdlto-core/2.0-incubator-SNAPSHOT/cxf-tools-wsdlto-core-2.0-incubator-SNAPSHOT.jar
[INFO] ----------------------------------------------------------------------------
[INFO] Building Apache CXF Command Line Tools WSDLTo JAXWS Frontend
[INFO]    task-segment: [clean, install]
[INFO] ----------------------------------------------------------------------------
[INFO] [clean:clean]
[INFO] Deleting directory /x1/continuum/working-directory/216/tools/wsdlto/frontend/jaxws/target
[INFO] Deleting directory /x1/continuum/working-directory/216/tools/wsdlto/frontend/jaxws/target/classes
[INFO] Deleting directory /x1/continuum/working-directory/216/tools/wsdlto/frontend/jaxws/target/test-classes
[INFO] [checkstyle:checkstyle {execution: validate}]
[INFO] Starting audit...
Audit done.

[INFO] Preparing pmd:check
[INFO] [pmd:pmd]
[INFO] [pmd:check {execution: validate}]
[INFO] 
[INFO] [remote-resources:process {execution: default}]
[INFO] [resources:resources]
[INFO] Using default encoding to copy filtered resources.
[INFO] [compiler:compile]
[INFO] Compiling 37 source files to /x1/continuum/working-directory/216/tools/wsdlto/frontend/jaxws/target/classes
[INFO] [resources:testResources]
[INFO] Using default encoding to copy filtered resources.
[INFO] [compiler:testCompile]
[INFO] Compiling 9 source files to /x1/continuum/working-directory/216/tools/wsdlto/frontend/jaxws/target/test-classes
[INFO] [surefire:test]
[INFO] Surefire report directory: /x1/continuum/working-directory/216/tools/wsdlto/frontend/jaxws/target/surefire-reports

-------------------------------------------------------
 T E S T S
-------------------------------------------------------
Running org.apache.cxf.tools.wsdlto.frontend.jaxws.processor.internal.PortTypeProcessorTest
Tests run: 1, Failures: 0, Errors: 0, Skipped: 0, Time elapsed: 0.058 sec
Running org.apache.cxf.tools.wsdlto.frontend.jaxws.processor.internal.ProcessorUtilTest
Tests run: 1, Failures: 0, Errors: 0, Skipped: 0, Time elapsed: 0.033 sec
Running org.apache.cxf.tools.wsdlto.frontend.jaxws.processor.internal.mapper.MethodMapperTest
Tests run: 3, Failures: 0, Errors: 0, Skipped: 0, Time elapsed: 0.096 sec
Running org.apache.cxf.tools.wsdlto.frontend.jaxws.processor.internal.annotator.WebParamAnnotatorTest
Tests run: 3, Failures: 0, Errors: 0, Skipped: 0, Time elapsed: 0.03 sec
Running org.apache.cxf.tools.wsdlto.frontend.jaxws.processor.internal.annotator.WebMethodAnnotatorTest
Tests run: 2, Failures: 0, Errors: 0, Skipped: 0, Time elapsed: 0.016 sec
Running org.apache.cxf.tools.wsdlto.frontend.jaxws.processor.internal.mapper.InterfaceMapperTest
Tests run: 2, Failures: 0, Errors: 0, Skipped: 0, Time elapsed: 0.037 sec
Running org.apache.cxf.tools.wsdlto.frontend.jaxws.JAXWSProfileTest
Tests run: 1, Failures: 0, Errors: 0, Skipped: 0, Time elapsed: 2.45 sec
Running org.apache.cxf.tools.wsdlto.frontend.jaxws.wsdl11.JAXWSDefinitionBuilderTest
Tests run: 3, Failures: 0, Errors: 0, Skipped: 0, Time elapsed: 1.208 sec

Results :

Tests run: 16, Failures: 0, Errors: 0, Skipped: 0

[INFO] [jar:jar]
[INFO] Building jar: /x1/continuum/working-directory/216/tools/wsdlto/frontend/jaxws/target/cxf-tools-wsdlto-frontend-jaxws-2.0-incubator-SNAPSHOT.jar
[INFO] [install:install]
[INFO] Installing /x1/continuum/working-directory/216/tools/wsdlto/frontend/jaxws/target/cxf-tools-wsdlto-frontend-jaxws-2.0-incubator-SNAPSHOT.jar to /home/continuum/.m2/repository/org/apache/cxf/cxf-tools-wsdlto-frontend-jaxws/2.0-incubator-SNAPSHOT/cxf-tools-wsdlto-frontend-jaxws-2.0-incubator-SNAPSHOT.jar
[INFO] ----------------------------------------------------------------------------
[INFO] Building Apache CXF Command Line Tools WSDLTo JAXB Databinding
[INFO]    task-segment: [clean, install]
[INFO] ----------------------------------------------------------------------------
[INFO] [clean:clean]
[INFO] Deleting directory /x1/continuum/working-directory/216/tools/wsdlto/databinding/jaxb/target
[INFO] Deleting directory /x1/continuum/working-directory/216/tools/wsdlto/databinding/jaxb/target/classes
[INFO] Deleting directory /x1/continuum/working-directory/216/tools/wsdlto/databinding/jaxb/target/test-classes
[INFO] [checkstyle:checkstyle {execution: validate}]
[INFO] Starting audit...
Audit done.

[INFO] Preparing pmd:check
[INFO] [pmd:pmd]
[INFO] [pmd:check {execution: validate}]
[INFO] 
[INFO] [remote-resources:process {execution: default}]
[INFO] [resources:resources]
[INFO] Using default encoding to copy filtered resources.
[INFO] [compiler:compile]
[INFO] Compiling 5 source files to /x1/continuum/working-directory/216/tools/wsdlto/databinding/jaxb/target/classes
[INFO] [resources:testResources]
[INFO] Using default encoding to copy filtered resources.
[INFO] [compiler:testCompile]
[INFO] Nothing to compile - all classes are up to date
[INFO] [surefire:test]
[INFO] Surefire report directory: /x1/continuum/working-directory/216/tools/wsdlto/databinding/jaxb/target/surefire-reports

-------------------------------------------------------
 T E S T S
-------------------------------------------------------
There are no tests to run.

Results :

Tests run: 0, Failures: 0, Errors: 0, Skipped: 0

[INFO] [jar:jar]
[INFO] Building jar: /x1/continuum/working-directory/216/tools/wsdlto/databinding/jaxb/target/cxf-tools-wsdlto-databinding-jaxb-2.0-incubator-SNAPSHOT.jar
[INFO] [install:install]
[INFO] Installing /x1/continuum/working-directory/216/tools/wsdlto/databinding/jaxb/target/cxf-tools-wsdlto-databinding-jaxb-2.0-incubator-SNAPSHOT.jar to /home/continuum/.m2/repository/org/apache/cxf/cxf-tools-wsdlto-databinding-jaxb/2.0-incubator-SNAPSHOT/cxf-tools-wsdlto-databinding-jaxb-2.0-incubator-SNAPSHOT.jar
[INFO] ----------------------------------------------------------------------------
[INFO] Building Apache CXF Code Generation Maven2 Plugins
[INFO]    task-segment: [clean, install]
[INFO] ----------------------------------------------------------------------------
[INFO] [clean:clean]
[INFO] Deleting directory /x1/continuum/working-directory/216/codegen-plugin/target
[INFO] Deleting directory /x1/continuum/working-directory/216/codegen-plugin/target/classes
[INFO] Deleting directory /x1/continuum/working-directory/216/codegen-plugin/target/test-classes
[INFO] [checkstyle:checkstyle {execution: validate}]
[INFO] Starting audit...
Audit done.

[INFO] Preparing pmd:check
[INFO] [pmd:pmd]
[INFO] [pmd:check {execution: validate}]
[INFO] 
[INFO] [plugin:descriptor]
[INFO] Using 2 extractors.
[INFO] Applying extractor for language: java
[INFO] Extractor for language: java found 2 mojo descriptors.
[INFO] Applying extractor for language: bsh
[INFO] Extractor for language: bsh found 0 mojo descriptors.
[INFO] [remote-resources:process {execution: default}]
[INFO] [resources:resources]
[INFO] Using default encoding to copy filtered resources.
[INFO] [compiler:compile]
[INFO] Compiling 4 source files to /x1/continuum/working-directory/216/codegen-plugin/target/classes
[INFO] [resources:testResources]
[INFO] Using default encoding to copy filtered resources.
[INFO] [compiler:testCompile]
[INFO] Nothing to compile - all classes are up to date
[INFO] [surefire:test]
[INFO] Surefire report directory: /x1/continuum/working-directory/216/codegen-plugin/target/surefire-reports

-------------------------------------------------------
 T E S T S
-------------------------------------------------------
There are no tests to run.

Results :

Tests run: 0, Failures: 0, Errors: 0, Skipped: 0

[INFO] [jar:jar]
[INFO] Building jar: /x1/continuum/working-directory/216/codegen-plugin/target/cxf-codegen-plugin-2.0-incubator-SNAPSHOT.jar
[INFO] [plugin:addPluginArtifactMetadata]
[INFO] [install:install]
[INFO] Installing /x1/continuum/working-directory/216/codegen-plugin/target/cxf-codegen-plugin-2.0-incubator-SNAPSHOT.jar to /home/continuum/.m2/repository/org/apache/cxf/cxf-codegen-plugin/2.0-incubator-SNAPSHOT/cxf-codegen-plugin-2.0-incubator-SNAPSHOT.jar
[INFO] [plugin:updateRegistry]
[INFO] ----------------------------------------------------------------------------
[INFO] Building Apache CXF Test Utilities
[INFO]    task-segment: [clean, install]
[INFO] ----------------------------------------------------------------------------
[INFO] [clean:clean]
[INFO] Deleting directory /x1/continuum/working-directory/216/testutils/target
[INFO] Deleting directory /x1/continuum/working-directory/216/testutils/target/classes
[INFO] Deleting directory /x1/continuum/working-directory/216/testutils/target/test-classes
[INFO] [checkstyle:checkstyle {execution: validate}]
[INFO] Starting audit...
Audit done.

[INFO] Preparing pmd:check
[INFO] [pmd:pmd]
[INFO] [pmd:check {execution: validate}]
[INFO] 
[INFO] [antrun:run {execution: validate}]
[INFO] Executing tasks
    [mkdir] Created dir: /x1/continuum/working-directory/216/testutils/target/generated/src/main/resources/wsdl/type_test
     [xslt] Processing /x1/continuum/working-directory/216/testutils/src/main/resources/wsdl/type_test/type_test.xsd to /x1/continuum/working-directory/216/testutils/target/generated/src/main/resources/wsdl/type_test/type_test_1.xsd
     [xslt] Loading stylesheet /x1/continuum/working-directory/216/testutils/src/main/resources/wsdl/type_test/type_test_ID_xsd.xsl
     [xslt] Processing /x1/continuum/working-directory/216/testutils/src/main/resources/wsdl/type_test/type_test.xsd to /x1/continuum/working-directory/216/testutils/target/generated/src/main/resources/wsdl/type_test/type_test_2.xsd
     [xslt] Loading stylesheet /x1/continuum/working-directory/216/testutils/src/main/resources/wsdl/type_test/type_test_ID_xsd.xsl
     [xslt] Processing /x1/continuum/working-directory/216/testutils/src/main/resources/wsdl/type_test/type_test.xsd to /x1/continuum/working-directory/216/testutils/target/generated/src/main/resources/wsdl/type_test/type_test_3.xsd
     [xslt] Loading stylesheet /x1/continuum/working-directory/216/testutils/src/main/resources/wsdl/type_test/type_test_ID_xsd.xsl
     [xslt] Processing /x1/continuum/working-directory/216/testutils/src/main/resources/wsdl/type_test/type_test.xsd to /x1/continuum/working-directory/216/testutils/target/generated/src/main/resources/wsdl/type_test/type_test_doclit.wsdl
     [xslt] Loading stylesheet /x1/continuum/working-directory/216/testutils/src/main/resources/wsdl/type_test/type_test_wsdl.xsl
     [xslt] Processing /x1/continuum/working-directory/216/testutils/src/main/resources/wsdl/type_test/type_test.xsd to /x1/continuum/working-directory/216/testutils/target/generated/src/main/resources/wsdl/type_test/type_test_rpclit.wsdl
     [xslt] Loading stylesheet /x1/continuum/working-directory/216/testutils/src/main/resources/wsdl/type_test/type_test_wsdl.xsl
     [xslt] Processing /x1/continuum/working-directory/216/testutils/src/main/resources/wsdl/type_test/type_test.xsd to /x1/continuum/working-directory/216/testutils/target/generated/src/main/resources/wsdl/type_test/type_test_xml_inc.wsdl
     [xslt] Loading stylesheet /x1/continuum/working-directory/216/testutils/src/main/resources/wsdl/type_test/type_test_wsdl.xsl
     [xslt] Processing /x1/continuum/working-directory/216/testutils/src/main/resources/wsdl/type_test/type_test.xsd to /x1/continuum/working-directory/216/testutils/target/generated/src/main/resources/wsdl/type_test/type_test_xml.wsdl
     [xslt] Loading stylesheet /x1/continuum/working-directory/216/testutils/src/main/resources/wsdl/type_test/type_test_xml_wsdl.xsl
     [xslt] Processing /x1/continuum/working-directory/216/testutils/src/main/resources/wsdl/type_test/type_test.xsd to /x1/continuum/working-directory/216/testutils/target/generated/src/main/resources/wsdl/type_test/type_test_doclit_soap.wsdl
     [xslt] Loading stylesheet /x1/continuum/working-directory/216/testutils/src/main/resources/wsdl/type_test/type_test_soap_wsdl.xsl
     [xslt] Processing /x1/continuum/working-directory/216/testutils/src/main/resources/wsdl/type_test/type_test.xsd to /x1/continuum/working-directory/216/testutils/target/generated/src/main/resources/wsdl/type_test/type_test_rpclit_soap.wsdl
     [xslt] Loading stylesheet /x1/continuum/working-directory/216/testutils/src/main/resources/wsdl/type_test/type_test_soap_wsdl.xsl
    [mkdir] Created dir: /x1/continuum/working-directory/216/testutils/target/generated/src/main/java/org/apache/cxf/systest/type_test
     [xslt] Processing /x1/continuum/working-directory/216/testutils/src/main/resources/wsdl/type_test/type_test.xsd to /x1/continuum/working-directory/216/testutils/target/generated/src/main/java/org/apache/cxf/systest/type_test/TypeTestImpl.java
     [xslt] Loading stylesheet /x1/continuum/working-directory/216/testutils/src/main/resources/wsdl/type_test/type_test_impl_java.xsl
     [xslt] Processing /x1/continuum/working-directory/216/testutils/src/main/resources/wsdl/type_test/type_test.xsd to /x1/continuum/working-directory/216/testutils/target/generated/src/main/java/org/apache/cxf/systest/type_test/TypeTestTester.java
     [xslt] Loading stylesheet /x1/continuum/working-directory/216/testutils/src/main/resources/wsdl/type_test/type_test_tester_java.xsl
[INFO] Executed tasks
[INFO] Registering compile source root /x1/continuum/working-directory/216/testutils/target/generated/src/main/java
[INFO] [cxf-codegen:wsdl2java {execution: generate-sources}]
Jun 7, 2007 3:38:24 AM org.apache.cxf.tools.wsdlto.core.PluginLoader loadPlugin
INFO: Loading plugin jar:file:/x1/continuum/working-directory/216/tools/wsdlto/databinding/jaxb/target/cxf-tools-wsdlto-databinding-jaxb-2.0-incubator-SNAPSHOT.jar!/META-INF/tools-plugin.xml
Jun 7, 2007 3:38:24 AM org.apache.cxf.tools.wsdlto.core.PluginLoader loadPlugin
INFO: Found 1 databindings in <jaxb> plugin.
Jun 7, 2007 3:38:24 AM org.apache.cxf.tools.wsdlto.core.PluginLoader loadPlugin
INFO: Loading <jaxb> databinding from <jaxb> plugin.
Jun 7, 2007 3:38:24 AM org.apache.cxf.tools.wsdlto.core.PluginLoader loadPlugin
INFO: Loading plugin jar:file:/x1/continuum/working-directory/216/tools/wsdlto/frontend/jaxws/target/cxf-tools-wsdlto-frontend-jaxws-2.0-incubator-SNAPSHOT.jar!/META-INF/tools-plugin.xml
Jun 7, 2007 3:38:24 AM org.apache.cxf.tools.wsdlto.core.PluginLoader loadPlugin
INFO: Found 1 frontends in <jaxws> plugin.
Jun 7, 2007 3:38:24 AM org.apache.cxf.tools.wsdlto.core.PluginLoader loadPlugin
INFO: Loading <jaxws> frontend from <jaxws> plugin.
Jun 7, 2007 3:38:28 AM org.springframework.context.support.AbstractApplicationContext refresh
INFO: Refreshing org.apache.cxf.bus.spring.BusApplicationContext@1373dc1: display name [org.apache.cxf.bus.spring.BusApplicationContext@1373dc1]; startup date [Thu Jun 07 03:38:28 PDT 2007]; root of context hierarchy
Jun 7, 2007 3:38:29 AM org.apache.cxf.bus.spring.BusApplicationContext getConfigResources
INFO: Could not find the configuration file cxf.xml on the classpath.
Jun 7, 2007 3:38:29 AM org.springframework.beans.factory.xml.XmlBeanDefinitionReader loadBeanDefinitions
INFO: Loading XML bean definitions from class path resource [META-INF/cxf/cxf.xml]
Jun 7, 2007 3:38:29 AM org.springframework.context.support.AbstractApplicationContext refresh
INFO: Bean factory for application context [org.apache.cxf.bus.spring.BusApplicationContext@1373dc1]: org.springframework.beans.factory.support.DefaultListableBeanFactory@14df249
Jun 7, 2007 3:38:30 AM org.springframework.context.support.AbstractApplicationContext$BeanPostProcessorChecker postProcessAfterInitialization
INFO: Bean 'org.apache.cxf.bus.spring.Jsr250BeanPostProcessor' is not eligible for getting processed by all BeanPostProcessors (for example: not eligible for auto-proxying)
Jun 7, 2007 3:38:30 AM org.springframework.context.support.AbstractApplicationContext$BeanPostProcessorChecker postProcessAfterInitialization
INFO: Bean 'cxf' is not eligible for getting processed by all BeanPostProcessors (for example: not eligible for auto-proxying)
Jun 7, 2007 3:38:30 AM org.springframework.context.support.AbstractApplicationContext$BeanPostProcessorChecker postProcessAfterInitialization
INFO: Bean 'org.apache.cxf.bus.spring.BusExtensionPostProcessor' is not eligible for getting processed by all BeanPostProcessors (for example: not eligible for auto-proxying)
Jun 7, 2007 3:38:30 AM org.springframework.beans.factory.support.DefaultListableBeanFactory preInstantiateSingletons
INFO: Pre-instantiating singletons in org.springframework.beans.factory.support.DefaultListableBeanFactory@14df249: defining beans [cxf,org.apache.cxf.bus.spring.Jsr250BeanPostProcessor,org.apache.cxf.bus.spring.BusExtensionPostProcessor,org.apache.cxf.resource.ResourceManager,org.apache.cxf.binding.BindingFactoryManager,org.apache.cxf.transport.DestinationFactoryManager,org.apache.cxf.transport.ConduitInitiatorManager,org.apache.cxf.wsdl.WSDLManager,org.apache.cxf.phase.PhaseManager,org.apache.cxf.workqueue.WorkQueueManager,org.apache.cxf.buslifecycle.BusLifeCycleManager,org.apache.cxf.endpoint.ServerRegistry,org.apache.cxf.endpoint.ServerLifeCycleManager,org.apache.cxf.endpoint.ClientLifeCycleManager,org.apache.cxf.transports.http.QueryHandlerRegistry,org.apache.cxf.endpoint.EndpointResolverRegistry,org.apache.cxf.headers.HeaderManager,org.apache.cxf.catalog.OASISCatalogManager]; root of factory hierarchy
[INFO] [cxf-common-xsd:xsdtojava {execution: generate-sources}]
[INFO] [remote-resources:process {execution: default}]
[INFO] [resources:resources]
[INFO] Using default encoding to copy filtered resources.
[INFO] [compiler:compile]
[INFO] Compiling 1313 source files to /x1/continuum/working-directory/216/testutils/target/classes
[INFO] [resources:testResources]
[INFO] Using default encoding to copy filtered resources.
[INFO] [compiler:testCompile]
[INFO] Compiling 1 source file to /x1/continuum/working-directory/216/testutils/target/test-classes
[INFO] [surefire:test]
[INFO] Surefire report directory: /x1/continuum/working-directory/216/testutils/target/surefire-reports

-------------------------------------------------------
 T E S T S
-------------------------------------------------------
Running org.apache.header_test.rpc.TestRPCHeaderTest
Tests run: 2, Failures: 0, Errors: 0, Skipped: 0, Time elapsed: 0.184 sec

Results :

Tests run: 2, Failures: 0, Errors: 0, Skipped: 0

[INFO] [jar:jar]
[INFO] Building jar: /x1/continuum/working-directory/216/testutils/target/cxf-testutils-2.0-incubator-SNAPSHOT.jar
[INFO] [install:install]
[INFO] Installing /x1/continuum/working-directory/216/testutils/target/cxf-testutils-2.0-incubator-SNAPSHOT.jar to /home/continuum/.m2/repository/org/apache/cxf/cxf-testutils/2.0-incubator-SNAPSHOT/cxf-testutils-2.0-incubator-SNAPSHOT.jar
[INFO] ----------------------------------------------------------------------------
[INFO] Building Apache CXF Runtime JAXB DataBinding
[INFO]    task-segment: [clean, install]
[INFO] ----------------------------------------------------------------------------
[INFO] [clean:clean]
[INFO] Deleting directory /x1/continuum/working-directory/216/rt/databinding/jaxb/target
[INFO] Deleting directory /x1/continuum/working-directory/216/rt/databinding/jaxb/target/classes
[INFO] Deleting directory /x1/continuum/working-directory/216/rt/databinding/jaxb/target/test-classes
[INFO] [checkstyle:checkstyle {execution: validate}]
[INFO] Starting audit...
Audit done.

[INFO] Preparing pmd:check
[INFO] [pmd:pmd]
[INFO] [pmd:check {execution: validate}]
[INFO] 
[INFO] [remote-resources:process {execution: default}]
[INFO] [resources:resources]
[INFO] Using default encoding to copy filtered resources.
[INFO] [compiler:compile]
[INFO] Compiling 15 source files to /x1/continuum/working-directory/216/rt/databinding/jaxb/target/classes
[INFO] [cxf-common-xsd:xsdtojava {execution: generate-sources}]
[INFO] [dependency:unpack {execution: unpack-schemas}]
[INFO] Configured Artifact: org.apache.cxf:cxf-common-schemas:2.0-incubator-SNAPSHOT:jar
[INFO] Expanding: /home/continuum/.m2/repository/org/apache/cxf/cxf-common-schemas/2.0-incubator-SNAPSHOT/cxf-common-schemas-2.0-incubator-SNAPSHOT.jar into /x1/continuum/working-directory/216/rt/databinding/jaxb/target/generated/src/test/resources
[INFO] [resources:testResources]
[INFO] Using default encoding to copy filtered resources.
[INFO] [compiler:testCompile]
[INFO] Compiling 13 source files to /x1/continuum/working-directory/216/rt/databinding/jaxb/target/test-classes
[INFO] [surefire:test]
[INFO] Surefire report directory: /x1/continuum/working-directory/216/rt/databinding/jaxb/target/surefire-reports

-------------------------------------------------------
 T E S T S
-------------------------------------------------------
Running org.apache.cxf.jaxb.BareInInterceptorTest
Tests run: 4, Failures: 0, Errors: 0, Skipped: 0, Time elapsed: 9.134 sec
Running org.apache.cxf.jaxb.DocLiteralInInterceptorTest
Tests run: 3, Failures: 0, Errors: 0, Skipped: 0, Time elapsed: 2.637 sec
Running org.apache.cxf.jaxb.WrappedInInterceptorTest
Tests run: 2, Failures: 0, Errors: 0, Skipped: 0, Time elapsed: 0.63 sec
Running org.apache.cxf.jaxb.io.XMLStreamDataReaderTest
Tests run: 4, Failures: 0, Errors: 0, Skipped: 0, Time elapsed: 0.125 sec
Running org.apache.cxf.jaxb.io.XMLStreamDataWriterTest
Tests run: 5, Failures: 0, Errors: 0, Skipped: 0, Time elapsed: 0.196 sec
Running org.apache.cxf.jaxb.JAXBEncoderDecoderTest
Tests run: 9, Failures: 0, Errors: 0, Skipped: 0, Time elapsed: 0.903 sec
Running org.apache.cxf.jaxb.BareOutInterceptorTest
Tests run: 2, Failures: 0, Errors: 0, Skipped: 0, Time elapsed: 0.413 sec
Running org.apache.cxf.jaxb.JAXBDataBindingTest
Tests run: 5, Failures: 0, Errors: 0, Skipped: 0, Time elapsed: 1.977 sec

Results :

Tests run: 34, Failures: 0, Errors: 0, Skipped: 0

[INFO] [jar:jar]
[INFO] Building jar: /x1/continuum/working-directory/216/rt/databinding/jaxb/target/cxf-rt-databinding-jaxb-2.0-incubator-SNAPSHOT.jar
[INFO] [install:install]
[INFO] Installing /x1/continuum/working-directory/216/rt/databinding/jaxb/target/cxf-rt-databinding-jaxb-2.0-incubator-SNAPSHOT.jar to /home/continuum/.m2/repository/org/apache/cxf/cxf-rt-databinding-jaxb/2.0-incubator-SNAPSHOT/cxf-rt-databinding-jaxb-2.0-incubator-SNAPSHOT.jar
[INFO] ----------------------------------------------------------------------------
[INFO] Building Apache CXF Runtime SOAP Binding
[INFO]    task-segment: [clean, install]
[INFO] ----------------------------------------------------------------------------
[INFO] [clean:clean]
[INFO] Deleting directory /x1/continuum/working-directory/216/rt/bindings/soap/target
[INFO] Deleting directory /x1/continuum/working-directory/216/rt/bindings/soap/target/classes
[INFO] Deleting directory /x1/continuum/working-directory/216/rt/bindings/soap/target/test-classes
[INFO] [checkstyle:checkstyle {execution: validate}]
[INFO] Starting audit...
Audit done.

[INFO] Preparing pmd:check
[INFO] [pmd:pmd]
[INFO] [pmd:check {execution: validate}]
[INFO] 
[INFO] [remote-resources:process {execution: default}]
[INFO] [resources:resources]
[INFO] Using default encoding to copy filtered resources.
[INFO] [compiler:compile]
[INFO] Compiling 38 source files to /x1/continuum/working-directory/216/rt/bindings/soap/target/classes
[INFO] [resources:testResources]
[INFO] Using default encoding to copy filtered resources.
[INFO] [compiler:testCompile]
[INFO] Compiling 14 source files to /x1/continuum/working-directory/216/rt/bindings/soap/target/test-classes
[INFO] [surefire:test]
[INFO] Surefire report directory: /x1/continuum/working-directory/216/rt/bindings/soap/target/surefire-reports

-------------------------------------------------------
 T E S T S
-------------------------------------------------------
Running org.apache.cxf.binding.soap.SoapDestinationFactoryTest
Tests run: 1, Failures: 0, Errors: 0, Skipped: 0, Time elapsed: 0.172 sec
Running org.apache.cxf.binding.soap.RPCOutInterceptorTest
Tests run: 2, Failures: 0, Errors: 0, Skipped: 0, Time elapsed: 2.512 sec
Running org.apache.cxf.binding.soap.saaj.SAAJInInterceptorTest
Tests run: 1, Failures: 0, Errors: 0, Skipped: 0, Time elapsed: 5.207 sec
Running org.apache.cxf.binding.soap.SoapBindingTest
Tests run: 1, Failures: 0, Errors: 0, Skipped: 0, Time elapsed: 0.02 sec
Running org.apache.cxf.binding.soap.MustUnderstandInterceptorTest
Tests run: 3, Failures: 0, Errors: 0, Skipped: 0, Time elapsed: 0.672 sec
Running org.apache.cxf.binding.soap.interceptor.SoapFaultSerializerTest
Tests run: 3, Failures: 0, Errors: 0, Skipped: 0, Time elapsed: 3.014 sec
Running org.apache.cxf.binding.soap.SoapActionInterceptorTest
Tests run: 1, Failures: 0, Errors: 0, Skipped: 0, Time elapsed: 0.058 sec
Running org.apache.cxf.binding.soap.ServiceModelUtilTest
Tests run: 1, Failures: 0, Errors: 0, Skipped: 0, Time elapsed: 0.15 sec
Running org.apache.cxf.binding.soap.SoapBindingFactoryTest
Tests run: 2, Failures: 0, Errors: 0, Skipped: 0, Time elapsed: 0.672 sec
Running org.apache.cxf.binding.soap.RPCInInterceptorTest
Tests run: 2, Failures: 0, Errors: 0, Skipped: 0, Time elapsed: 0.417 sec
Running org.apache.cxf.binding.soap.ReadHeaderInterceptorTest
Tests run: 2, Failures: 0, Errors: 0, Skipped: 0, Time elapsed: 0.942 sec
Running org.apache.cxf.binding.soap.SoapOutInterceptorTest
Tests run: 1, Failures: 0, Errors: 0, Skipped: 0, Time elapsed: 0.017 sec

Results :

Tests run: 20, Failures: 0, Errors: 0, Skipped: 0

[INFO] [jar:jar]
[INFO] Building jar: /x1/continuum/working-directory/216/rt/bindings/soap/target/cxf-rt-bindings-soap-2.0-incubator-SNAPSHOT.jar
[INFO] [install:install]
[INFO] Installing /x1/continuum/working-directory/216/rt/bindings/soap/target/cxf-rt-bindings-soap-2.0-incubator-SNAPSHOT.jar to /home/continuum/.m2/repository/org/apache/cxf/cxf-rt-bindings-soap/2.0-incubator-SNAPSHOT/cxf-rt-bindings-soap-2.0-incubator-SNAPSHOT.jar
[INFO] ----------------------------------------------------------------------------
[INFO] Building Apache CXF Runtime Management
[INFO]    task-segment: [clean, install]
[INFO] ----------------------------------------------------------------------------
[INFO] [clean:clean]
[INFO] Deleting directory /x1/continuum/working-directory/216/rt/management/target
[INFO] Deleting directory /x1/continuum/working-directory/216/rt/management/target/classes
[INFO] Deleting directory /x1/continuum/working-directory/216/rt/management/target/test-classes
[INFO] [checkstyle:checkstyle {execution: validate}]
[INFO] Starting audit...
Audit done.

[INFO] Preparing pmd:check
[INFO] [pmd:pmd]
[INFO] [pmd:check {execution: validate}]
[INFO] 
[INFO] [cxf-common-xsd:xsdtojava {execution: generate-sources}]
[INFO] [remote-resources:process {execution: default}]
[INFO] [resources:resources]
[INFO] Using default encoding to copy filtered resources.
[INFO] [compiler:compile]
[INFO] Compiling 20 source files to /x1/continuum/working-directory/216/rt/management/target/classes
[INFO] [resources:testResources]
[INFO] Using default encoding to copy filtered resources.
[INFO] [compiler:testCompile]
[INFO] Compiling 13 source files to /x1/continuum/working-directory/216/rt/management/target/test-classes
[INFO] [surefire:test]
[INFO] Surefire report directory: /x1/continuum/working-directory/216/rt/management/target/surefire-reports

-------------------------------------------------------
 T E S T S
-------------------------------------------------------
Running org.apache.cxf.management.jmx.MBServerConnectorTest
Tests run: 1, Failures: 0, Errors: 0, Skipped: 0, Time elapsed: 1.742 sec
Running org.apache.cxf.management.interceptor.ResponseTimeMessageOutInterceptorTest
Tests run: 3, Failures: 0, Errors: 0, Skipped: 0, Time elapsed: 2.754 sec
Running org.apache.cxf.management.utils.ManagementConsoleTest
Tests run: 1, Failures: 0, Errors: 0, Skipped: 0, Time elapsed: 0.074 sec
Running org.apache.cxf.management.interceptor.ResponseTimeMessageInInterceptorTest
Tests run: 3, Failures: 0, Errors: 0, Skipped: 0, Time elapsed: 0.053 sec
Running org.apache.cxf.management.interceptor.ResponseTimeMessageInvokerInterceptorTest
Tests run: 1, Failures: 0, Errors: 0, Skipped: 0, Time elapsed: 0.086 sec
Running org.apache.cxf.management.counters.CounterRepositoryTest
Tests run: 3, Failures: 0, Errors: 0, Skipped: 0, Time elapsed: 0.222 sec
Running org.apache.cxf.management.InstrumentationManagerTest
Tests run: 2, Failures: 0, Errors: 0, Skipped: 0, Time elapsed: 4.988 sec
Running org.apache.cxf.management.jmx.export.ModelMBeanAssemblerTest
Tests run: 10, Failures: 0, Errors: 0, Skipped: 0, Time elapsed: 0.502 sec
Running org.apache.cxf.management.jmx.JMXManagedComponentManagerTest
Tests run: 2, Failures: 0, Errors: 0, Skipped: 0, Time elapsed: 4.138 sec

Results :

Tests run: 26, Failures: 0, Errors: 0, Skipped: 0

[INFO] [jar:jar]
[INFO] Building jar: /x1/continuum/working-directory/216/rt/management/target/cxf-rt-management-2.0-incubator-SNAPSHOT.jar
[INFO] [install:install]
[INFO] Installing /x1/continuum/working-directory/216/rt/management/target/cxf-rt-management-2.0-incubator-SNAPSHOT.jar to /home/continuum/.m2/repository/org/apache/cxf/cxf-rt-management/2.0-incubator-SNAPSHOT/cxf-rt-management-2.0-incubator-SNAPSHOT.jar
[INFO] ----------------------------------------------------------------------------
[INFO] Building Apache CXF Runtime JMS Transport
[INFO]    task-segment: [clean, install]
[INFO] ----------------------------------------------------------------------------
[INFO] [clean:clean]
[INFO] Deleting directory /x1/continuum/working-directory/216/rt/transports/jms/target
[INFO] Deleting directory /x1/continuum/working-directory/216/rt/transports/jms/target/classes
[INFO] Deleting directory /x1/continuum/working-directory/216/rt/transports/jms/target/test-classes
[INFO] [checkstyle:checkstyle {execution: validate}]
[INFO] Starting audit...
Audit done.

[INFO] Preparing pmd:check
[INFO] [pmd:pmd]
[INFO] [pmd:check {execution: validate}]
[INFO] 
[INFO] [cxf-common-xsd:xsdtojava {execution: generate-sources}]
[INFO] [remote-resources:process {execution: default}]
[INFO] [resources:resources]
[INFO] Using default encoding to copy filtered resources.
[INFO] [compiler:compile]
[INFO] Compiling 27 source files to /x1/continuum/working-directory/216/rt/transports/jms/target/classes
[INFO] [resources:testResources]
[INFO] Using default encoding to copy filtered resources.
[INFO] [compiler:testCompile]
[INFO] Compiling 6 source files to /x1/continuum/working-directory/216/rt/transports/jms/target/test-classes
[INFO] [surefire:test]
[INFO] Surefire report directory: /x1/continuum/working-directory/216/rt/transports/jms/target/surefire-reports

-------------------------------------------------------
 T E S T S
-------------------------------------------------------
Running org.apache.cxf.transport.jms.JMSConduitTest
Tests run: 3, Failures: 0, Errors: 0, Skipped: 0, Time elapsed: 16.306 sec
Running org.apache.cxf.transport.jms.PooledSessionTest
Tests run: 1, Failures: 0, Errors: 0, Skipped: 0, Time elapsed: 0.269 sec
Running org.apache.cxf.transport.jms.JMSDestinationTest
Tests run: 7, Failures: 0, Errors: 0, Skipped: 0, Time elapsed: 25.216 sec
Running org.apache.cxf.transport.jms.JMSUtilsTest
Tests run: 1, Failures: 0, Errors: 0, Skipped: 0, Time elapsed: 0.012 sec

Results :

Tests run: 12, Failures: 0, Errors: 0, Skipped: 0

[INFO] [jar:jar]
[INFO] Building jar: /x1/continuum/working-directory/216/rt/transports/jms/target/cxf-rt-transports-jms-2.0-incubator-SNAPSHOT.jar
[INFO] [install:install]
[INFO] Installing /x1/continuum/working-directory/216/rt/transports/jms/target/cxf-rt-transports-jms-2.0-incubator-SNAPSHOT.jar to /home/continuum/.m2/repository/org/apache/cxf/cxf-rt-transports-jms/2.0-incubator-SNAPSHOT/cxf-rt-transports-jms-2.0-incubator-SNAPSHOT.jar
[INFO] ----------------------------------------------------------------------------
[INFO] Building Apache CXF Runtime XML Binding
[INFO]    task-segment: [clean, install]
[INFO] ----------------------------------------------------------------------------
[INFO] [clean:clean]
[INFO] Deleting directory /x1/continuum/working-directory/216/rt/bindings/xml/target
[INFO] Deleting directory /x1/continuum/working-directory/216/rt/bindings/xml/target/classes
[INFO] Deleting directory /x1/continuum/working-directory/216/rt/bindings/xml/target/test-classes
[INFO] [checkstyle:checkstyle {execution: validate}]
[INFO] Starting audit...
Audit done.

[INFO] Preparing pmd:check
[INFO] [pmd:pmd]
[INFO] [pmd:check {execution: validate}]
[INFO] 
[INFO] [cxf-common-xsd:xsdtojava {execution: generate-sources}]
[INFO] [remote-resources:process {execution: default}]
[INFO] [resources:resources]
[INFO] Using default encoding to copy filtered resources.
[INFO] [compiler:compile]
[INFO] Compiling 17 source files to /x1/continuum/working-directory/216/rt/bindings/xml/target/classes
[INFO] [resources:testResources]
[INFO] Using default encoding to copy filtered resources.
[INFO] [compiler:testCompile]
[INFO] Compiling 6 source files to /x1/continuum/working-directory/216/rt/bindings/xml/target/test-classes
[INFO] [surefire:test]
[INFO] Surefire report directory: /x1/continuum/working-directory/216/rt/bindings/xml/target/surefire-reports

-------------------------------------------------------
 T E S T S
-------------------------------------------------------
Running org.apache.cxf.binding.xml.interceptor.XMLMessageOutInterceptorTest
Tests run: 3, Failures: 0, Errors: 0, Skipped: 0, Time elapsed: 5.59 sec
Running org.apache.cxf.binding.xml.interceptor.XMLMessageInInterceptorTest
Tests run: 3, Failures: 0, Errors: 0, Skipped: 0, Time elapsed: 0.64 sec
Running org.apache.cxf.binding.xml.interceptor.XMLFaultInterceptorsTest
Tests run: 1, Failures: 0, Errors: 0, Skipped: 0, Time elapsed: 0.156 sec
Running org.apache.cxf.binding.xml.interceptor.XMLFaultOutInterceptorTest
Tests run: 1, Failures: 0, Errors: 0, Skipped: 0, Time elapsed: 0.047 sec
Running org.apache.cxf.binding.xml.XMLBindingFactoryTest
Tests run: 1, Failures: 0, Errors: 0, Skipped: 0, Time elapsed: 0.011 sec

Results :

Tests run: 9, Failures: 0, Errors: 0, Skipped: 0

[INFO] [jar:jar]
[INFO] Building jar: /x1/continuum/working-directory/216/rt/bindings/xml/target/cxf-rt-bindings-xml-2.0-incubator-SNAPSHOT.jar
[INFO] [install:install]
[INFO] Installing /x1/continuum/working-directory/216/rt/bindings/xml/target/cxf-rt-bindings-xml-2.0-incubator-SNAPSHOT.jar to /home/continuum/.m2/repository/org/apache/cxf/cxf-rt-bindings-xml/2.0-incubator-SNAPSHOT/cxf-rt-bindings-xml-2.0-incubator-SNAPSHOT.jar
[INFO] ----------------------------------------------------------------------------
[INFO] Building Apache CXF Command Line Tools WSDLTo Test
[INFO]    task-segment: [clean, install]
[INFO] ----------------------------------------------------------------------------
[INFO] [clean:clean]
[INFO] Deleting directory /x1/continuum/working-directory/216/tools/wsdlto/test/target
[INFO] Deleting directory /x1/continuum/working-directory/216/tools/wsdlto/test/target/classes
[INFO] Deleting directory /x1/continuum/working-directory/216/tools/wsdlto/test/target/test-classes
[INFO] [checkstyle:checkstyle {execution: validate}]
[INFO] Starting audit...
Audit done.

[INFO] Preparing pmd:check
[INFO] [pmd:pmd]
[INFO] [pmd:check {execution: validate}]
[INFO] 
[INFO] [remote-resources:process {execution: default}]
[INFO] [resources:resources]
[INFO] Using default encoding to copy filtered resources.
[INFO] [compiler:compile]
[INFO] No sources to compile
[INFO] [resources:testResources]
[INFO] Using default encoding to copy filtered resources.
[INFO] [compiler:testCompile]
[INFO] Compiling 8 source files to /x1/continuum/working-directory/216/tools/wsdlto/test/target/test-classes
[INFO] [surefire:test]
[INFO] Surefire report directory: /x1/continuum/working-directory/216/tools/wsdlto/test/target/surefire-reports

-------------------------------------------------------
 T E S T S
-------------------------------------------------------
Running org.apache.cxf.tools.wsdlto.WSDLToJavaTest
Tests run: 3, Failures: 0, Errors: 0, Skipped: 0, Time elapsed: 1.366 sec
Running org.apache.cxf.tools.wsdlto.jaxws.wsdl11.JAXWSDefinitionBuilderTest
Tests run: 2, Failures: 0, Errors: 0, Skipped: 0, Time elapsed: 1.245 sec
Running org.apache.cxf.tools.wsdlto.jaxws.CodeGenOptionTest
Tests run: 3, Failures: 0, Errors: 0, Skipped: 0, Time elapsed: 15.281 sec
Running org.apache.cxf.tools.wsdlto.validator.ValidatorTest
Tests run: 1, Failures: 0, Errors: 0, Skipped: 0, Time elapsed: 0.212 sec
Running org.apache.cxf.tools.wsdlto.jaxws.JAXWSContainerTest
Tests run: 2, Failures: 0, Errors: 0, Skipped: 0, Time elapsed: 2.52 sec
Running org.apache.cxf.tools.wsdlto.core.PluginLoaderTest
Tests run: 1, Failures: 0, Errors: 0, Skipped: 0, Time elapsed: 0.019 sec
Running org.apache.cxf.tools.wsdlto.jaxws.CodeGenBugTest
2007-06-07 03:45:39.970::INFO:  Logging to STDERR via org.mortbay.log.StdErrLog
2007-06-07 03:45:40.309::INFO:  jetty-6.1.3
2007-06-07 03:45:40.475::INFO:  Started SocketConnector @ 0.0.0.0:8585
Tests run: 26, Failures: 0, Errors: 0, Skipped: 0, Time elapsed: 81.863 sec
Running org.apache.cxf.tools.wsdlto.jaxws.CodeGenTest
Tests run: 28, Failures: 0, Errors: 0, Skipped: 1, Time elapsed: 91.048 sec

Results :

Tests run: 66, Failures: 0, Errors: 0, Skipped: 1

[INFO] [jar:jar]
[INFO] Building jar: /x1/continuum/working-directory/216/tools/wsdlto/test/target/cxf-tools-wsdlto-test-2.0-incubator-SNAPSHOT.jar
[INFO] [install:install]
[INFO] Installing /x1/continuum/working-directory/216/tools/wsdlto/test/target/cxf-tools-wsdlto-test-2.0-incubator-SNAPSHOT.jar to /home/continuum/.m2/repository/org/apache/cxf/cxf-tools-wsdlto-test/2.0-incubator-SNAPSHOT/cxf-tools-wsdlto-test-2.0-incubator-SNAPSHOT.jar
[INFO] ----------------------------------------------------------------------------
[INFO] Building Apache CXF Command Line Tools WSDLTo Misctools
[INFO]    task-segment: [clean, install]
[INFO] ----------------------------------------------------------------------------
[INFO] [clean:clean]
[INFO] Deleting directory /x1/continuum/working-directory/216/tools/wsdlto/misc/target
[INFO] Deleting directory /x1/continuum/working-directory/216/tools/wsdlto/misc/target/classes
[INFO] Deleting directory /x1/continuum/working-directory/216/tools/wsdlto/misc/target/test-classes
[INFO] [checkstyle:checkstyle {execution: validate}]
[INFO] Starting audit...
Audit done.

[INFO] Preparing pmd:check
[INFO] [pmd:pmd]
[INFO] [pmd:check {execution: validate}]
[INFO] 
[INFO] [remote-resources:process {execution: default}]
[INFO] [resources:resources]
[INFO] Using default encoding to copy filtered resources.
[INFO] [compiler:compile]
[INFO] Compiling 14 source files to /x1/continuum/working-directory/216/tools/wsdlto/misc/target/classes
[INFO] [resources:testResources]
[INFO] Using default encoding to copy filtered resources.
[INFO] [compiler:testCompile]
[INFO] Compiling 4 source files to /x1/continuum/working-directory/216/tools/wsdlto/misc/target/test-classes
[INFO] [surefire:test]
[INFO] Surefire report directory: /x1/continuum/working-directory/216/tools/wsdlto/misc/target/surefire-reports

-------------------------------------------------------
 T E S T S
-------------------------------------------------------
Running org.apache.cxf.tools.misc.processor.WSDLToServiceProcessorTest
Tests run: 6, Failures: 0, Errors: 0, Skipped: 0, Time elapsed: 8.523 sec
Running org.apache.cxf.tools.misc.processor.WSDLToXMLProcessorTest
Tests run: 1, Failures: 0, Errors: 0, Skipped: 0, Time elapsed: 0.736 sec
Running org.apache.cxf.tools.misc.processor.XSDToWSDLProcessorTest
Tests run: 2, Failures: 0, Errors: 0, Skipped: 0, Time elapsed: 0.508 sec
Running org.apache.cxf.tools.misc.processor.WSDLToSoapProcessorTest
Tests run: 9, Failures: 0, Errors: 0, Skipped: 0, Time elapsed: 2.94 sec

Results :

Tests run: 18, Failures: 0, Errors: 0, Skipped: 0

[INFO] [jar:jar]
[INFO] Building jar: /x1/continuum/working-directory/216/tools/wsdlto/misc/target/cxf-tools-misctools-2.0-incubator-SNAPSHOT.jar
[INFO] [install:install]
[INFO] Installing /x1/continuum/working-directory/216/tools/wsdlto/misc/target/cxf-tools-misctools-2.0-incubator-SNAPSHOT.jar to /home/continuum/.m2/repository/org/apache/cxf/cxf-tools-misctools/2.0-incubator-SNAPSHOT/cxf-tools-misctools-2.0-incubator-SNAPSHOT.jar
[INFO] ----------------------------------------------------------------------------
[INFO] Building Apache CXF Command Line Tools
[INFO]    task-segment: [clean, install]
[INFO] ----------------------------------------------------------------------------
[INFO] [clean:clean]
[INFO] Deleting directory /x1/continuum/working-directory/216/tools/target
[INFO] Deleting directory /x1/continuum/working-directory/216/tools/target/classes
[INFO] Deleting directory /x1/continuum/working-directory/216/tools/target/test-classes
[INFO] [site:attach-descriptor]
[INFO] [install:install]
[INFO] Installing /x1/continuum/working-directory/216/tools/pom.xml to /home/continuum/.m2/repository/org/apache/cxf/cxf-tools/2.0-incubator-SNAPSHOT/cxf-tools-2.0-incubator-SNAPSHOT.pom
[INFO] ----------------------------------------------------------------------------
[INFO] Building Apache CXF Command Line Tools WSDLTo
[INFO]    task-segment: [clean, install]
[INFO] ----------------------------------------------------------------------------
[INFO] [clean:clean]
[INFO] Deleting directory /x1/continuum/working-directory/216/tools/wsdlto/target
[INFO] Deleting directory /x1/continuum/working-directory/216/tools/wsdlto/target/classes
[INFO] Deleting directory /x1/continuum/working-directory/216/tools/wsdlto/target/test-classes
[INFO] [site:attach-descriptor]
[INFO] [install:install]
[INFO] Installing /x1/continuum/working-directory/216/tools/wsdlto/pom.xml to /home/continuum/.m2/repository/org/apache/cxf/cxf-tools-wsdlto/2.0-incubator-SNAPSHOT/cxf-tools-wsdlto-2.0-incubator-SNAPSHOT.pom
[INFO] ----------------------------------------------------------------------------
[INFO] Building Apache CXF Runtime Local transport
[INFO]    task-segment: [clean, install]
[INFO] ----------------------------------------------------------------------------
[INFO] [clean:clean]
[INFO] Deleting directory /x1/continuum/working-directory/216/rt/transports/local/target
[INFO] Deleting directory /x1/continuum/working-directory/216/rt/transports/local/target/classes
[INFO] Deleting directory /x1/continuum/working-directory/216/rt/transports/local/target/test-classes
[INFO] [checkstyle:checkstyle {execution: validate}]
[INFO] Starting audit...
Audit done.

[INFO] Preparing pmd:check
[INFO] [pmd:pmd]
[INFO] [pmd:check {execution: validate}]
[INFO] 
[INFO] [remote-resources:process {execution: default}]
[INFO] [resources:resources]
[INFO] Using default encoding to copy filtered resources.
[INFO] [compiler:compile]
[INFO] Compiling 3 source files to /x1/continuum/working-directory/216/rt/transports/local/target/classes
[INFO] [resources:testResources]
[INFO] Using default encoding to copy filtered resources.
[INFO] [compiler:testCompile]
[INFO] Compiling 1 source file to /x1/continuum/working-directory/216/rt/transports/local/target/test-classes
[INFO] [surefire:test]
[INFO] Surefire report directory: /x1/continuum/working-directory/216/rt/transports/local/target/surefire-reports

-------------------------------------------------------
 T E S T S
-------------------------------------------------------
Running org.apache.cxf.transport.local.LocalTransportFactoryTest
Tests run: 2, Failures: 0, Errors: 0, Skipped: 0, Time elapsed: 0.364 sec

Results :

Tests run: 2, Failures: 0, Errors: 0, Skipped: 0

[INFO] [jar:jar]
[INFO] Building jar: /x1/continuum/working-directory/216/rt/transports/local/target/cxf-rt-transports-local-2.0-incubator-SNAPSHOT.jar
[INFO] [install:install]
[INFO] Installing /x1/continuum/working-directory/216/rt/transports/local/target/cxf-rt-transports-local-2.0-incubator-SNAPSHOT.jar to /home/continuum/.m2/repository/org/apache/cxf/cxf-rt-transports-local/2.0-incubator-SNAPSHOT/cxf-rt-transports-local-2.0-incubator-SNAPSHOT.jar
[INFO] ----------------------------------------------------------------------------
[INFO] Building Apache CXF Runtime Simple Frontend
[INFO]    task-segment: [clean, install]
[INFO] ----------------------------------------------------------------------------
[INFO] [clean:clean]
[INFO] Deleting directory /x1/continuum/working-directory/216/rt/frontend/simple/target
[INFO] Deleting directory /x1/continuum/working-directory/216/rt/frontend/simple/target/classes
[INFO] Deleting directory /x1/continuum/working-directory/216/rt/frontend/simple/target/test-classes
[INFO] [checkstyle:checkstyle {execution: validate}]
[INFO] Starting audit...
Audit done.

[INFO] Preparing pmd:check
[INFO] [pmd:pmd]
[INFO] [pmd:check {execution: validate}]
[INFO] 
[INFO] [remote-resources:process {execution: default}]
[INFO] [resources:resources]
[INFO] Using default encoding to copy filtered resources.
[INFO] [compiler:compile]
[INFO] Compiling 12 source files to /x1/continuum/working-directory/216/rt/frontend/simple/target/classes
[INFO] [resources:testResources]
[INFO] Using default encoding to copy filtered resources.
[INFO] [compiler:testCompile]
[INFO] Compiling 9 source files to /x1/continuum/working-directory/216/rt/frontend/simple/target/test-classes
[INFO] [surefire:test]
[INFO] Surefire report directory: /x1/continuum/working-directory/216/rt/frontend/simple/target/surefire-reports

-------------------------------------------------------
 T E S T S
-------------------------------------------------------
Running org.apache.cxf.frontend.spring.SpringBeansTest
Tests run: 2, Failures: 0, Errors: 0, Skipped: 0, Time elapsed: 12.306 sec
Running org.apache.cxf.service.factory.ClientFactoryBeanTest
Tests run: 1, Failures: 0, Errors: 0, Skipped: 0, Time elapsed: 1.138 sec
Running org.apache.cxf.frontend.soap.SoapBindingSelectionTest
Tests run: 1, Failures: 0, Errors: 0, Skipped: 0, Time elapsed: 2.036 sec
Running org.apache.cxf.service.factory.ServerFactoryTest
Tests run: 1, Failures: 0, Errors: 0, Skipped: 0, Time elapsed: 0.607 sec
Running org.apache.cxf.service.factory.ReflectionServiceFactoryTest
Tests run: 3, Failures: 0, Errors: 0, Skipped: 0, Time elapsed: 2.63 sec
Running org.apache.cxf.service.factory.RountripTest
Tests run: 1, Failures: 0, Errors: 0, Skipped: 0, Time elapsed: 0.996 sec

Results :

Tests run: 9, Failures: 0, Errors: 0, Skipped: 0

[INFO] [jar:jar]
[INFO] Building jar: /x1/continuum/working-directory/216/rt/frontend/simple/target/cxf-rt-frontend-simple-2.0-incubator-SNAPSHOT.jar
[INFO] [install:install]
[INFO] Installing /x1/continuum/working-directory/216/rt/frontend/simple/target/cxf-rt-frontend-simple-2.0-incubator-SNAPSHOT.jar to /home/continuum/.m2/repository/org/apache/cxf/cxf-rt-frontend-simple/2.0-incubator-SNAPSHOT/cxf-rt-frontend-simple-2.0-incubator-SNAPSHOT.jar
[INFO] ----------------------------------------------------------------------------
[INFO] Building Apache CXF Runtime JAX-WS Frontend
[INFO]    task-segment: [clean, install]
[INFO] ----------------------------------------------------------------------------
[INFO] [clean:clean]
[INFO] Deleting directory /x1/continuum/working-directory/216/rt/frontend/jaxws/target
[INFO] Deleting directory /x1/continuum/working-directory/216/rt/frontend/jaxws/target/classes
[INFO] Deleting directory /x1/continuum/working-directory/216/rt/frontend/jaxws/target/test-classes
[INFO] [checkstyle:checkstyle {execution: validate}]
[INFO] Starting audit...
Audit done.

[INFO] Preparing pmd:check
[INFO] [pmd:pmd]
[INFO] [pmd:check {execution: validate}]
[INFO] 
[INFO] [build-helper:add-source {execution: add-source}]
[INFO] Source directory: /x1/continuum/working-directory/216/rt/frontend/jaxws/src/main/generated added.
[INFO] [remote-resources:process {execution: default}]
[INFO] [resources:resources]
[INFO] Using default encoding to copy filtered resources.
[INFO] [compiler:compile]
[INFO] Compiling 133 source files to /x1/continuum/working-directory/216/rt/frontend/jaxws/target/classes
[INFO] [resources:testResources]
[INFO] Using default encoding to copy filtered resources.
[INFO] [compiler:testCompile]
[INFO] Compiling 57 source files to /x1/continuum/working-directory/216/rt/frontend/jaxws/target/test-classes
[INFO] [surefire:test]
[INFO] Surefire report directory: /x1/continuum/working-directory/216/rt/frontend/jaxws/target/surefire-reports

-------------------------------------------------------
 T E S T S
-------------------------------------------------------
Running org.apache.cxf.jaxws.JaxWsClientTest
Tests run: 3, Failures: 0, Errors: 0, Skipped: 0, Time elapsed: 12.929 sec
Running org.apache.cxf.jaxws.header.HeaderClientServerTest
Tests run: 9, Failures: 0, Errors: 0, Skipped: 0, Time elapsed: 16.095 sec
Running org.apache.cxf.jaxws.SOAPBindingTest
Tests run: 2, Failures: 0, Errors: 0, Skipped: 0, Time elapsed: 1.865 sec
Running org.apache.cxf.jaxws.holder.HolderTest
Tests run: 2, Failures: 0, Errors: 0, Skipped: 0, Time elapsed: 3.618 sec
Running org.apache.cxf.jaxws.provider.ProviderServiceFactoryTest
Tests run: 6, Failures: 0, Errors: 0, Skipped: 0, Time elapsed: 5.368 sec
Running org.apache.cxf.jaxws.javaee.WebservicesTypeTest
Tests run: 1, Failures: 0, Errors: 0, Skipped: 0, Time elapsed: 0.677 sec
Running org.apache.cxf.jaxws.ServiceModelUtilsTest
Tests run: 4, Failures: 0, Errors: 0, Skipped: 0, Time elapsed: 3.566 sec
Running org.apache.cxf.jaxws.handler.InitParamResourceResolverTest
Tests run: 8, Failures: 0, Errors: 0, Skipped: 0, Time elapsed: 0.081 sec
Running org.apache.cxf.jaxws.HeaderTest
Tests run: 1, Failures: 0, Errors: 0, Skipped: 0, Time elapsed: 1.118 sec
Running org.apache.cxf.jaxws.handler.AbstractProtocolHandlerInterceptorTest
Tests run: 2, Failures: 0, Errors: 0, Skipped: 0, Time elapsed: 1.308 sec
Running org.apache.cxf.jaxws.handler.soap.SOAPHandlerInterceptorTest
Tests run: 5, Failures: 0, Errors: 0, Skipped: 0, Time elapsed: 0.615 sec
Running org.apache.cxf.jaxws.GreeterTest
Tests run: 1, Failures: 0, Errors: 0, Skipped: 0, Time elapsed: 1.177 sec
Running org.apache.cxf.jaxws.CodeFirstTest
Tests run: 8, Failures: 0, Errors: 0, Skipped: 0, Time elapsed: 7.836 sec
Running org.apache.cxf.jaxws.spring.SpringBeansTest
Tests run: 3, Failures: 0, Errors: 0, Skipped: 0, Time elapsed: 6.366 sec
Running org.apache.cxf.jaxws.handler.LogicalHandlerInterceptorTest
Tests run: 1, Failures: 0, Errors: 0, Skipped: 0, Time elapsed: 0.073 sec
Running org.apache.cxf.jaxws.context.WebServiceContextImplTest
Tests run: 2, Failures: 0, Errors: 0, Skipped: 0, Time elapsed: 0.04 sec
Running org.apache.cxf.jaxws.JAXWSMethodInvokerTest
Tests run: 1, Failures: 0, Errors: 0, Skipped: 0, Time elapsed: 0.11 sec
Running org.apache.cxf.jaxws.SoapFaultTest
Tests run: 2, Failures: 0, Errors: 0, Skipped: 0, Time elapsed: 2.831 sec
Running org.apache.cxf.jaxws.provider.ProviderTest
Tests run: 1, Failures: 0, Errors: 0, Skipped: 0, Time elapsed: 0.9 sec
Running org.apache.cxf.jaxws.ServiceImplTest
Tests run: 10, Failures: 0, Errors: 0, Skipped: 1, Time elapsed: 6.252 sec
Running org.apache.cxf.jaxws.support.JaxWsServiceFactoryBeanTest
Tests run: 3, Failures: 0, Errors: 0, Skipped: 0, Time elapsed: 2.831 sec
Running org.apache.cxf.jaxws.dispatch.DispatchTest
Tests run: 5, Failures: 0, Errors: 0, Skipped: 0, Time elapsed: 3.309 sec
Running org.apache.cxf.jaxws.handler.AnnotationHandlerChainBuilderTest
Tests run: 2, Failures: 0, Errors: 0, Skipped: 0, Time elapsed: 1.984 sec
Running org.apache.cxf.jaxws.ConfiguredEndpointTest
Tests run: 8, Failures: 0, Errors: 0, Skipped: 2, Time elapsed: 4.95 sec
Running org.apache.cxf.jaxws.support.ContextPropertiesMappingTest
Tests run: 5, Failures: 0, Errors: 0, Skipped: 0, Time elapsed: 0.049 sec
Running org.apache.cxf.jaxws.JaxWsServerFactoryBeanTest
Tests run: 4, Failures: 0, Errors: 0, Skipped: 0, Time elapsed: 2.876 sec
Running org.apache.cxf.jaxws.CodeFirstWSDLTest
Tests run: 2, Failures: 0, Errors: 0, Skipped: 0, Time elapsed: 1.568 sec
Running org.apache.cxf.jaxws.URIMappingInterceptorDocLitTest
Tests run: 5, Failures: 0, Errors: 0, Skipped: 0, Time elapsed: 2.994 sec
Running org.apache.cxf.jaxws.support.JaxWsImplementorInfoTest
Tests run: 1, Failures: 0, Errors: 0, Skipped: 0, Time elapsed: 0.015 sec
Running org.apache.cxf.jaxws.support.JaxWsServiceConfigurationTest
Tests run: 6, Failures: 0, Errors: 0, Skipped: 0, Time elapsed: 0.084 sec
Running org.apache.cxf.jaxws.handler.HandlerChainInvokerTest
Tests run: 22, Failures: 0, Errors: 0, Skipped: 0, Time elapsed: 0.173 sec
Running org.apache.cxf.jaxws.handler.LogicalMessageImplTest
Tests run: 1, Failures: 0, Errors: 0, Skipped: 0, Time elapsed: 0.043 sec
Running org.apache.cxf.jaxws.EndpointImplTest
Tests run: 5, Failures: 0, Errors: 0, Skipped: 0, Time elapsed: 3.463 sec
Running org.apache.cxf.jaxws.handler.HandlerChainBuilderTest
Tests run: 5, Failures: 0, Errors: 0, Skipped: 0, Time elapsed: 0.05 sec
Running org.apache.cxf.jaxws.URIMappingInterceptorRPCTest
Tests run: 6, Failures: 0, Errors: 0, Skipped: 0, Time elapsed: 4.099 sec

Results :

Tests run: 152, Failures: 0, Errors: 0, Skipped: 3

[INFO] [jar:jar]
[INFO] Building jar: /x1/continuum/working-directory/216/rt/frontend/jaxws/target/cxf-rt-frontend-jaxws-2.0-incubator-SNAPSHOT.jar
[INFO] [install:install]
[INFO] Installing /x1/continuum/working-directory/216/rt/frontend/jaxws/target/cxf-rt-frontend-jaxws-2.0-incubator-SNAPSHOT.jar to /home/continuum/.m2/repository/org/apache/cxf/cxf-rt-frontend-jaxws/2.0-incubator-SNAPSHOT/cxf-rt-frontend-jaxws-2.0-incubator-SNAPSHOT.jar
[INFO] ----------------------------------------------------------------------------
[INFO] Building Apache CXF Command Line Tools JavaTo
[INFO]    task-segment: [clean, install]
[INFO] ----------------------------------------------------------------------------
[INFO] [clean:clean]
[INFO] Deleting directory /x1/continuum/working-directory/216/tools/javato/target
[INFO] Deleting directory /x1/continuum/working-directory/216/tools/javato/target/classes
[INFO] Deleting directory /x1/continuum/working-directory/216/tools/javato/target/test-classes
[INFO] [checkstyle:checkstyle {execution: validate}]
[INFO] Starting audit...
Audit done.

[INFO] Preparing pmd:check
[INFO] [pmd:pmd]
[INFO] [pmd:check {execution: validate}]
[INFO] 
[INFO] [remote-resources:process {execution: default}]
[INFO] [resources:resources]
[INFO] Using default encoding to copy filtered resources.
[INFO] [compiler:compile]
[INFO] Compiling 22 source files to /x1/continuum/working-directory/216/tools/javato/target/classes
[INFO] [cxf-codegen:wsdl2java {execution: generate-test-sources}]
[INFO] [resources:testResources]
[INFO] Using default encoding to copy filtered resources.
[INFO] [compiler:testCompile]
[INFO] Compiling 119 source files to /x1/continuum/working-directory/216/tools/javato/target/test-classes
[INFO] [surefire:test]
[INFO] Surefire report directory: /x1/continuum/working-directory/216/tools/javato/target/surefire-reports

-------------------------------------------------------
 T E S T S
-------------------------------------------------------
Running org.apache.cxf.tools.java2wsdl.generator.WSDLGeneratorFactoryTest
Tests run: 1, Failures: 0, Errors: 0, Skipped: 0, Time elapsed: 0.161 sec
Running org.apache.cxf.tools.java2wsdl.processor.internal.jaxws.FaultBeanTest
Tests run: 1, Failures: 0, Errors: 0, Skipped: 0, Time elapsed: 0.172 sec
Running org.apache.cxf.tools.java2wsdl.processor.internal.jaxws.RequestWrapperTest
Tests run: 4, Failures: 0, Errors: 0, Skipped: 0, Time elapsed: 9.044 sec
Running org.apache.cxf.tools.java2wsdl.generator.wsdl11.annotator.WrapperBeanAnnotatorTest
Tests run: 1, Failures: 0, Errors: 0, Skipped: 0, Time elapsed: 0.026 sec
Running org.apache.cxf.tools.java2wsdl.generator.wsdl11.WrapperBeanGeneratorTest
Tests run: 2, Failures: 0, Errors: 0, Skipped: 0, Time elapsed: 12.368 sec
Running org.apache.cxf.tools.java2wsdl.generator.wsdl11.annotator.WrapperBeanFieldAnnotatorTest
Tests run: 1, Failures: 0, Errors: 0, Skipped: 0, Time elapsed: 0.019 sec
Running org.apache.cxf.tools.java2wsdl.processor.FrontendFactoryTest
Tests run: 3, Failures: 0, Errors: 0, Skipped: 0, Time elapsed: 0.311 sec
Running org.apache.cxf.tools.java2wsdl.processor.internal.jaxws.WrapperTest
Tests run: 3, Failures: 0, Errors: 0, Skipped: 0, Time elapsed: 0.092 sec
Running org.apache.cxf.tools.java2wsdl.processor.internal.jaxws.JaxwsServiceBuilderRPCTest
Tests run: 1, Failures: 0, Errors: 0, Skipped: 1, Time elapsed: 0.006 sec
Running org.apache.cxf.tools.java2wsdl.processor.internal.jaxws.JaxwsServiceBuilderTest
Tests run: 1, Failures: 0, Errors: 0, Skipped: 1, Time elapsed: 0.02 sec
Running org.apache.cxf.tools.java2wsdl.processor.JavaToProcessorTest
Tests run: 14, Failures: 0, Errors: 0, Skipped: 2, Time elapsed: 57.824 sec
Running org.apache.cxf.tools.java2wsdl.processor.internal.jaxws.WrapperUtilTest
Tests run: 2, Failures: 0, Errors: 0, Skipped: 0, Time elapsed: 0.287 sec
Running org.apache.cxf.tools.java2wsdl.processor.internal.jaxws.JaxwsServiceBuilderNoAnnoTest
Tests run: 3, Failures: 0, Errors: 0, Skipped: 0, Time elapsed: 0.613 sec
Running org.apache.cxf.tools.java2wsdl.processor.internal.ServiceBuilderFactoryTest
Tests run: 3, Failures: 0, Errors: 0, Skipped: 0, Time elapsed: 0.36 sec
Running org.apache.cxf.tools.java2wsdl.generator.wsdl11.FaultBeanGeneratorTest
Tests run: 3, Failures: 0, Errors: 0, Skipped: 0, Time elapsed: 6.999 sec
Running org.apache.cxf.tools.java2wsdl.JavaToWSDLTest
Tests run: 7, Failures: 0, Errors: 0, Skipped: 0, Time elapsed: 3.145 sec
Running org.apache.cxf.tools.java2wsdl.processor.internal.jaxws.ResponseWrapperTest
Tests run: 2, Failures: 0, Errors: 0, Skipped: 0, Time elapsed: 0.187 sec

Results :

Tests run: 52, Failures: 0, Errors: 0, Skipped: 4

[INFO] [jar:jar]
[INFO] Building jar: /x1/continuum/working-directory/216/tools/javato/target/cxf-tools-java2wsdl-2.0-incubator-SNAPSHOT.jar
[INFO] [install:install]
[INFO] Installing /x1/continuum/working-directory/216/tools/javato/target/cxf-tools-java2wsdl-2.0-incubator-SNAPSHOT.jar to /home/continuum/.m2/repository/org/apache/cxf/cxf-tools-java2wsdl/2.0-incubator-SNAPSHOT/cxf-tools-java2wsdl-2.0-incubator-SNAPSHOT.jar
[INFO] ----------------------------------------------------------------------------
[INFO] Building Apache CXF WSDL Generation Maven2 Plugin
[INFO]    task-segment: [clean, install]
[INFO] ----------------------------------------------------------------------------
[INFO] [clean:clean]
[INFO] Deleting directory /x1/continuum/working-directory/216/wsdlgen-plugin/target
[INFO] Deleting directory /x1/continuum/working-directory/216/wsdlgen-plugin/target/classes
[INFO] Deleting directory /x1/continuum/working-directory/216/wsdlgen-plugin/target/test-classes
[INFO] [checkstyle:checkstyle {execution: validate}]
[INFO] Starting audit...
Audit done.

[INFO] Preparing pmd:check
[INFO] [pmd:pmd]
[INFO] [pmd:check {execution: validate}]
[INFO] 
[INFO] [plugin:descriptor]
[INFO] Using 2 extractors.
[INFO] Applying extractor for language: java
[INFO] Extractor for language: java found 1 mojo descriptors.
[INFO] Applying extractor for language: bsh
[INFO] Extractor for language: bsh found 0 mojo descriptors.
[INFO] [remote-resources:process {execution: default}]
[INFO] [resources:resources]
[INFO] Using default encoding to copy filtered resources.
[INFO] [compiler:compile]
[INFO] Compiling 1 source file to /x1/continuum/working-directory/216/wsdlgen-plugin/target/classes
[INFO] [resources:testResources]
[INFO] Using default encoding to copy filtered resources.
[INFO] [compiler:testCompile]
[INFO] No sources to compile
[INFO] [surefire:test]
[INFO] Surefire report directory: /x1/continuum/working-directory/216/wsdlgen-plugin/target/surefire-reports

-------------------------------------------------------
 T E S T S
-------------------------------------------------------
There are no tests to run.

Results :

Tests run: 0, Failures: 0, Errors: 0, Skipped: 0

[INFO] [jar:jar]
[INFO] Building jar: /x1/continuum/working-directory/216/wsdlgen-plugin/target/cxf-wsdlgen-plugin-2.0-incubator-SNAPSHOT.jar
[INFO] [plugin:addPluginArtifactMetadata]
[INFO] [install:install]
[INFO] Installing /x1/continuum/working-directory/216/wsdlgen-plugin/target/cxf-wsdlgen-plugin-2.0-incubator-SNAPSHOT.jar to /home/continuum/.m2/repository/org/apache/cxf/cxf-wsdlgen-plugin/2.0-incubator-SNAPSHOT/cxf-wsdlgen-plugin-2.0-incubator-SNAPSHOT.jar
[INFO] [plugin:updateRegistry]
[INFO] ----------------------------------------------------------------------------
[INFO] Building Apache CXF Runtime HTTP transport
[INFO]    task-segment: [clean, install]
[INFO] ----------------------------------------------------------------------------
[INFO] [clean:clean]
[INFO] Deleting directory /x1/continuum/working-directory/216/rt/transports/http/target
[INFO] Deleting directory /x1/continuum/working-directory/216/rt/transports/http/target/classes
[INFO] Deleting directory /x1/continuum/working-directory/216/rt/transports/http/target/test-classes
[INFO] [checkstyle:checkstyle {execution: validate}]
[INFO] Starting audit...
Audit done.

[INFO] Preparing pmd:check
[INFO] [pmd:pmd]
[INFO] [pmd:check {execution: validate}]
[INFO] 
[INFO] [cxf-common-xsd:xsdtojava {execution: generate-sources}]
[INFO] [remote-resources:process {execution: default}]
[INFO] [resources:resources]
[INFO] Using default encoding to copy filtered resources.
[INFO] [compiler:compile]
[INFO] Compiling 42 source files to /x1/continuum/working-directory/216/rt/transports/http/target/classes
[INFO] [resources:testResources]
[INFO] Using default encoding to copy filtered resources.
[INFO] [compiler:testCompile]
[INFO] Compiling 6 source files to /x1/continuum/working-directory/216/rt/transports/http/target/test-classes
[INFO] [surefire:test]
[INFO] Surefire report directory: /x1/continuum/working-directory/216/rt/transports/http/target/surefire-reports

-------------------------------------------------------
 T E S T S
-------------------------------------------------------
Running org.apache.cxf.transport.http.policy.PolicyUtilsTest
Tests run: 12, Failures: 0, Errors: 0, Skipped: 0, Time elapsed: 0.721 sec
Running org.apache.cxf.transport.http.policy.HTTPClientAssertionBuilderTest
Tests run: 3, Failures: 0, Errors: 0, Skipped: 0, Time elapsed: 0.06 sec
Running org.apache.cxf.transport.http.HTTPConduitTest
Tests run: 3, Failures: 0, Errors: 0, Skipped: 0, Time elapsed: 0.282 sec
Running org.apache.cxf.transport.http.HTTPConduitURLEasyMockTest
Tests run: 5, Failures: 0, Errors: 0, Skipped: 0, Time elapsed: 1.995 sec
Running org.apache.cxf.transport.http.HTTPConduitURLConnectionTest
Tests run: 3, Failures: 0, Errors: 0, Skipped: 0, Time elapsed: 2.919 sec
Running org.apache.cxf.transport.http.policy.HTTPServerAssertionBuilderTest
Tests run: 3, Failures: 0, Errors: 0, Skipped: 0, Time elapsed: 0.084 sec

Results :

Tests run: 29, Failures: 0, Errors: 0, Skipped: 0

[INFO] [jar:jar]
[INFO] Building jar: /x1/continuum/working-directory/216/rt/transports/http/target/cxf-rt-transports-http-2.0-incubator-SNAPSHOT.jar
[INFO] [install:install]
[INFO] Installing /x1/continuum/working-directory/216/rt/transports/http/target/cxf-rt-transports-http-2.0-incubator-SNAPSHOT.jar to /home/continuum/.m2/repository/org/apache/cxf/cxf-rt-transports-http/2.0-incubator-SNAPSHOT/cxf-rt-transports-http-2.0-incubator-SNAPSHOT.jar
[INFO] ----------------------------------------------------------------------------
[INFO] Building Apache CXF Runtime HTTP Jetty transport
[INFO]    task-segment: [clean, install]
[INFO] ----------------------------------------------------------------------------
[INFO] [clean:clean]
[INFO] Deleting directory /x1/continuum/working-directory/216/rt/transports/http-jetty/target
[INFO] Deleting directory /x1/continuum/working-directory/216/rt/transports/http-jetty/target/classes
[INFO] Deleting directory /x1/continuum/working-directory/216/rt/transports/http-jetty/target/test-classes
[INFO] [checkstyle:checkstyle {execution: validate}]
[INFO] Starting audit...
Audit done.

[INFO] Preparing pmd:check
[INFO] [pmd:pmd]
[INFO] [pmd:check {execution: validate}]
[INFO] 
[INFO] [cxf-common-xsd:xsdtojava {execution: generate-sources}]
[INFO] [remote-resources:process {execution: default}]
[INFO] [resources:resources]
[INFO] Using default encoding to copy filtered resources.
[INFO] [compiler:compile]
[INFO] Compiling 22 source files to /x1/continuum/working-directory/216/rt/transports/http-jetty/target/classes
[INFO] [resources:testResources]
[INFO] Using default encoding to copy filtered resources.
[INFO] [compiler:testCompile]
[INFO] Compiling 5 source files to /x1/continuum/working-directory/216/rt/transports/http-jetty/target/test-classes
[INFO] [surefire:test]
[INFO] Surefire report directory: /x1/continuum/working-directory/216/rt/transports/http-jetty/target/surefire-reports

-------------------------------------------------------
 T E S T S
-------------------------------------------------------
Running org.apache.cxf.transport.http_jetty.JettyHTTPServerEngineTest
Tests run: 2, Failures: 0, Errors: 0, Skipped: 0, Time elapsed: 0.653 sec
Running org.apache.cxf.transport.http_jetty.JettyHTTPDestinationTest
Tests run: 17, Failures: 0, Errors: 0, Skipped: 0, Time elapsed: 4.363 sec
Running org.apache.cxf.transport.http_jetty.JettyContextInspectorTest
Tests run: 1, Failures: 0, Errors: 0, Skipped: 0, Time elapsed: 1.019 sec
Running org.apache.cxf.transport.http_jetty.spring.BeanDefinitionParsersTest
Tests run: 3, Failures: 0, Errors: 0, Skipped: 0, Time elapsed: 4.211 sec
Running org.apache.cxf.transport.http_jetty.spring.ApplicationContextTest
Tests run: 2, Failures: 0, Errors: 0, Skipped: 1, Time elapsed: 8.274 sec

Results :

Tests run: 25, Failures: 0, Errors: 0, Skipped: 1

[INFO] [jar:jar]
[INFO] Building jar: /x1/continuum/working-directory/216/rt/transports/http-jetty/target/cxf-rt-transports-http-jetty-2.0-incubator-SNAPSHOT.jar
[INFO] [install:install]
[INFO] Installing /x1/continuum/working-directory/216/rt/transports/http-jetty/target/cxf-rt-transports-http-jetty-2.0-incubator-SNAPSHOT.jar to /home/continuum/.m2/repository/org/apache/cxf/cxf-rt-transports-http-jetty/2.0-incubator-SNAPSHOT/cxf-rt-transports-http-jetty-2.0-incubator-SNAPSHOT.jar
[INFO] ----------------------------------------------------------------------------
[INFO] Building Apache CXF Runtime Aegis Databinding
[INFO]    task-segment: [clean, install]
[INFO] ----------------------------------------------------------------------------
[INFO] [clean:clean]
[INFO] Deleting directory /x1/continuum/working-directory/216/rt/databinding/aegis/target
[INFO] Deleting directory /x1/continuum/working-directory/216/rt/databinding/aegis/target/classes
[INFO] Deleting directory /x1/continuum/working-directory/216/rt/databinding/aegis/target/test-classes
[INFO] [checkstyle:checkstyle {execution: validate}]
[INFO] Starting audit...
Audit done.

[INFO] Preparing pmd:check
[INFO] [pmd:pmd]
[INFO] [pmd:check {execution: validate}]
[INFO] 
[INFO] [build-helper:add-source {execution: add-source}]
[INFO] Source directory: /x1/continuum/working-directory/216/rt/databinding/aegis/src/main/generated added.
[INFO] [remote-resources:process {execution: default}]
[INFO] [resources:resources]
[INFO] Using default encoding to copy filtered resources.
[INFO] [compiler:compile]
[INFO] Compiling 90 source files to /x1/continuum/working-directory/216/rt/databinding/aegis/target/classes
[INFO] [resources:testResources]
[INFO] Using default encoding to copy filtered resources.
[INFO] [compiler:testCompile]
[INFO] Compiling 83 source files to /x1/continuum/working-directory/216/rt/databinding/aegis/target/test-classes
[INFO] [surefire:test]
[INFO] Surefire report directory: /x1/continuum/working-directory/216/rt/databinding/aegis/target/surefire-reports

-------------------------------------------------------
 T E S T S
-------------------------------------------------------
Running org.apache.cxf.aegis.xml.stax.WriterTest
Tests run: 2, Failures: 0, Errors: 0, Skipped: 0, Time elapsed: 9.076 sec
Running org.apache.cxf.aegis.type.basic.DynamicProxyTest
Tests run: 6, Failures: 0, Errors: 0, Skipped: 0, Time elapsed: 2.394 sec
Running org.apache.cxf.aegis.services.base64.BinaryDataTest
Tests run: 1, Failures: 0, Errors: 0, Skipped: 0, Time elapsed: 2.013 sec
Running org.codehaus.xfire.aegis.inheritance.intf.InterfaceInheritanceTest
Tests run: 1, Failures: 0, Errors: 0, Skipped: 0, Time elapsed: 1.768 sec
Running org.apache.cxf.aegis.type.java5.DualOutServiceTest
Tests run: 1, Failures: 0, Errors: 0, Skipped: 0, Time elapsed: 1.241 sec
Running org.codehaus.xfire.aegis.inheritance.ExceptionInheritanceTest
Tests run: 1, Failures: 0, Errors: 0, Skipped: 0, Time elapsed: 0.201 sec
Running org.apache.cxf.aegis.xml.stax.ReaderTest
Tests run: 2, Failures: 0, Errors: 0, Skipped: 0, Time elapsed: 2.647 sec
Running org.apache.cxf.aegis.type.java5.AnnotatedTypeTest
Tests run: 7, Failures: 0, Errors: 0, Skipped: 0, Time elapsed: 2.591 sec
Running org.apache.cxf.aegis.type.basic.BeanTest
Tests run: 11, Failures: 0, Errors: 0, Skipped: 0, Time elapsed: 2.796 sec
Running org.apache.cxf.aegis.type.java5.ConfigurationTest
Tests run: 6, Failures: 0, Errors: 0, Skipped: 0, Time elapsed: 1.491 sec
Running org.codehaus.xfire.aegis.inheritance.InheritancePOJOTest
Tests run: 3, Failures: 0, Errors: 0, Skipped: 0, Time elapsed: 1.288 sec
Running org.apache.cxf.aegis.type.java5.OperationNSTest
Tests run: 1, Failures: 0, Errors: 0, Skipped: 0, Time elapsed: 0.702 sec
Running org.apache.cxf.aegis.type.java5.CollectionTest
Tests run: 8, Failures: 0, Errors: 0, Skipped: 0, Time elapsed: 1.964 sec
Running org.apache.cxf.aegis.client.HeaderTest
Tests run: 1, Failures: 0, Errors: 0, Skipped: 1, Time elapsed: 0.006 sec
Running org.apache.cxf.aegis.type.java5.MapTest
Tests run: 6, Failures: 0, Errors: 0, Skipped: 0, Time elapsed: 1.295 sec
Running org.apache.cxf.aegis.type.java5.EnumTypeTest
Tests run: 6, Failures: 0, Errors: 0, Skipped: 0, Time elapsed: 1.57 sec
Running org.apache.cxf.aegis.type.basic.ByteDataTest
Tests run: 1, Failures: 0, Errors: 0, Skipped: 0, Time elapsed: 0.4 sec
Running org.apache.cxf.aegis.integration.WrappedTest
Tests run: 2, Failures: 0, Errors: 0, Skipped: 0, Time elapsed: 1.444 sec
Running org.apache.cxf.aegis.type.java5.XmlParamTypeTest
Tests run: 2, Failures: 0, Errors: 0, Skipped: 0, Time elapsed: 0.48 sec

Results :

Tests run: 68, Failures: 0, Errors: 0, Skipped: 1

[INFO] [jar:jar]
[INFO] Building jar: /x1/continuum/working-directory/216/rt/databinding/aegis/target/cxf-rt-databinding-aegis-2.0-incubator-SNAPSHOT.jar
[INFO] [install:install]
[INFO] Installing /x1/continuum/working-directory/216/rt/databinding/aegis/target/cxf-rt-databinding-aegis-2.0-incubator-SNAPSHOT.jar to /home/continuum/.m2/repository/org/apache/cxf/cxf-rt-databinding-aegis/2.0-incubator-SNAPSHOT/cxf-rt-databinding-aegis-2.0-incubator-SNAPSHOT.jar
[INFO] ----------------------------------------------------------------------------
[INFO] Building Apache CXF Runtime HTTP Binding
[INFO]    task-segment: [clean, install]
[INFO] ----------------------------------------------------------------------------
[INFO] [clean:clean]
[INFO] Deleting directory /x1/continuum/working-directory/216/rt/bindings/http/target
[INFO] Deleting directory /x1/continuum/working-directory/216/rt/bindings/http/target/classes
[INFO] Deleting directory /x1/continuum/working-directory/216/rt/bindings/http/target/test-classes
[INFO] [checkstyle:checkstyle {execution: validate}]
[INFO] Starting audit...
Audit done.

[INFO] Preparing pmd:check
[INFO] [pmd:pmd]
[INFO] [pmd:check {execution: validate}]
[INFO] 
[INFO] [remote-resources:process {execution: default}]
[INFO] [resources:resources]
[INFO] Using default encoding to copy filtered resources.
[INFO] [compiler:compile]
[INFO] Compiling 16 source files to /x1/continuum/working-directory/216/rt/bindings/http/target/classes
[INFO] [cxf-common-xsd:xsdtojava {execution: generate-sources}]
[INFO] [resources:testResources]
[INFO] Using default encoding to copy filtered resources.
[INFO] [compiler:testCompile]
[INFO] Compiling 13 source files to /x1/continuum/working-directory/216/rt/bindings/http/target/test-classes
[INFO] [surefire:test]
[INFO] Surefire report directory: /x1/continuum/working-directory/216/rt/bindings/http/target/surefire-reports

-------------------------------------------------------
 T E S T S
-------------------------------------------------------
Running org.apache.cxf.binding.http.InflectorTest
Tests run: 2, Failures: 0, Errors: 0, Skipped: 0, Time elapsed: 0.082 sec
Running org.apache.cxf.binding.http.mtom.MtomTest
Tests run: 1, Failures: 0, Errors: 0, Skipped: 0, Time elapsed: 7.89 sec
Running org.apache.cxf.binding.http.IriDecoderTest
Tests run: 1, Failures: 0, Errors: 0, Skipped: 0, Time elapsed: 0.026 sec
Running org.apache.cxf.binding.http.wrapped.WrappedServiceTest
Tests run: 2, Failures: 0, Errors: 0, Skipped: 0, Time elapsed: 3.183 sec
Running org.apache.cxf.binding.http.bare.ClientTest
Tests run: 1, Failures: 0, Errors: 0, Skipped: 0, Time elapsed: 1.191 sec
Running org.apache.cxf.binding.http.bare.BareServiceTest
Tests run: 2, Failures: 0, Errors: 0, Skipped: 0, Time elapsed: 1.955 sec

Results :

Tests run: 9, Failures: 0, Errors: 0, Skipped: 0

[INFO] [jar:jar]
[INFO] Building jar: /x1/continuum/working-directory/216/rt/bindings/http/target/cxf-rt-bindings-http-2.0-incubator-SNAPSHOT.jar
[INFO] [install:install]
[INFO] Installing /x1/continuum/working-directory/216/rt/bindings/http/target/cxf-rt-bindings-http-2.0-incubator-SNAPSHOT.jar to /home/continuum/.m2/repository/org/apache/cxf/cxf-rt-bindings-http/2.0-incubator-SNAPSHOT/cxf-rt-bindings-http-2.0-incubator-SNAPSHOT.jar
[INFO] ----------------------------------------------------------------------------
[INFO] Building Apache CXF Runtime Object Binding
[INFO]    task-segment: [clean, install]
[INFO] ----------------------------------------------------------------------------
[INFO] [clean:clean]
[INFO] Deleting directory /x1/continuum/working-directory/216/rt/bindings/object/target
[INFO] Deleting directory /x1/continuum/working-directory/216/rt/bindings/object/target/classes
[INFO] Deleting directory /x1/continuum/working-directory/216/rt/bindings/object/target/test-classes
[INFO] [checkstyle:checkstyle {execution: validate}]
[INFO] Starting audit...
Audit done.

[INFO] Preparing pmd:check
[INFO] [pmd:pmd]
[INFO] [pmd:check {execution: validate}]
[INFO] 
[INFO] [remote-resources:process {execution: default}]
[INFO] [resources:resources]
[INFO] Using default encoding to copy filtered resources.
[INFO] [compiler:compile]
[INFO] Compiling 7 source files to /x1/continuum/working-directory/216/rt/bindings/object/target/classes
[INFO] [resources:testResources]
[INFO] Using default encoding to copy filtered resources.
[INFO] [compiler:testCompile]
[INFO] Compiling 4 source files to /x1/continuum/working-directory/216/rt/bindings/object/target/test-classes
[INFO] [surefire:test]
[INFO] Surefire report directory: /x1/continuum/working-directory/216/rt/bindings/object/target/surefire-reports

-------------------------------------------------------
 T E S T S
-------------------------------------------------------
Running org.apache.cxf.binding.object.LocalServerRegistrationTest
Tests run: 1, Failures: 0, Errors: 0, Skipped: 0, Time elapsed: 6.955 sec
Running org.apache.cxf.binding.object.ObjectBindingTest
Tests run: 3, Failures: 0, Errors: 0, Skipped: 0, Time elapsed: 4.516 sec

Results :

Tests run: 4, Failures: 0, Errors: 0, Skipped: 0

[INFO] [jar:jar]
[INFO] Building jar: /x1/continuum/working-directory/216/rt/bindings/object/target/cxf-rt-bindings-object-2.0-incubator-SNAPSHOT.jar
[INFO] [install:install]
[INFO] Installing /x1/continuum/working-directory/216/rt/bindings/object/target/cxf-rt-bindings-object-2.0-incubator-SNAPSHOT.jar to /home/continuum/.m2/repository/org/apache/cxf/cxf-rt-bindings-object/2.0-incubator-SNAPSHOT/cxf-rt-bindings-object-2.0-incubator-SNAPSHOT.jar
[INFO] ----------------------------------------------------------------------------
[INFO] Building Apache CXF Colocated Binding
[INFO]    task-segment: [clean, install]
[INFO] ----------------------------------------------------------------------------
[INFO] [clean:clean]
[INFO] Deleting directory /x1/continuum/working-directory/216/rt/bindings/coloc/target
[INFO] Deleting directory /x1/continuum/working-directory/216/rt/bindings/coloc/target/classes
[INFO] Deleting directory /x1/continuum/working-directory/216/rt/bindings/coloc/target/test-classes
[INFO] [checkstyle:checkstyle {execution: validate}]
[INFO] Starting audit...
Audit done.

[INFO] Preparing pmd:check
[INFO] [pmd:pmd]
[INFO] [pmd:check {execution: validate}]
[INFO] 
[INFO] [remote-resources:process {execution: default}]
[INFO] [resources:resources]
[INFO] Using default encoding to copy filtered resources.
[INFO] [compiler:compile]
[INFO] Compiling 10 source files to /x1/continuum/working-directory/216/rt/bindings/coloc/target/classes
[INFO] [resources:testResources]
[INFO] Using default encoding to copy filtered resources.
[INFO] [compiler:testCompile]
[INFO] Compiling 3 source files to /x1/continuum/working-directory/216/rt/bindings/coloc/target/test-classes
[INFO] [surefire:test]
[INFO] Surefire report directory: /x1/continuum/working-directory/216/rt/bindings/coloc/target/surefire-reports

-------------------------------------------------------
 T E S T S
-------------------------------------------------------
Running org.apache.cxf.binding.coloc.ColocMessageObserverTest
Tests run: 2, Failures: 0, Errors: 0, Skipped: 0, Time elapsed: 2.868 sec
Running org.apache.cxf.binding.coloc.ColocUtilTest
Tests run: 6, Failures: 0, Errors: 0, Skipped: 0, Time elapsed: 0.302 sec
Running org.apache.cxf.binding.coloc.ColocOutInterceptorTest
Tests run: 8, Failures: 0, Errors: 0, Skipped: 0, Time elapsed: 0.628 sec

Results :

Tests run: 16, Failures: 0, Errors: 0, Skipped: 0

[INFO] [jar:jar]
[INFO] Building jar: /x1/continuum/working-directory/216/rt/bindings/coloc/target/cxf-rt-bindings-coloc-2.0-incubator-SNAPSHOT.jar
[INFO] [install:install]
[INFO] Installing /x1/continuum/working-directory/216/rt/bindings/coloc/target/cxf-rt-bindings-coloc-2.0-incubator-SNAPSHOT.jar to /home/continuum/.m2/repository/org/apache/cxf/cxf-rt-bindings-coloc/2.0-incubator-SNAPSHOT/cxf-rt-bindings-coloc-2.0-incubator-SNAPSHOT.jar
[INFO] ----------------------------------------------------------------------------
[INFO] Building Apache CXF Runtime JBI Binding
[INFO]    task-segment: [clean, install]
[INFO] ----------------------------------------------------------------------------
[INFO] [clean:clean]
[INFO] Deleting directory /x1/continuum/working-directory/216/rt/bindings/jbi/target
[INFO] Deleting directory /x1/continuum/working-directory/216/rt/bindings/jbi/target/classes
[INFO] Deleting directory /x1/continuum/working-directory/216/rt/bindings/jbi/target/test-classes
[INFO] [checkstyle:checkstyle {execution: validate}]
[INFO] Starting audit...
Audit done.

[INFO] Preparing pmd:check
[INFO] [pmd:pmd]
[INFO] [pmd:check {execution: validate}]
[INFO] 
[INFO] [cxf-common-xsd:xsdtojava {execution: generate-sources}]
[INFO] [remote-resources:process {execution: default}]
[INFO] [resources:resources]
[INFO] Using default encoding to copy filtered resources.
[INFO] [compiler:compile]
[INFO] Compiling 14 source files to /x1/continuum/working-directory/216/rt/bindings/jbi/target/classes
[INFO] [resources:testResources]
[INFO] Using default encoding to copy filtered resources.
[INFO] [compiler:testCompile]
[INFO] Compiling 3 source files to /x1/continuum/working-directory/216/rt/bindings/jbi/target/test-classes
[INFO] [surefire:test]
[INFO] Surefire report directory: /x1/continuum/working-directory/216/rt/bindings/jbi/target/surefire-reports

-------------------------------------------------------
 T E S T S
-------------------------------------------------------
Running org.apache.cxf.binding.jbi.JBIBindingFactoryTest
Tests run: 1, Failures: 0, Errors: 0, Skipped: 0, Time elapsed: 0.3 sec
Running org.apache.cxf.binding.jbi.interceptor.JBIOperationInInterceptorTest
Tests run: 1, Failures: 0, Errors: 0, Skipped: 0, Time elapsed: 0.055 sec
Running org.apache.cxf.binding.jbi.interceptor.JBIFaultOutInterceptorTest
Tests run: 5, Failures: 0, Errors: 0, Skipped: 0, Time elapsed: 0.549 sec

Results :

Tests run: 7, Failures: 0, Errors: 0, Skipped: 0

[INFO] [jar:jar]
[INFO] Building jar: /x1/continuum/working-directory/216/rt/bindings/jbi/target/cxf-rt-bindings-jbi-2.0-incubator-SNAPSHOT.jar
[INFO] [install:install]
[INFO] Installing /x1/continuum/working-directory/216/rt/bindings/jbi/target/cxf-rt-bindings-jbi-2.0-incubator-SNAPSHOT.jar to /home/continuum/.m2/repository/org/apache/cxf/cxf-rt-bindings-jbi/2.0-incubator-SNAPSHOT/cxf-rt-bindings-jbi-2.0-incubator-SNAPSHOT.jar
[INFO] ----------------------------------------------------------------------------
[INFO] Building Apache CXF Runtime
[INFO]    task-segment: [clean, install]
[INFO] ----------------------------------------------------------------------------
[INFO] [clean:clean]
[INFO] Deleting directory /x1/continuum/working-directory/216/rt/target
[INFO] Deleting directory /x1/continuum/working-directory/216/rt/target/classes
[INFO] Deleting directory /x1/continuum/working-directory/216/rt/target/test-classes
[INFO] [site:attach-descriptor]
[INFO] [install:install]
[INFO] Installing /x1/continuum/working-directory/216/rt/pom.xml to /home/continuum/.m2/repository/org/apache/cxf/cxf-rt/2.0-incubator-SNAPSHOT/cxf-rt-2.0-incubator-SNAPSHOT.pom
[INFO] ----------------------------------------------------------------------------
[INFO] Building Apache CXF Runtime Bindings
[INFO]    task-segment: [clean, install]
[INFO] ----------------------------------------------------------------------------
[INFO] [clean:clean]
[INFO] Deleting directory /x1/continuum/working-directory/216/rt/bindings/target
[INFO] Deleting directory /x1/continuum/working-directory/216/rt/bindings/target/classes
[INFO] Deleting directory /x1/continuum/working-directory/216/rt/bindings/target/test-classes
[INFO] [site:attach-descriptor]
[INFO] [install:install]
[INFO] Installing /x1/continuum/working-directory/216/rt/bindings/pom.xml to /home/continuum/.m2/repository/org/apache/cxf/cxf-rt-bindings/2.0-incubator-SNAPSHOT/cxf-rt-bindings-2.0-incubator-SNAPSHOT.pom
[INFO] ----------------------------------------------------------------------------
[INFO] Building Apache CXF Runtime JavaScript Frontend
[INFO]    task-segment: [clean, install]
[INFO] ----------------------------------------------------------------------------
[INFO] [clean:clean]
[INFO] Deleting directory /x1/continuum/working-directory/216/rt/frontend/js/target
[INFO] Deleting directory /x1/continuum/working-directory/216/rt/frontend/js/target/classes
[INFO] Deleting directory /x1/continuum/working-directory/216/rt/frontend/js/target/test-classes
[INFO] [checkstyle:checkstyle {execution: validate}]
[INFO] Starting audit...
Audit done.

[INFO] Preparing pmd:check
[INFO] [pmd:pmd]
[INFO] [pmd:check {execution: validate}]
[INFO] 
[INFO] [remote-resources:process {execution: default}]
[INFO] [resources:resources]
[INFO] Using default encoding to copy filtered resources.
[INFO] [compiler:compile]
[INFO] Compiling 6 source files to /x1/continuum/working-directory/216/rt/frontend/js/target/classes
[INFO] [resources:testResources]
[INFO] Using default encoding to copy filtered resources.
[INFO] [compiler:testCompile]
[INFO] Compiling 3 source files to /x1/continuum/working-directory/216/rt/frontend/js/target/test-classes
[INFO] [surefire:test]
[INFO] Surefire report directory: /x1/continuum/working-directory/216/rt/frontend/js/target/surefire-reports

-------------------------------------------------------
 T E S T S
-------------------------------------------------------
Running org.apache.cxf.js.rhino.AbstractDOMProviderTest
Tests run: 7, Failures: 0, Errors: 0, Skipped: 0, Time elapsed: 0.807 sec
Running org.apache.cxf.js.rhino.ServerAppTest
Tests run: 13, Failures: 0, Errors: 0, Skipped: 0, Time elapsed: 0.723 sec
Running org.apache.cxf.js.rhino.ProviderFactoryTest
Tests run: 7, Failures: 0, Errors: 0, Skipped: 0, Time elapsed: 1.247 sec

Results :

Tests run: 27, Failures: 0, Errors: 0, Skipped: 0

[INFO] [jar:jar]
[INFO] Building jar: /x1/continuum/working-directory/216/rt/frontend/js/target/cxf-rt-frontend-js-2.0-incubator-SNAPSHOT.jar
[INFO] [install:install]
[INFO] Installing /x1/continuum/working-directory/216/rt/frontend/js/target/cxf-rt-frontend-js-2.0-incubator-SNAPSHOT.jar to /home/continuum/.m2/repository/org/apache/cxf/cxf-rt-frontend-js/2.0-incubator-SNAPSHOT/cxf-rt-frontend-js-2.0-incubator-SNAPSHOT.jar
[INFO] ----------------------------------------------------------------------------
[INFO] Building Apache CXF Runtime JBI transport
[INFO]    task-segment: [clean, install]
[INFO] ----------------------------------------------------------------------------
[INFO] [clean:clean]
[INFO] Deleting directory /x1/continuum/working-directory/216/rt/transports/jbi/target
[INFO] Deleting directory /x1/continuum/working-directory/216/rt/transports/jbi/target/classes
[INFO] Deleting directory /x1/continuum/working-directory/216/rt/transports/jbi/target/test-classes
[INFO] [checkstyle:checkstyle {execution: validate}]
[INFO] Starting audit...
Audit done.

[INFO] Preparing pmd:check
[INFO] [pmd:pmd]
[INFO] [pmd:check {execution: validate}]
[INFO] 
[INFO] [cxf-common-xsd:xsdtojava {execution: generate-sources}]
[INFO] [remote-resources:process {execution: default}]
[INFO] [resources:resources]
[INFO] Using default encoding to copy filtered resources.
[INFO] [compiler:compile]
[INFO] Compiling 10 source files to /x1/continuum/working-directory/216/rt/transports/jbi/target/classes
[INFO] [resources:testResources]
[INFO] Using default encoding to copy filtered resources.
[INFO] [compiler:testCompile]
[INFO] Compiling 3 source files to /x1/continuum/working-directory/216/rt/transports/jbi/target/test-classes
[INFO] [surefire:test]
[INFO] Surefire report directory: /x1/continuum/working-directory/216/rt/transports/jbi/target/surefire-reports

-------------------------------------------------------
 T E S T S
-------------------------------------------------------
Running org.apache.cxf.transport.jbi.JBIConduitTest
Tests run: 2, Failures: 0, Errors: 0, Skipped: 1, Time elapsed: 6.299 sec
Running org.apache.cxf.transport.jbi.JBIDestinationTest
Tests run: 1, Failures: 0, Errors: 0, Skipped: 0, Time elapsed: 1.049 sec

Results :

Tests run: 3, Failures: 0, Errors: 0, Skipped: 1

[INFO] [jar:jar]
[INFO] Building jar: /x1/continuum/working-directory/216/rt/transports/jbi/target/cxf-rt-transports-jbi-2.0-incubator-SNAPSHOT.jar
[INFO] [install:install]
[INFO] Installing /x1/continuum/working-directory/216/rt/transports/jbi/target/cxf-rt-transports-jbi-2.0-incubator-SNAPSHOT.jar to /home/continuum/.m2/repository/org/apache/cxf/cxf-rt-transports-jbi/2.0-incubator-SNAPSHOT/cxf-rt-transports-jbi-2.0-incubator-SNAPSHOT.jar
[INFO] ----------------------------------------------------------------------------
[INFO] Building Apache CXF Runtime WS Policy
[INFO]    task-segment: [clean, install]
[INFO] ----------------------------------------------------------------------------
[INFO] [clean:clean]
[INFO] Deleting directory /x1/continuum/working-directory/216/rt/ws/policy/target
[INFO] Deleting directory /x1/continuum/working-directory/216/rt/ws/policy/target/classes
[INFO] Deleting directory /x1/continuum/working-directory/216/rt/ws/policy/target/test-classes
[INFO] [checkstyle:checkstyle {execution: validate}]
[INFO] Starting audit...
Audit done.

[INFO] Preparing pmd:check
[INFO] [pmd:pmd]
[INFO] [pmd:check {execution: validate}]
[INFO] 
[INFO] [cxf-common-xsd:xsdtojava {execution: generate-sources}]
[INFO] [remote-resources:process {execution: default}]
[INFO] [resources:resources]
[INFO] Using default encoding to copy filtered resources.
[INFO] [compiler:compile]
[INFO] Compiling 59 source files to /x1/continuum/working-directory/216/rt/ws/policy/target/classes
[INFO] [cxf-codegen:wsdl2java {execution: generate-test-sources}]
[INFO] [resources:testResources]
[INFO] Using default encoding to copy filtered resources.
[INFO] [compiler:testCompile]
[INFO] Compiling 32 source files to /x1/continuum/working-directory/216/rt/ws/policy/target/test-classes
[INFO] [surefire:test]
[INFO] Surefire report directory: /x1/continuum/working-directory/216/rt/ws/policy/target/surefire-reports

-------------------------------------------------------
 T E S T S
-------------------------------------------------------
Running org.apache.cxf.ws.policy.attachment.external.EndpointReferenceDomainExpressionTest
Tests run: 1, Failures: 0, Errors: 0, Skipped: 0, Time elapsed: 2.976 sec
Running org.apache.cxf.ws.policy.attachment.external.DomainExpressionBuilderRegistryTest
Tests run: 2, Failures: 0, Errors: 0, Skipped: 0, Time elapsed: 0.184 sec
Running org.apache.cxf.ws.policy.attachment.wsdl11.Wsdl11AttachmentPolicyProviderTest
Tests run: 7, Failures: 0, Errors: 0, Skipped: 0, Time elapsed: 4.959 sec
Running org.apache.cxf.ws.policy.PolicyVerificationInFaultInterceptorTest
Tests run: 1, Failures: 0, Errors: 0, Skipped: 0, Time elapsed: 0.774 sec
Running org.apache.cxf.ws.policy.PolicyInterceptorProviderRegistryImplTest
Tests run: 1, Failures: 0, Errors: 0, Skipped: 0, Time elapsed: 0.04 sec
Running org.apache.cxf.ws.policy.PolicyInterceptorsTest
Tests run: 8, Failures: 0, Errors: 0, Skipped: 0, Time elapsed: 0.752 sec
Running org.apache.cxf.ws.policy.spring.PolicyFeatureTest
java.net.SocketException: Permission denied
	at sun.nio.ch.Net.bind(Native Method)
	at sun.nio.ch.ServerSocketChannelImpl.bind(ServerSocketChannelImpl.java:119)
	at sun.nio.ch.ServerSocketAdaptor.bind(ServerSocketAdaptor.java:59)
	at org.mortbay.jetty.nio.SelectChannelConnector.open(SelectChannelConnector.java:209)
	at org.mortbay.jetty.AbstractConnector.doStart(AbstractConnector.java:252)
	at org.mortbay.jetty.nio.SelectChannelConnector.doStart(SelectChannelConnector.java:294)
	at org.mortbay.component.AbstractLifeCycle.start(AbstractLifeCycle.java:40)
	at org.mortbay.jetty.Server.doStart(Server.java:221)
	at org.mortbay.component.AbstractLifeCycle.start(AbstractLifeCycle.java:40)
	at org.apache.cxf.transport.http_jetty.JettyHTTPServerEngine.addServant(JettyHTTPServerEngine.java:170)
	at org.apache.cxf.transport.http_jetty.JettyHTTPDestination.activate(JettyHTTPDestination.java:143)
	at org.apache.cxf.transport.AbstractObservable.setMessageObserver(AbstractObservable.java:47)
	at org.apache.cxf.binding.AbstractBindingFactory.addListener(AbstractBindingFactory.java:152)
	at org.apache.cxf.binding.soap.SoapBindingFactory.addListener(SoapBindingFactory.java:527)
	at org.apache.cxf.endpoint.ServerImpl.start(ServerImpl.java:121)
	at org.apache.cxf.frontend.ServerFactoryBean.create(ServerFactoryBean.java:95)
	at org.apache.cxf.ws.policy.spring.PolicyFeatureTest.testServerFactoryWith2007Xml(PolicyFeatureTest.java:90)
	at sun.reflect.NativeMethodAccessorImpl.invoke0(Native Method)
	at sun.reflect.NativeMethodAccessorImpl.invoke(NativeMethodAccessorImpl.java:39)
	at sun.reflect.DelegatingMethodAccessorImpl.invoke(DelegatingMethodAccessorImpl.java:25)
	at java.lang.reflect.Method.invoke(Method.java:585)
	at org.junit.internal.runners.TestMethodRunner.executeMethodBody(TestMethodRunner.java:99)
	at org.junit.internal.runners.TestMethodRunner.runUnprotected(TestMethodRunner.java:81)
	at org.junit.internal.runners.BeforeAndAfterRunner.runProtected(BeforeAndAfterRunner.java:34)
	at org.junit.internal.runners.TestMethodRunner.runMethod(TestMethodRunner.java:75)
	at org.junit.internal.runners.TestMethodRunner.run(TestMethodRunner.java:45)
	at org.junit.internal.runners.TestClassMethodsRunner.invokeTestMethod(TestClassMethodsRunner.java:66)
	at org.junit.internal.runners.TestClassMethodsRunner.run(TestClassMethodsRunner.java:35)
	at org.junit.internal.runners.TestClassRunner$1.runUnprotected(TestClassRunner.java:42)
	at org.junit.internal.runners.BeforeAndAfterRunner.runProtected(BeforeAndAfterRunner.java:34)
	at org.junit.internal.runners.TestClassRunner.run(TestClassRunner.java:52)
	at org.apache.maven.surefire.junit4.JUnit4TestSet.execute(JUnit4TestSet.java:62)
	at org.apache.maven.surefire.suite.AbstractDirectoryTestSuite.executeTestSet(AbstractDirectoryTestSuite.java:138)
	at org.apache.maven.surefire.suite.AbstractDirectoryTestSuite.execute(AbstractDirectoryTestSuite.java:125)
	at org.apache.maven.surefire.Surefire.run(Surefire.java:132)
	at sun.reflect.NativeMethodAccessorImpl.invoke0(Native Method)
	at sun.reflect.NativeMethodAccessorImpl.invoke(NativeMethodAccessorImpl.java:39)
	at sun.reflect.DelegatingMethodAccessorImpl.invoke(DelegatingMethodAccessorImpl.java:25)
	at java.lang.reflect.Method.invoke(Method.java:585)
	at org.apache.maven.surefire.booter.SurefireBooter.runSuitesInProcess(SurefireBooter.java:290)
	at org.apache.maven.surefire.booter.SurefireBooter.main(SurefireBooter.java:818)
Tests run: 4, Failures: 0, Errors: 0, Skipped: 0, Time elapsed: 17.252 sec
Running org.apache.cxf.ws.policy.PolicyTest
Tests run: 4, Failures: 0, Errors: 0, Skipped: 3, Time elapsed: 0.013 sec
Running org.apache.cxf.ws.policy.attachment.reference.ReferenceResolverTest
Tests run: 3, Failures: 0, Errors: 0, Skipped: 0, Time elapsed: 0.463 sec
Running org.apache.cxf.ws.policy.PolicyEngineTest
Tests run: 27, Failures: 0, Errors: 0, Skipped: 0, Time elapsed: 0.568 sec
Running org.apache.cxf.ws.policy.selector.MinimalMaximalAlternativeSelectorTest
Tests run: 2, Failures: 0, Errors: 0, Skipped: 0, Time elapsed: 0.047 sec
Running org.apache.cxf.ws.policy.EffectivePolicyImplTest
Tests run: 9, Failures: 0, Errors: 0, Skipped: 0, Time elapsed: 0.083 sec
Running org.apache.cxf.ws.policy.PolicyVerificationInInterceptorTest
Tests run: 2, Failures: 0, Errors: 0, Skipped: 0, Time elapsed: 0.175 sec
Running org.apache.cxf.ws.policy.PolicyExtensionsTest
Tests run: 1, Failures: 0, Errors: 0, Skipped: 0, Time elapsed: 0.36 sec
Running org.apache.cxf.ws.policy.selector.FirstAlternativeSelectorTest
Tests run: 1, Failures: 0, Errors: 0, Skipped: 0, Time elapsed: 0.027 sec
Running org.apache.cxf.ws.policy.builder.primitive.NestedPrimitiveAssertionTest
Tests run: 3, Failures: 0, Errors: 0, Skipped: 0, Time elapsed: 0.456 sec
Running org.apache.cxf.ws.policy.EndpointPolicyImplTest
Tests run: 8, Failures: 0, Errors: 0, Skipped: 0, Time elapsed: 0.213 sec
Running org.apache.cxf.ws.policy.attachment.external.ExternalAttachmentProviderTest
Tests run: 11, Failures: 0, Errors: 0, Skipped: 0, Time elapsed: 0.303 sec
Running org.apache.cxf.ws.policy.attachment.external.PolicyAttachmentTest
Tests run: 6, Failures: 0, Errors: 0, Skipped: 0, Time elapsed: 0.082 sec
Running org.apache.cxf.ws.policy.PolicyRegistryImplTest
Tests run: 1, Failures: 0, Errors: 0, Skipped: 0, Time elapsed: 0.005 sec
Running org.apache.cxf.ws.policy.PolicyVerificationOutInterceptorTest
Tests run: 1, Failures: 0, Errors: 0, Skipped: 0, Time elapsed: 0.096 sec
Running org.apache.cxf.ws.policy.PolicyBuilderTest
Tests run: 3, Failures: 0, Errors: 0, Skipped: 0, Time elapsed: 0.082 sec
Running org.apache.cxf.ws.policy.NormalizeTest
Tests run: 1, Failures: 0, Errors: 0, Skipped: 0, Time elapsed: 0.371 sec

Results :

Tests run: 107, Failures: 0, Errors: 0, Skipped: 3

[INFO] [jar:jar]
[INFO] Building jar: /x1/continuum/working-directory/216/rt/ws/policy/target/cxf-rt-ws-policy-2.0-incubator-SNAPSHOT.jar
[INFO] [install:install]
[INFO] Installing /x1/continuum/working-directory/216/rt/ws/policy/target/cxf-rt-ws-policy-2.0-incubator-SNAPSHOT.jar to /home/continuum/.m2/repository/org/apache/cxf/cxf-rt-ws-policy/2.0-incubator-SNAPSHOT/cxf-rt-ws-policy-2.0-incubator-SNAPSHOT.jar
[INFO] ----------------------------------------------------------------------------
[INFO] Building Apache CXF Runtime WS Addressing
[INFO]    task-segment: [clean, install]
[INFO] ----------------------------------------------------------------------------
[INFO] [clean:clean]
[INFO] Deleting directory /x1/continuum/working-directory/216/rt/ws/addr/target
[INFO] Deleting directory /x1/continuum/working-directory/216/rt/ws/addr/target/classes
[INFO] Deleting directory /x1/continuum/working-directory/216/rt/ws/addr/target/test-classes
[INFO] [checkstyle:checkstyle {execution: validate}]
[INFO] Starting audit...
Audit done.

[INFO] Preparing pmd:check
[INFO] [pmd:pmd]
[INFO] [pmd:check {execution: validate}]
[INFO] 
[INFO] [remote-resources:process {execution: default}]
[INFO] [resources:resources]
[INFO] Using default encoding to copy filtered resources.
[INFO] [compiler:compile]
[INFO] Compiling 15 source files to /x1/continuum/working-directory/216/rt/ws/addr/target/classes
[INFO] [resources:testResources]
[INFO] Using default encoding to copy filtered resources.
[INFO] [compiler:testCompile]
[INFO] Compiling 7 source files to /x1/continuum/working-directory/216/rt/ws/addr/target/test-classes
[INFO] [surefire:test]
[INFO] Surefire report directory: /x1/continuum/working-directory/216/rt/ws/addr/target/surefire-reports

-------------------------------------------------------
 T E S T S
-------------------------------------------------------
Running org.apache.cxf.ws.addressing.AddressingBuilderImplTest
Tests run: 2, Failures: 0, Errors: 0, Skipped: 0, Time elapsed: 0.193 sec
Running org.apache.cxf.ws.addressing.soap.MAPCodecTest
Tests run: 12, Failures: 0, Errors: 0, Skipped: 0, Time elapsed: 1.838 sec
Running org.apache.cxf.ws.addressing.spring.WSAFeatureXmlTest
java.net.SocketException: Permission denied
	at sun.nio.ch.Net.bind(Native Method)
	at sun.nio.ch.ServerSocketChannelImpl.bind(ServerSocketChannelImpl.java:119)
	at sun.nio.ch.ServerSocketAdaptor.bind(ServerSocketAdaptor.java:59)
	at org.mortbay.jetty.nio.SelectChannelConnector.open(SelectChannelConnector.java:209)
	at org.mortbay.jetty.AbstractConnector.doStart(AbstractConnector.java:252)
	at org.mortbay.jetty.nio.SelectChannelConnector.doStart(SelectChannelConnector.java:294)
	at org.mortbay.component.AbstractLifeCycle.start(AbstractLifeCycle.java:40)
	at org.mortbay.jetty.Server.doStart(Server.java:221)
	at org.mortbay.component.AbstractLifeCycle.start(AbstractLifeCycle.java:40)
	at org.apache.cxf.transport.http_jetty.JettyHTTPServerEngine.addServant(JettyHTTPServerEngine.java:170)
	at org.apache.cxf.transport.http_jetty.JettyHTTPDestination.activate(JettyHTTPDestination.java:143)
	at org.apache.cxf.transport.AbstractObservable.setMessageObserver(AbstractObservable.java:47)
	at org.apache.cxf.binding.AbstractBindingFactory.addListener(AbstractBindingFactory.java:152)
	at org.apache.cxf.binding.soap.SoapBindingFactory.addListener(SoapBindingFactory.java:527)
	at org.apache.cxf.endpoint.ServerImpl.start(ServerImpl.java:121)
	at org.apache.cxf.frontend.ServerFactoryBean.create(ServerFactoryBean.java:95)
	at org.apache.cxf.ws.addressing.spring.WSAFeatureXmlTest.testServerFactory(WSAFeatureXmlTest.java:53)
	at sun.reflect.NativeMethodAccessorImpl.invoke0(Native Method)
	at sun.reflect.NativeMethodAccessorImpl.invoke(NativeMethodAccessorImpl.java:39)
	at sun.reflect.DelegatingMethodAccessorImpl.invoke(DelegatingMethodAccessorImpl.java:25)
	at java.lang.reflect.Method.invoke(Method.java:585)
	at org.junit.internal.runners.TestMethodRunner.executeMethodBody(TestMethodRunner.java:99)
	at org.junit.internal.runners.TestMethodRunner.runUnprotected(TestMethodRunner.java:81)
	at org.junit.internal.runners.BeforeAndAfterRunner.runProtected(BeforeAndAfterRunner.java:34)
	at org.junit.internal.runners.TestMethodRunner.runMethod(TestMethodRunner.java:75)
	at org.junit.internal.runners.TestMethodRunner.run(TestMethodRunner.java:45)
	at org.junit.internal.runners.TestClassMethodsRunner.invokeTestMethod(TestClassMethodsRunner.java:66)
	at org.junit.internal.runners.TestClassMethodsRunner.run(TestClassMethodsRunner.java:35)
	at org.junit.internal.runners.TestClassRunner$1.runUnprotected(TestClassRunner.java:42)
	at org.junit.internal.runners.BeforeAndAfterRunner.runProtected(BeforeAndAfterRunner.java:34)
	at org.junit.internal.runners.TestClassRunner.run(TestClassRunner.java:52)
	at org.apache.maven.surefire.junit4.JUnit4TestSet.execute(JUnit4TestSet.java:62)
	at org.apache.maven.surefire.suite.AbstractDirectoryTestSuite.executeTestSet(AbstractDirectoryTestSuite.java:138)
	at org.apache.maven.surefire.suite.AbstractDirectoryTestSuite.execute(AbstractDirectoryTestSuite.java:125)
	at org.apache.maven.surefire.Surefire.run(Surefire.java:132)
	at sun.reflect.NativeMethodAccessorImpl.invoke0(Native Method)
	at sun.reflect.NativeMethodAccessorImpl.invoke(NativeMethodAccessorImpl.java:39)
	at sun.reflect.DelegatingMethodAccessorImpl.invoke(DelegatingMethodAccessorImpl.java:25)
	at java.lang.reflect.Method.invoke(Method.java:585)
	at org.apache.maven.surefire.booter.SurefireBooter.runSuitesInProcess(SurefireBooter.java:290)
	at org.apache.maven.surefire.booter.SurefireBooter.main(SurefireBooter.java:818)
Tests run: 1, Failures: 0, Errors: 0, Skipped: 0, Time elapsed: 9.777 sec
Running org.apache.cxf.ws.addressing.AddressingConstantsImplTest
Tests run: 33, Failures: 0, Errors: 0, Skipped: 0, Time elapsed: 0.087 sec
Running org.apache.cxf.ws.addressing.AddressingBuilderTest
Tests run: 1, Failures: 0, Errors: 0, Skipped: 0, Time elapsed: 0.014 sec
Running org.apache.cxf.ws.addressing.MAPAggregatorTest
Tests run: 24, Failures: 0, Errors: 0, Skipped: 0, Time elapsed: 1.238 sec
Running org.apache.cxf.ws.addressing.spring.WSAFeatureTest
Tests run: 1, Failures: 0, Errors: 0, Skipped: 0, Time elapsed: 1.322 sec

Results :

Tests run: 74, Failures: 0, Errors: 0, Skipped: 0

[INFO] [jar:jar]
[INFO] Building jar: /x1/continuum/working-directory/216/rt/ws/addr/target/cxf-rt-ws-addr-2.0-incubator-SNAPSHOT.jar
[INFO] [install:install]
[INFO] Installing /x1/continuum/working-directory/216/rt/ws/addr/target/cxf-rt-ws-addr-2.0-incubator-SNAPSHOT.jar to /home/continuum/.m2/repository/org/apache/cxf/cxf-rt-ws-addr/2.0-incubator-SNAPSHOT/cxf-rt-ws-addr-2.0-incubator-SNAPSHOT.jar
[INFO] ----------------------------------------------------------------------------
[INFO] Building Apache CXF Runtime WS Reliable Messaging
[INFO]    task-segment: [clean, install]
[INFO] ----------------------------------------------------------------------------
[INFO] [clean:clean]
[INFO] Deleting directory /x1/continuum/working-directory/216/rt/ws/rm/target
[INFO] Deleting directory /x1/continuum/working-directory/216/rt/ws/rm/target/classes
[INFO] Deleting directory /x1/continuum/working-directory/216/rt/ws/rm/target/test-classes
[INFO] [cobertura:clean {execution: default}]
[INFO] [checkstyle:checkstyle {execution: validate}]
[INFO] Starting audit...
Audit done.

[INFO] Preparing pmd:check
[INFO] [pmd:pmd]
[INFO] [pmd:check {execution: validate}]
[INFO] 
[INFO] [cxf-common-xsd:xsdtojava {execution: generate-sources}]
[INFO] [remote-resources:process {execution: default}]
[INFO] [resources:resources]
[INFO] Using default encoding to copy filtered resources.
[INFO] [compiler:compile]
[INFO] Compiling 65 source files to /x1/continuum/working-directory/216/rt/ws/rm/target/classes
[INFO] [resources:testResources]
[INFO] Using default encoding to copy filtered resources.
[INFO] [compiler:testCompile]
[INFO] Compiling 20 source files to /x1/continuum/working-directory/216/rt/ws/rm/target/test-classes
[INFO] [surefire:test]
[INFO] Surefire report directory: /x1/continuum/working-directory/216/rt/ws/rm/target/surefire-reports

-------------------------------------------------------
 T E S T S
-------------------------------------------------------
Running org.apache.cxf.ws.rm.RMUtilsTest
Tests run: 1, Failures: 0, Errors: 0, Skipped: 0, Time elapsed: 1.431 sec
Running org.apache.cxf.ws.rm.AbstractRMInterceptorTest
Tests run: 5, Failures: 0, Errors: 0, Skipped: 0, Time elapsed: 1.238 sec
Running org.apache.cxf.ws.rm.RMManagerConfigurationTest
Tests run: 1, Failures: 0, Errors: 0, Skipped: 0, Time elapsed: 5.932 sec
Running org.apache.cxf.ws.rm.persistence.PersistenceUtilsTest
Tests run: 1, Failures: 0, Errors: 0, Skipped: 0, Time elapsed: 0.567 sec
Running org.apache.cxf.ws.rm.AbstractEndpointTest
Tests run: 2, Failures: 0, Errors: 0, Skipped: 0, Time elapsed: 0.395 sec
Running org.apache.cxf.ws.rm.DestinationSequenceTest
Tests run: 25, Failures: 0, Errors: 0, Skipped: 0, Time elapsed: 3.55 sec
Running org.apache.cxf.ws.rm.RMContextUtilsTest
Tests run: 10, Failures: 0, Errors: 0, Skipped: 0, Time elapsed: 0.154 sec
Running org.apache.cxf.ws.rm.RMManagerTest
Tests run: 19, Failures: 0, Errors: 0, Skipped: 0, Time elapsed: 1.107 sec
Running org.apache.cxf.ws.rm.AbstractSequenceTest
Tests run: 1, Failures: 0, Errors: 0, Skipped: 0, Time elapsed: 0.013 sec
Running org.apache.cxf.ws.rm.policy.PolicyUtilsTest
Tests run: 3, Failures: 0, Errors: 0, Skipped: 0, Time elapsed: 0.013 sec
Running org.apache.cxf.ws.rm.soap.SoapFaultFactoryTest
Tests run: 6, Failures: 0, Errors: 0, Skipped: 0, Time elapsed: 0.879 sec
Running org.apache.cxf.ws.rm.RMEndpointTest
Tests run: 18, Failures: 0, Errors: 0, Skipped: 0, Time elapsed: 1.591 sec
Running org.apache.cxf.ws.rm.soap.RMSoapInterceptorTest
Tests run: 8, Failures: 0, Errors: 0, Skipped: 0, Time elapsed: 1.431 sec
Running org.apache.cxf.ws.rm.ProxyTest
Tests run: 12, Failures: 0, Errors: 0, Skipped: 0, Time elapsed: 0.587 sec
Running org.apache.cxf.ws.rm.DestinationTest
Tests run: 7, Failures: 0, Errors: 0, Skipped: 0, Time elapsed: 0.155 sec
Running org.apache.cxf.ws.rm.RMInInterceptorTest
Tests run: 13, Failures: 0, Errors: 0, Skipped: 0, Time elapsed: 0.572 sec
Running org.apache.cxf.ws.rm.RMOutInterceptorTest
Tests run: 5, Failures: 0, Errors: 0, Skipped: 0, Time elapsed: 0.199 sec
Running org.apache.cxf.ws.rm.persistence.jdbc.RMTxStoreTest
Tests run: 9, Failures: 0, Errors: 0, Skipped: 0, Time elapsed: 15.451 sec
Running org.apache.cxf.ws.rm.soap.RetransmissionQueueImplTest
Tests run: 10, Failures: 0, Errors: 0, Skipped: 0, Time elapsed: 0.451 sec
Running org.apache.cxf.ws.rm.SourceSequenceTest
Tests run: 8, Failures: 0, Errors: 0, Skipped: 0, Time elapsed: 1.081 sec

Results :

Tests run: 164, Failures: 0, Errors: 0, Skipped: 0

[INFO] [jar:jar]
[INFO] Building jar: /x1/continuum/working-directory/216/rt/ws/rm/target/cxf-rt-ws-rm-2.0-incubator-SNAPSHOT.jar
[INFO] [install:install]
[INFO] Installing /x1/continuum/working-directory/216/rt/ws/rm/target/cxf-rt-ws-rm-2.0-incubator-SNAPSHOT.jar to /home/continuum/.m2/repository/org/apache/cxf/cxf-rt-ws-rm/2.0-incubator-SNAPSHOT/cxf-rt-ws-rm-2.0-incubator-SNAPSHOT.jar
[INFO] ----------------------------------------------------------------------------
[INFO] Building Apache CXF Runtime WS Security
[INFO]    task-segment: [clean, install]
[INFO] ----------------------------------------------------------------------------
[INFO] [clean:clean]
[INFO] Deleting directory /x1/continuum/working-directory/216/rt/ws/security/target
[INFO] Deleting directory /x1/continuum/working-directory/216/rt/ws/security/target/classes
[INFO] Deleting directory /x1/continuum/working-directory/216/rt/ws/security/target/test-classes
[INFO] [checkstyle:checkstyle {execution: validate}]
[INFO] Starting audit...
Audit done.

[INFO] Preparing pmd:check
[INFO] [pmd:pmd]
[INFO] [pmd:check {execution: validate}]
[INFO] 
Downloading: http://repo1.maven.org/maven2/wss4j/wss4j/1.5.1/wss4j-1.5.1.pom
Downloading: http://repo1.maven.org/maven2/xml-security/xmlsec/1.3.0/xmlsec-1.3.0.pom
[INFO] [remote-resources:process {execution: default}]
[INFO] [resources:resources]
[INFO] Using default encoding to copy filtered resources.
[INFO] [compiler:compile]
[INFO] Compiling 3 source files to /x1/continuum/working-directory/216/rt/ws/security/target/classes
[INFO] [resources:testResources]
[INFO] Using default encoding to copy filtered resources.
[INFO] [compiler:testCompile]
[INFO] Compiling 7 source files to /x1/continuum/working-directory/216/rt/ws/security/target/test-classes
[INFO] [surefire:test]
[INFO] Surefire report directory: /x1/continuum/working-directory/216/rt/ws/security/target/surefire-reports

-------------------------------------------------------
 T E S T S
-------------------------------------------------------
Running org.apache.cxf.ws.security.wss4j.RoundTripTest
Tests run: 3, Failures: 0, Errors: 1, Skipped: 0, Time elapsed: 56.784 sec <<< FAILURE!
testSignature(org.apache.cxf.ws.security.wss4j.RoundTripTest)  Time elapsed: 14.98 sec  <<< ERROR!
javax.xml.ws.soap.SOAPFaultException: SOAPEXCEPTION
	at org.apache.cxf.jaxws.JaxWsClientProxy.invoke(JaxWsClientProxy.java:165)
	at $Proxy44.echo(Unknown Source)
	at org.apache.cxf.ws.security.wss4j.RoundTripTest.testSignature(RoundTripTest.java:87)
	at sun.reflect.NativeMethodAccessorImpl.invoke0(Native Method)
	at sun.reflect.NativeMethodAccessorImpl.invoke(NativeMethodAccessorImpl.java:39)
	at sun.reflect.DelegatingMethodAccessorImpl.invoke(DelegatingMethodAccessorImpl.java:25)
	at java.lang.reflect.Method.invoke(Method.java:585)
	at org.junit.internal.runners.TestMethodRunner.executeMethodBody(TestMethodRunner.java:99)
	at org.junit.internal.runners.TestMethodRunner.runUnprotected(TestMethodRunner.java:81)
	at org.junit.internal.runners.BeforeAndAfterRunner.runProtected(BeforeAndAfterRunner.java:34)
	at org.junit.internal.runners.TestMethodRunner.runMethod(TestMethodRunner.java:75)
	at org.junit.internal.runners.TestMethodRunner.run(TestMethodRunner.java:45)
	at org.junit.internal.runners.TestClassMethodsRunner.invokeTestMethod(TestClassMethodsRunner.java:66)
	at org.junit.internal.runners.TestClassMethodsRunner.run(TestClassMethodsRunner.java:35)
	at org.junit.internal.runners.TestClassRunner$1.runUnprotected(TestClassRunner.java:42)
	at org.junit.internal.runners.BeforeAndAfterRunner.runProtected(BeforeAndAfterRunner.java:34)
	at org.junit.internal.runners.TestClassRunner.run(TestClassRunner.java:52)
	at org.apache.maven.surefire.junit4.JUnit4TestSet.execute(JUnit4TestSet.java:62)
	at org.apache.maven.surefire.suite.AbstractDirectoryTestSuite.executeTestSet(AbstractDirectoryTestSuite.java:138)
	at org.apache.maven.surefire.suite.AbstractDirectoryTestSuite.execute(AbstractDirectoryTestSuite.java:125)
	at org.apache.maven.surefire.Surefire.run(Surefire.java:132)
	at sun.reflect.NativeMethodAccessorImpl.invoke0(Native Method)
	at sun.reflect.NativeMethodAccessorImpl.invoke(NativeMethodAccessorImpl.java:39)
	at sun.reflect.DelegatingMethodAccessorImpl.invoke(DelegatingMethodAccessorImpl.java:25)
	at java.lang.reflect.Method.invoke(Method.java:585)
	at org.apache.maven.surefire.booter.SurefireBooter.runSuitesInProcess(SurefireBooter.java:290)
	at org.apache.maven.surefire.booter.SurefireBooter.main(SurefireBooter.java:818)
Caused by: org.apache.cxf.binding.soap.SoapFault: SOAPEXCEPTION
	at org.apache.cxf.binding.soap.interceptor.Soap11FaultInInterceptor.handleMessage(Soap11FaultInInterceptor.java:70)
	at org.apache.cxf.binding.soap.interceptor.Soap11FaultInInterceptor.handleMessage(Soap11FaultInInterceptor.java:36)
	at org.apache.cxf.phase.PhaseInterceptorChain.doIntercept(PhaseInterceptorChain.java:147)
	at org.apache.cxf.interceptor.AbstractFaultChainInitiatorObserver.onMessage(AbstractFaultChainInitiatorObserver.java:86)
	at org.apache.cxf.binding.soap.interceptor.ReadHeadersInterceptor.handleMessage(ReadHeadersInterceptor.java:175)
	at org.apache.cxf.binding.soap.interceptor.ReadHeadersInterceptor.handleMessage(ReadHeadersInterceptor.java:57)
	at org.apache.cxf.phase.PhaseInterceptorChain.doIntercept(PhaseInterceptorChain.java:147)
	at org.apache.cxf.endpoint.ClientImpl.onMessage(ClientImpl.java:394)
	at org.apache.cxf.transport.local.LocalDestination$SynchronousConduit$1.run(LocalDestination.java:88)
	at java.lang.Thread.run(Thread.java:595)

Running org.apache.cxf.ws.security.wss4j.WSS4JInOutTest
Tests run: 2, Failures: 0, Errors: 0, Skipped: 0, Time elapsed: 2.618 sec
Running org.apache.cxf.ws.security.wss4j.WSS4JOutInterceptorTest
Tests run: 5, Failures: 0, Errors: 0, Skipped: 0, Time elapsed: 4.636 sec

Results :

Tests in error: 
  testSignature(org.apache.cxf.ws.security.wss4j.RoundTripTest)

Tests run: 10, Failures: 0, Errors: 1, Skipped: 0

[INFO] ------------------------------------------------------------------------
[ERROR] BUILD FAILURE
[INFO] ------------------------------------------------------------------------
[INFO] There are test failures.
[INFO] ------------------------------------------------------------------------
[INFO] For more information, run Maven with the -e switch
[INFO] ------------------------------------------------------------------------
[INFO] Total time: 35 minutes 44 seconds
[INFO] Finished at: Thu Jun 07 04:05:41 PDT 2007
[INFO] Final Memory: 52M/63M
[INFO] ------------------------------------------------------------------------

****************************************************************************



Mime
View raw message