cxf-notifications mailing list archives

Site index · List index
Message view « Date » · « Thread »
Top « Date » · « Thread »
From "Continuum@vmbuild.apache.org" <cxf-notificati...@incubator.apache.org>
Subject [continuum] BUILD FAILURE: Apache CXF
Date Wed, 01 Aug 2007 07:07:49 GMT
Online report : http://vmbuild.apache.org/continuum/servlet/continuum/target/ProjectBuild.vm/view/ProjectBuild/id/216/buildId/238309
Build statistics:
  State: Failed
  Previous State: Failed
  Started at: Wed, 1 Aug 2007 00:01:11 -0700
  Finished at: Wed, 1 Aug 2007 00:07:48 -0700
  Total time: 6m 37s
  Build Trigger: Schedule
  Exit code: 1
  Building machine hostname: vmbuild.apache.org
  Operating system : Linux(unknown)
  Java version : 1.5.0_06(Sun Microsystems Inc.)

Changes
         jliu          Move the invocation of actually object to a separate method, this makes it easier to override the invocation while still be able to reuse other functionalities in AbstractInvoker and JAXWSMethodInvoker. Below is the comment from Bharath: "In a J2EE container model, when the Endpoint has no SEI(no interface), the container would like to give some crude object, which might be like an InvocationHandler, this crude object's invoke method would have the logic to the actual invocation on the POJO. So this Object would not contain the actual which CXF is supposed to invoke, instead it would act like a dispatcher, which would have an invoke() method, which internally takes care of maintaining the POJO Instance and performing the invocation"
             /incubator/cxf/trunk/rt/core/src/main/java/org/apache/cxf/service/invoker/AbstractInvoker.java
        
****************************************************************************
Output:
****************************************************************************
[INFO] Scanning for projects...
[INFO] Reactor build order: 
[INFO]   Apache CXF
[INFO]   Apache CXF Buildtools
[INFO]   Apache CXF Parent
[INFO]   Apache CXF Common Utilities
[INFO]   Apache CXF Common XSD2Java  Plugins
[INFO]   Apache CXF Common Schemas
[INFO]   Apache CXF XJC Default Value Plugin
[INFO]   Apache CXF XJC toString Plugin
[INFO]   Apache CXF XJC Default Value Plugin Tests
[INFO]   Apache CXF XJC toString Plugin Tests
[INFO]   Apache CXF XJC Plugins
[INFO]   Apache CXF Common
[INFO]   Apache CXF API
[INFO]   Apache CXF Command Line Tools Common
[INFO]   Apache CXF Runtime Core
[INFO]   Apache CXF Command Line Tools Validator
[INFO]   Apache CXF Command Line Tools WSDLTo Core
[INFO]   Apache CXF Command Line Tools WSDLTo JAXWS Frontend
[INFO]   Apache CXF Command Line Tools WSDLTo JAXB Databinding
[INFO]   Apache CXF Command Line Tools JavaTo Core
[INFO]   Apache CXF Code Generation Maven2 Plugins
[INFO]   Apache CXF Test Utilities
[INFO]   Apache CXF Runtime JAXB DataBinding
[INFO]   Apache CXF Runtime SOAP Binding
[INFO]   Apache CXF Runtime Management
[INFO]   Apache CXF Runtime JMS Transport
[INFO]   Apache CXF Runtime XML Binding
[INFO]   Apache CXF Command Line Tools WSDLTo Test
[INFO]   Apache CXF Command Line Tools WSDLTo Misctools
[INFO]   Apache CXF Command Line Tools
[INFO]   Apache CXF Command Line Tools WSDLTo
[INFO]   Apache CXF Runtime Local transport
[INFO]   Apache CXF Runtime Simple Frontend
[INFO]   Apache CXF Runtime JAX-WS Frontend
[INFO]   Apache CXF Command Line Tools JavaTo Test
[INFO]   Apache CXF Command Line Tools JavaTo
[INFO]   Apache CXF Ant Tasks
[INFO]   Apache CXF Runtime HTTP transport
[INFO]   Apache CXF Runtime HTTP Jetty transport
[INFO]   Apache CXF Runtime Aegis Databinding
[INFO]   Apache CXF Runtime HTTP Binding
[INFO]   Apache CXF Runtime Object Binding
[INFO]   Apache CXF Colocated Binding
[INFO]   Apache CXF Runtime JBI Binding
[INFO]   Apache CXF Runtime
[INFO]   Apache CXF Runtime Bindings
[INFO]   Apache CXF Runtime JavaScript Frontend
[INFO]   Apache CXF Runtime JBI transport
[INFO]   Apache CXF Runtime WS Policy
[INFO]   Apache CXF Runtime WS Addressing
[INFO]   Apache CXF Runtime WS Reliable Messaging
[INFO]   Apache CXF Runtime WS Security
[INFO]   Apache CXF JBI Integration
[INFO]   Apache CXF JCA Connection
[INFO]   Apache CXF Integration
[INFO]   Apache CXF System Tests
[INFO]   Apache CXF Archetype - cxf-http-basic
[INFO]   Apache CXF Maven Archetypes
[INFO]   Apache CXF Eclipse Plugin Generator Maven2 Plugin
[INFO] ----------------------------------------------------------------------------
[INFO] Building Apache CXF
[INFO]    task-segment: [clean, install]
[INFO] ----------------------------------------------------------------------------
[INFO] [clean:clean]
[INFO] Deleting directory /x1/continuum/working-directory/216/target
[INFO] Deleting directory /x1/continuum/working-directory/216/target/classes
[INFO] Deleting directory /x1/continuum/working-directory/216/target/test-classes
[INFO] Deleting directory /x1/continuum/working-directory/216/target/site
[INFO] [site:attach-descriptor]
[INFO] [install:install]
[INFO] Installing /x1/continuum/working-directory/216/pom.xml to /home/continuum/.m2/repository/org/apache/cxf/cxf/2.1-incubator-SNAPSHOT/cxf-2.1-incubator-SNAPSHOT.pom
[INFO] ----------------------------------------------------------------------------
[INFO] Building Apache CXF Buildtools
[INFO]    task-segment: [clean, install]
[INFO] ----------------------------------------------------------------------------
[INFO] [clean:clean]
[INFO] Deleting directory /x1/continuum/working-directory/216/buildtools/target
[INFO] Deleting directory /x1/continuum/working-directory/216/buildtools/target/classes
[INFO] Deleting directory /x1/continuum/working-directory/216/buildtools/target/test-classes
[INFO] Deleting directory /x1/continuum/working-directory/216/buildtools/target/site
[INFO] [resources:resources]
[INFO] Using default encoding to copy filtered resources.
[INFO] [compiler:compile]
[INFO] Compiling 1 source file to /x1/continuum/working-directory/216/buildtools/target/classes
[INFO] [resources:testResources]
[INFO] Using default encoding to copy filtered resources.
[INFO] [compiler:testCompile]
[INFO] Not compiling test sources
[INFO] [surefire:test]
[INFO] Tests are skipped.
[INFO] [jar:jar]
[INFO] Building jar: /x1/continuum/working-directory/216/buildtools/target/cxf-buildtools-2.1-incubator-SNAPSHOT.jar
[INFO] [install:install]
[INFO] Installing /x1/continuum/working-directory/216/buildtools/target/cxf-buildtools-2.1-incubator-SNAPSHOT.jar to /home/continuum/.m2/repository/org/apache/cxf/cxf-buildtools/2.1-incubator-SNAPSHOT/cxf-buildtools-2.1-incubator-SNAPSHOT.jar
[INFO] ----------------------------------------------------------------------------
[INFO] Building Apache CXF Parent
[INFO]    task-segment: [clean, install]
[INFO] ----------------------------------------------------------------------------
[INFO] [clean:clean]
[INFO] Deleting directory /x1/continuum/working-directory/216/parent/target
[INFO] Deleting directory /x1/continuum/working-directory/216/parent/target/classes
[INFO] Deleting directory /x1/continuum/working-directory/216/parent/target/test-classes
[INFO] Deleting directory /x1/continuum/working-directory/216/parent/target/site
[INFO] snapshot org.apache.cxf:cxf-buildtools:2.1-incubator-SNAPSHOT: checking for updates from snapshots
[INFO] snapshot org.apache.cxf:cxf-buildtools:2.1-incubator-SNAPSHOT: checking for updates from apache.snapshots
[INFO] Setting property: classpath.resource.loader.class => 'org.codehaus.plexus.velocity.ContextClassLoaderResourceLoader'.
[INFO] Setting property: velocimacro.messages.on => 'false'.
[INFO] Setting property: resource.loader => 'classpath'.
[INFO] Setting property: resource.manager.logwhenfound => 'false'.
[INFO] ************************************************************** 
[INFO] Starting Jakarta Velocity v1.4
[INFO] RuntimeInstance initializing.
[INFO] Default Properties File: org/apache/velocity/runtime/defaults/velocity.properties
[INFO] Default ResourceManager initializing. (class org.apache.velocity.runtime.resource.ResourceManagerImpl)
[INFO] Resource Loader Instantiated: org.codehaus.plexus.velocity.ContextClassLoaderResourceLoader
[INFO] ClasspathResourceLoader : initialization starting.
[INFO] ClasspathResourceLoader : initialization complete.
[INFO] ResourceCache : initialized. (class org.apache.velocity.runtime.resource.ResourceCacheImpl)
[INFO] Default ResourceManager initialization complete.
[INFO] Loaded System Directive: org.apache.velocity.runtime.directive.Literal
[INFO] Loaded System Directive: org.apache.velocity.runtime.directive.Macro
[INFO] Loaded System Directive: org.apache.velocity.runtime.directive.Parse
[INFO] Loaded System Directive: org.apache.velocity.runtime.directive.Include
[INFO] Loaded System Directive: org.apache.velocity.runtime.directive.Foreach
[INFO] Created: 20 parsers.
[INFO] Velocimacro : initialization starting.
[INFO] Velocimacro : adding VMs from VM library template : VM_global_library.vm
[ERROR] ResourceManager : unable to find resource 'VM_global_library.vm' in any resource loader.
[INFO] Velocimacro : error using  VM library template VM_global_library.vm : org.apache.velocity.exception.ResourceNotFoundException: Unable to find resource 'VM_global_library.vm'
[INFO] Velocimacro :  VM library template macro registration complete.
[INFO] Velocimacro : allowInline = true : VMs can be defined inline in templates
[INFO] Velocimacro : allowInlineToOverride = false : VMs defined inline may NOT replace previous VM definitions
[INFO] Velocimacro : allowInlineLocal = false : VMs defined inline will be  global in scope if allowed.
[INFO] Velocimacro : initialization complete.
[INFO] Velocity successfully started.
[INFO] [checkstyle:checkstyle {execution: validate}]
[INFO] Source directory does not exist - skipping report.
[INFO] Preparing pmd:check
[INFO] [pmd:pmd]
[INFO] [pmd:check {execution: validate}]
[INFO] Setting property: classpath.resource.loader.class => 'org.codehaus.plexus.velocity.ContextClassLoaderResourceLoader'.
[INFO] Setting property: velocimacro.messages.on => 'false'.
[INFO] Setting property: resource.loader => 'classpath'.
[INFO] Setting property: resource.manager.logwhenfound => 'false'.
[INFO] [remote-resources:process {execution: default}]
[INFO] [site:attach-descriptor]
[INFO] [install:install]
[INFO] Installing /x1/continuum/working-directory/216/parent/pom.xml to /home/continuum/.m2/repository/org/apache/cxf/cxf-parent/2.1-incubator-SNAPSHOT/cxf-parent-2.1-incubator-SNAPSHOT.pom
[INFO] ----------------------------------------------------------------------------
[INFO] Building Apache CXF Common Utilities
[INFO]    task-segment: [clean, install]
[INFO] ----------------------------------------------------------------------------
[INFO] [clean:clean]
[INFO] Deleting directory /x1/continuum/working-directory/216/common/common/target
[INFO] Deleting directory /x1/continuum/working-directory/216/common/common/target/classes
[INFO] Deleting directory /x1/continuum/working-directory/216/common/common/target/test-classes
[INFO] Deleting directory /x1/continuum/working-directory/216/common/common/target/site
[INFO] [checkstyle:checkstyle {execution: validate}]
[INFO] Starting audit...
Audit done.

[INFO] Preparing pmd:check
[INFO] [pmd:pmd]
[INFO] [pmd:check {execution: validate}]
[INFO] 
[INFO] [remote-resources:process {execution: default}]
[INFO] [resources:resources]
[INFO] Using default encoding to copy filtered resources.
[INFO] [compiler:compile]
[INFO] Compiling 102 source files to /x1/continuum/working-directory/216/common/common/target/classes
[INFO] [resources:testResources]
[INFO] Using default encoding to copy filtered resources.
[INFO] [compiler:testCompile]
[INFO] Compiling 37 source files to /x1/continuum/working-directory/216/common/common/target/test-classes
[INFO] [surefire:test]
[INFO] Surefire report directory: /x1/continuum/working-directory/216/common/common/target/surefire-reports

-------------------------------------------------------
 T E S T S
-------------------------------------------------------
Running org.apache.cxf.helpers.ServiceUtilsTest
Tests run: 1, Failures: 0, Errors: 0, Skipped: 0, Time elapsed: 0.059 sec
Running org.apache.cxf.common.commands.ForkedCommandTest
Tests run: 4, Failures: 0, Errors: 0, Skipped: 0, Time elapsed: 1.675 sec
Running org.apache.cxf.common.classloader.FireWallClassLoaderTest
Tests run: 4, Failures: 0, Errors: 0, Skipped: 0, Time elapsed: 0.051 sec
Running org.apache.cxf.common.util.Base64UtilityTest
Tests run: 3, Failures: 0, Errors: 0, Skipped: 0, Time elapsed: 0.049 sec
Running org.apache.cxf.version.VersionTest
Tests run: 2, Failures: 0, Errors: 0, Skipped: 0, Time elapsed: 0.02 sec
Running org.apache.cxf.common.util.CollectionUtilsTest
Tests run: 2, Failures: 0, Errors: 0, Skipped: 0, Time elapsed: 0.012 sec
Running org.apache.cxf.common.util.PackageUtilsTest
Tests run: 2, Failures: 0, Errors: 0, Skipped: 0, Time elapsed: 0.032 sec
Running org.apache.cxf.configuration.spring.SpringBeanMapTest
Tests run: 1, Failures: 0, Errors: 0, Skipped: 0, Time elapsed: 1.224 sec
Running org.apache.cxf.common.annotation.AnnotationProcessorTest
Tests run: 5, Failures: 0, Errors: 0, Skipped: 0, Time elapsed: 0.176 sec
Running org.apache.cxf.resource.ClassLoaderResolverTest
Tests run: 2, Failures: 0, Errors: 0, Skipped: 0, Time elapsed: 0.048 sec
Running org.apache.cxf.helpers.XMLUtilsTest
Tests run: 1, Failures: 0, Errors: 0, Skipped: 0, Time elapsed: 0.109 sec
Running org.apache.cxf.helpers.NameSpaceTest
Tests run: 2, Failures: 0, Errors: 0, Skipped: 0, Time elapsed: 0.094 sec
Running org.apache.cxf.common.util.TwoStageCacheTest
Tests run: 4, Failures: 0, Errors: 0, Skipped: 0, Time elapsed: 2.393 sec
Running org.apache.cxf.jaxb.JAXBElementToStringStyleTest
Tests run: 3, Failures: 0, Errors: 0, Skipped: 0, Time elapsed: 0.061 sec
Running org.apache.cxf.common.i18n.BundleUtilsTest
Tests run: 2, Failures: 0, Errors: 0, Skipped: 0, Time elapsed: 0.024 sec
Running org.apache.cxf.jaxb.JAXBUtilsTest
Tests run: 4, Failures: 0, Errors: 0, Skipped: 0, Time elapsed: 0.05 sec
Running org.apache.cxf.resource.URIResolverTest
Tests run: 2, Failures: 0, Errors: 0, Skipped: 0, Time elapsed: 0.022 sec
Running org.apache.cxf.common.injection.ResourceInjectorTest
Tests run: 8, Failures: 0, Errors: 0, Skipped: 0, Time elapsed: 0.082 sec
Running org.apache.cxf.staxutils.FragmentStreamReaderTest
Tests run: 1, Failures: 0, Errors: 0, Skipped: 0, Time elapsed: 0.328 sec
Running org.apache.cxf.staxutils.W3CDOMStreamReaderTest
Tests run: 1, Failures: 0, Errors: 0, Skipped: 0, Time elapsed: 0.204 sec
Running org.apache.cxf.configuration.spring.SpringBeanQNameMapTest
Tests run: 1, Failures: 0, Errors: 0, Skipped: 0, Time elapsed: 0.166 sec
Running org.apache.cxf.staxutils.StaxUtilsTest
Tests run: 5, Failures: 0, Errors: 0, Skipped: 0, Time elapsed: 0.09 sec
Running org.apache.cxf.jaxb.DatatypeFactoryTest
Tests run: 1, Failures: 0, Errors: 0, Skipped: 0, Time elapsed: 0.035 sec
Running org.apache.cxf.common.i18n.MessageTest
Tests run: 2, Failures: 0, Errors: 0, Skipped: 0, Time elapsed: 0.013 sec
Running org.apache.cxf.common.logging.LogUtilsTest
Tests run: 7, Failures: 0, Errors: 0, Skipped: 0, Time elapsed: 0.109 sec
Running org.apache.cxf.staxutils.DepthXMLStreamReaderTest
Tests run: 1, Failures: 0, Errors: 0, Skipped: 0, Time elapsed: 0.024 sec
Running org.apache.cxf.jaxb.JAXBToStringBuilderTest
Tests run: 4, Failures: 0, Errors: 0, Skipped: 0, Time elapsed: 0.018 sec
Running org.apache.cxf.common.util.PropertiesLoaderUtilsTest
Tests run: 2, Failures: 0, Errors: 0, Skipped: 0, Time elapsed: 0.052 sec
Running org.apache.cxf.common.util.StringUtilsTest
Tests run: 6, Failures: 0, Errors: 0, Skipped: 0, Time elapsed: 0.029 sec
Running org.apache.cxf.common.commands.ResultBufferedCommandTest
Tests run: 2, Failures: 0, Errors: 0, Skipped: 0, Time elapsed: 0.662 sec
Running org.apache.cxf.staxutils.StaxStreamFilterTest
Tests run: 2, Failures: 0, Errors: 0, Skipped: 0, Time elapsed: 0.033 sec

Results :

Tests run: 87, Failures: 0, Errors: 0, Skipped: 0

[INFO] [jar:jar]
[INFO] Building jar: /x1/continuum/working-directory/216/common/common/target/cxf-common-utilities-2.1-incubator-SNAPSHOT.jar
[INFO] [install:install]
[INFO] Installing /x1/continuum/working-directory/216/common/common/target/cxf-common-utilities-2.1-incubator-SNAPSHOT.jar to /home/continuum/.m2/repository/org/apache/cxf/cxf-common-utilities/2.1-incubator-SNAPSHOT/cxf-common-utilities-2.1-incubator-SNAPSHOT.jar
[INFO] ----------------------------------------------------------------------------
[INFO] Building Apache CXF Common XSD2Java  Plugins
[INFO]    task-segment: [clean, install]
[INFO] ----------------------------------------------------------------------------
[INFO] [clean:clean]
[INFO] Deleting directory /x1/continuum/working-directory/216/common/xsd/target
[INFO] Deleting directory /x1/continuum/working-directory/216/common/xsd/target/classes
[INFO] Deleting directory /x1/continuum/working-directory/216/common/xsd/target/test-classes
[INFO] Deleting directory /x1/continuum/working-directory/216/common/xsd/target/site
[INFO] [checkstyle:checkstyle {execution: validate}]
[INFO] Starting audit...
Audit done.

[INFO] Preparing pmd:check
[INFO] [pmd:pmd]
[INFO] [pmd:check {execution: validate}]
[INFO] 
[INFO] [plugin:descriptor]
[INFO] Using 2 extractors.
[INFO] Applying extractor for language: java
[INFO] Extractor for language: java found 1 mojo descriptors.
[INFO] Applying extractor for language: bsh
[INFO] Extractor for language: bsh found 0 mojo descriptors.
[INFO] [remote-resources:process {execution: default}]
[INFO] [resources:resources]
[INFO] Using default encoding to copy filtered resources.
[INFO] [compiler:compile]
[INFO] Compiling 3 source files to /x1/continuum/working-directory/216/common/xsd/target/classes
[INFO] [resources:testResources]
[INFO] Using default encoding to copy filtered resources.
[INFO] [compiler:testCompile]
[INFO] No sources to compile
[INFO] [surefire:test]
[INFO] Surefire report directory: /x1/continuum/working-directory/216/common/xsd/target/surefire-reports

-------------------------------------------------------
 T E S T S
-------------------------------------------------------
There are no tests to run.

Results :

Tests run: 0, Failures: 0, Errors: 0, Skipped: 0

[INFO] [jar:jar]
[INFO] Building jar: /x1/continuum/working-directory/216/common/xsd/target/cxf-common-xsd-2.1-incubator-SNAPSHOT.jar
[INFO] [plugin:addPluginArtifactMetadata]
[INFO] [install:install]
[INFO] Installing /x1/continuum/working-directory/216/common/xsd/target/cxf-common-xsd-2.1-incubator-SNAPSHOT.jar to /home/continuum/.m2/repository/org/apache/cxf/cxf-common-xsd/2.1-incubator-SNAPSHOT/cxf-common-xsd-2.1-incubator-SNAPSHOT.jar
[INFO] [plugin:updateRegistry]
[INFO] ----------------------------------------------------------------------------
[INFO] Building Apache CXF Common Schemas
[INFO]    task-segment: [clean, install]
[INFO] ----------------------------------------------------------------------------
[INFO] [clean:clean]
[INFO] Deleting directory /x1/continuum/working-directory/216/common/schemas/target
[INFO] Deleting directory /x1/continuum/working-directory/216/common/schemas/target/classes
[INFO] Deleting directory /x1/continuum/working-directory/216/common/schemas/target/test-classes
[INFO] Deleting directory /x1/continuum/working-directory/216/common/schemas/target/site
[INFO] [checkstyle:checkstyle {execution: validate}]
[INFO] Starting audit...
Audit done.

[INFO] Preparing pmd:check
[INFO] [pmd:pmd]
[INFO] [pmd:check {execution: validate}]
[INFO] 
[INFO] [remote-resources:process {execution: default}]
[INFO] [resources:resources]
[INFO] Using default encoding to copy filtered resources.
[INFO] [compiler:compile]
[INFO] No sources to compile
[INFO] [resources:testResources]
[INFO] Using default encoding to copy filtered resources.
[INFO] [compiler:testCompile]
[INFO] Not compiling test sources
[INFO] [surefire:test]
[INFO] Tests are skipped.
[INFO] [jar:jar]
[INFO] Building jar: /x1/continuum/working-directory/216/common/schemas/target/cxf-common-schemas-2.1-incubator-SNAPSHOT.jar
[INFO] [install:install]
[INFO] Installing /x1/continuum/working-directory/216/common/schemas/target/cxf-common-schemas-2.1-incubator-SNAPSHOT.jar to /home/continuum/.m2/repository/org/apache/cxf/cxf-common-schemas/2.1-incubator-SNAPSHOT/cxf-common-schemas-2.1-incubator-SNAPSHOT.jar
[INFO] ----------------------------------------------------------------------------
[INFO] Building Apache CXF XJC Default Value Plugin
[INFO]    task-segment: [clean, install]
[INFO] ----------------------------------------------------------------------------
[INFO] [clean:clean]
[INFO] Deleting directory /x1/continuum/working-directory/216/common/xjc/dv/target
[INFO] Deleting directory /x1/continuum/working-directory/216/common/xjc/dv/target/classes
[INFO] Deleting directory /x1/continuum/working-directory/216/common/xjc/dv/target/test-classes
[INFO] Deleting directory /x1/continuum/working-directory/216/common/xjc/dv/target/site
[INFO] [checkstyle:checkstyle {execution: validate}]
[INFO] Starting audit...
Audit done.

[INFO] Preparing pmd:check
[INFO] [pmd:pmd]
[INFO] [pmd:check {execution: validate}]
[INFO] 
[INFO] [remote-resources:process {execution: default}]
[INFO] [resources:resources]
[INFO] Using default encoding to copy filtered resources.
[INFO] [compiler:compile]
[INFO] Compiling 1 source file to /x1/continuum/working-directory/216/common/xjc/dv/target/classes
[INFO] [resources:testResources]
[INFO] Using default encoding to copy filtered resources.
[INFO] [compiler:testCompile]
[INFO] Not compiling test sources
[INFO] [surefire:test]
[INFO] Tests are skipped.
[INFO] [jar:jar]
[INFO] Building jar: /x1/continuum/working-directory/216/common/xjc/dv/target/cxf-xjc-dv-2.1-incubator-SNAPSHOT.jar
[INFO] [install:install]
[INFO] Installing /x1/continuum/working-directory/216/common/xjc/dv/target/cxf-xjc-dv-2.1-incubator-SNAPSHOT.jar to /home/continuum/.m2/repository/org/apache/cxf/cxf-xjc-dv/2.1-incubator-SNAPSHOT/cxf-xjc-dv-2.1-incubator-SNAPSHOT.jar
[INFO] ----------------------------------------------------------------------------
[INFO] Building Apache CXF XJC toString Plugin
[INFO]    task-segment: [clean, install]
[INFO] ----------------------------------------------------------------------------
[INFO] [clean:clean]
[INFO] Deleting directory /x1/continuum/working-directory/216/common/xjc/ts/target
[INFO] Deleting directory /x1/continuum/working-directory/216/common/xjc/ts/target/classes
[INFO] Deleting directory /x1/continuum/working-directory/216/common/xjc/ts/target/test-classes
[INFO] Deleting directory /x1/continuum/working-directory/216/common/xjc/ts/target/site
[INFO] [checkstyle:checkstyle {execution: validate}]
[INFO] Starting audit...
Audit done.

[INFO] Preparing pmd:check
[INFO] [pmd:pmd]
[INFO] [pmd:check {execution: validate}]
[INFO] 
[INFO] [remote-resources:process {execution: default}]
[INFO] [resources:resources]
[INFO] Using default encoding to copy filtered resources.
[INFO] [compiler:compile]
[INFO] Compiling 1 source file to /x1/continuum/working-directory/216/common/xjc/ts/target/classes
[INFO] [resources:testResources]
[INFO] Using default encoding to copy filtered resources.
[INFO] [compiler:testCompile]
[INFO] Not compiling test sources
[INFO] [surefire:test]
[INFO] Tests are skipped.
[INFO] [jar:jar]
[INFO] Building jar: /x1/continuum/working-directory/216/common/xjc/ts/target/cxf-xjc-ts-2.1-incubator-SNAPSHOT.jar
[INFO] [install:install]
[INFO] Installing /x1/continuum/working-directory/216/common/xjc/ts/target/cxf-xjc-ts-2.1-incubator-SNAPSHOT.jar to /home/continuum/.m2/repository/org/apache/cxf/cxf-xjc-ts/2.1-incubator-SNAPSHOT/cxf-xjc-ts-2.1-incubator-SNAPSHOT.jar
[INFO] ----------------------------------------------------------------------------
[INFO] Building Apache CXF XJC Default Value Plugin Tests
[INFO]    task-segment: [clean, install]
[INFO] ----------------------------------------------------------------------------
[INFO] [clean:clean]
[INFO] Deleting directory /x1/continuum/working-directory/216/common/xjc/dv-test/target
[INFO] Deleting directory /x1/continuum/working-directory/216/common/xjc/dv-test/target/classes
[INFO] Deleting directory /x1/continuum/working-directory/216/common/xjc/dv-test/target/test-classes
[INFO] Deleting directory /x1/continuum/working-directory/216/common/xjc/dv-test/target/site
[INFO] [checkstyle:checkstyle {execution: validate}]
[INFO] Starting audit...
Audit done.

[INFO] Preparing pmd:check
[INFO] [pmd:pmd]
[INFO] [pmd:check {execution: validate}]
[INFO] 
[INFO] snapshot org.apache.cxf:cxf-xjc-dv:2.1-incubator-SNAPSHOT: checking for updates from java.net
[INFO] snapshot org.apache.cxf:cxf-xjc-ts:2.1-incubator-SNAPSHOT: checking for updates from java.net
[INFO] [jaxb:generate {execution: default}]
[INFO] Compiling file:/x1/continuum/working-directory/216/common/xjc/dv-test/src/test/resources/schemas/configuration/foo.xsd
[INFO] Writing output to /x1/continuum/working-directory/216/common/xjc/dv-test/target/generated/src/test/java
[INFO] [remote-resources:process {execution: default}]
[INFO] [resources:resources]
[INFO] Using default encoding to copy filtered resources.
[INFO] [compiler:compile]
[INFO] Compiling 4 source files to /x1/continuum/working-directory/216/common/xjc/dv-test/target/classes
[INFO] [resources:testResources]
[INFO] Using default encoding to copy filtered resources.
[INFO] [compiler:testCompile]
[INFO] Compiling 1 source file to /x1/continuum/working-directory/216/common/xjc/dv-test/target/test-classes
[INFO] [surefire:test]
[INFO] Surefire report directory: /x1/continuum/working-directory/216/common/xjc/dv-test/target/surefire-reports

-------------------------------------------------------
 T E S T S
-------------------------------------------------------
Running org.apache.cxf.xjc.dv.DefaultValueTest
Tests run: 1, Failures: 0, Errors: 0, Skipped: 0, Time elapsed: 0.233 sec

Results :

Tests run: 1, Failures: 0, Errors: 0, Skipped: 0

[INFO] [jar:jar]
[INFO] Building jar: /x1/continuum/working-directory/216/common/xjc/dv-test/target/cxf-xjc-dv-test-2.1-incubator-SNAPSHOT.jar
[INFO] [install:install]
[INFO] Installing /x1/continuum/working-directory/216/common/xjc/dv-test/target/cxf-xjc-dv-test-2.1-incubator-SNAPSHOT.jar to /home/continuum/.m2/repository/org/apache/cxf/cxf-xjc-dv-test/2.1-incubator-SNAPSHOT/cxf-xjc-dv-test-2.1-incubator-SNAPSHOT.jar
[INFO] ----------------------------------------------------------------------------
[INFO] Building Apache CXF XJC toString Plugin Tests
[INFO]    task-segment: [clean, install]
[INFO] ----------------------------------------------------------------------------
[INFO] [clean:clean]
[INFO] Deleting directory /x1/continuum/working-directory/216/common/xjc/ts-test/target
[INFO] Deleting directory /x1/continuum/working-directory/216/common/xjc/ts-test/target/classes
[INFO] Deleting directory /x1/continuum/working-directory/216/common/xjc/ts-test/target/test-classes
[INFO] Deleting directory /x1/continuum/working-directory/216/common/xjc/ts-test/target/site
[INFO] [checkstyle:checkstyle {execution: validate}]
[INFO] Starting audit...
Audit done.

[INFO] Preparing pmd:check
[INFO] [pmd:pmd]
[INFO] [pmd:check {execution: validate}]
[INFO] 
[INFO] [jaxb:generate {execution: default}]
[INFO] Compiling file:/x1/continuum/working-directory/216/common/xjc/ts-test/src/test/resources/schemas/configuration/foo.xsd
[INFO] Writing output to /x1/continuum/working-directory/216/common/xjc/ts-test/target/generated/src/test/java
[INFO] [remote-resources:process {execution: default}]
[INFO] [resources:resources]
[INFO] Using default encoding to copy filtered resources.
[INFO] [compiler:compile]
[INFO] Compiling 6 source files to /x1/continuum/working-directory/216/common/xjc/ts-test/target/classes
[INFO] [resources:testResources]
[INFO] Using default encoding to copy filtered resources.
[INFO] [compiler:testCompile]
[INFO] Compiling 1 source file to /x1/continuum/working-directory/216/common/xjc/ts-test/target/test-classes
[INFO] [surefire:test]
[INFO] Surefire report directory: /x1/continuum/working-directory/216/common/xjc/ts-test/target/surefire-reports

-------------------------------------------------------
 T E S T S
-------------------------------------------------------
Running org.apache.cxf.xjc.ts.ToStringTest
Tests run: 2, Failures: 0, Errors: 0, Skipped: 0, Time elapsed: 0.205 sec

Results :

Tests run: 2, Failures: 0, Errors: 0, Skipped: 0

[INFO] [jar:jar]
[INFO] Building jar: /x1/continuum/working-directory/216/common/xjc/ts-test/target/cxf-xjc-ts-test-2.1-incubator-SNAPSHOT.jar
[INFO] [install:install]
[INFO] Installing /x1/continuum/working-directory/216/common/xjc/ts-test/target/cxf-xjc-ts-test-2.1-incubator-SNAPSHOT.jar to /home/continuum/.m2/repository/org/apache/cxf/cxf-xjc-ts-test/2.1-incubator-SNAPSHOT/cxf-xjc-ts-test-2.1-incubator-SNAPSHOT.jar
[INFO] ----------------------------------------------------------------------------
[INFO] Building Apache CXF XJC Plugins
[INFO]    task-segment: [clean, install]
[INFO] ----------------------------------------------------------------------------
[INFO] [clean:clean]
[INFO] Deleting directory /x1/continuum/working-directory/216/common/xjc/target
[INFO] Deleting directory /x1/continuum/working-directory/216/common/xjc/target/classes
[INFO] Deleting directory /x1/continuum/working-directory/216/common/xjc/target/test-classes
[INFO] Deleting directory /x1/continuum/working-directory/216/common/xjc/target/site
[INFO] [checkstyle:checkstyle {execution: validate}]
[INFO] Source directory does not exist - skipping report.
[INFO] Preparing pmd:check
[INFO] [pmd:pmd]
[INFO] [pmd:check {execution: validate}]
[INFO] [remote-resources:process {execution: default}]
[INFO] [site:attach-descriptor]
[INFO] [install:install]
[INFO] Installing /x1/continuum/working-directory/216/common/xjc/pom.xml to /home/continuum/.m2/repository/org/apache/cxf/cxf-xjc/2.1-incubator-SNAPSHOT/cxf-xjc-2.1-incubator-SNAPSHOT.pom
[INFO] ----------------------------------------------------------------------------
[INFO] Building Apache CXF Common
[INFO]    task-segment: [clean, install]
[INFO] ----------------------------------------------------------------------------
[INFO] [clean:clean]
[INFO] Deleting directory /x1/continuum/working-directory/216/common/target
[INFO] Deleting directory /x1/continuum/working-directory/216/common/target/classes
[INFO] Deleting directory /x1/continuum/working-directory/216/common/target/test-classes
[INFO] Deleting directory /x1/continuum/working-directory/216/common/target/site
[INFO] [site:attach-descriptor]
[INFO] [install:install]
[INFO] Installing /x1/continuum/working-directory/216/common/pom.xml to /home/continuum/.m2/repository/org/apache/cxf/cxf-common/2.1-incubator-SNAPSHOT/cxf-common-2.1-incubator-SNAPSHOT.pom
[INFO] ----------------------------------------------------------------------------
[INFO] Building Apache CXF API
[INFO]    task-segment: [clean, install]
[INFO] ----------------------------------------------------------------------------
[INFO] [clean:clean]
[INFO] Deleting directory /x1/continuum/working-directory/216/api/target
[INFO] Deleting directory /x1/continuum/working-directory/216/api/target/classes
[INFO] Deleting directory /x1/continuum/working-directory/216/api/target/test-classes
[INFO] Deleting directory /x1/continuum/working-directory/216/api/target/site
[INFO] [checkstyle:checkstyle {execution: validate}]
[INFO] Starting audit...
Audit done.

[INFO] Preparing pmd:check
[INFO] [pmd:pmd]
[INFO] [pmd:check {execution: validate}]
[INFO] 
[INFO] [dependency:unpack {execution: unpack-schemas}]
[INFO] Configured Artifact: org.apache.cxf:cxf-common-schemas:2.1-incubator-SNAPSHOT:jar
[INFO] Expanding: /home/continuum/.m2/repository/org/apache/cxf/cxf-common-schemas/2.1-incubator-SNAPSHOT/cxf-common-schemas-2.1-incubator-SNAPSHOT.jar into /x1/continuum/working-directory/216/api/target/schemas
[INFO] [cxf-common-xsd:xsdtojava {execution: generate-sources}]
[INFO] [remote-resources:process {execution: default}]
[INFO] [resources:resources]
[INFO] Using default encoding to copy filtered resources.
[INFO] [compiler:compile]
[INFO] Compiling 226 source files to /x1/continuum/working-directory/216/api/target/classes
[INFO] [cxf-common-xsd:xsdtojava {execution: generate-test-sources}]
[INFO] [resources:testResources]
[INFO] Using default encoding to copy filtered resources.
[INFO] [compiler:testCompile]
[INFO] Compiling 28 source files to /x1/continuum/working-directory/216/api/target/test-classes
[INFO] [surefire:test]
[INFO] Surefire report directory: /x1/continuum/working-directory/216/api/target/surefire-reports

-------------------------------------------------------
 T E S T S
-------------------------------------------------------
Running org.apache.cxf.wsdl.JAXBExtensionHelperTest
Tests run: 2, Failures: 0, Errors: 0, Skipped: 0, Time elapsed: 2.163 sec
Running org.apache.cxf.service.model.BindingMessageInfoTest
Tests run: 1, Failures: 0, Errors: 0, Skipped: 0, Time elapsed: 0.018 sec
Running org.apache.cxf.ws.policy.IntersectorTest
Tests run: 3, Failures: 0, Errors: 0, Skipped: 0, Time elapsed: 0.108 sec
Running org.apache.cxf.ws.policy.builder.jaxb.JaxbAssertionTest
Tests run: 3, Failures: 0, Errors: 0, Skipped: 0, Time elapsed: 0.504 sec
Running org.apache.cxf.ws.policy.builder.jaxb.JaxbAssertionBuilderTest
Tests run: 3, Failures: 0, Errors: 0, Skipped: 0, Time elapsed: 0.152 sec
Running org.apache.cxf.service.model.OperationInfoTest
Tests run: 5, Failures: 0, Errors: 0, Skipped: 0, Time elapsed: 0.04 sec
Running org.apache.cxf.ws.policy.AssertionInfoMapTest
Tests run: 3, Failures: 0, Errors: 0, Skipped: 0, Time elapsed: 0.043 sec
Running org.apache.cxf.BusFactoryTest
Tests run: 1, Failures: 0, Errors: 0, Skipped: 0, Time elapsed: 0.02 sec
Running org.apache.cxf.service.model.FaultInfoTest
Tests run: 1, Failures: 0, Errors: 0, Skipped: 0, Time elapsed: 0.014 sec
Running org.apache.cxf.service.model.SchemaInfoTest
Tests run: 2, Failures: 0, Errors: 0, Skipped: 0, Time elapsed: 0.029 sec
Running org.apache.cxf.service.model.MessagePartInfoTest
Tests run: 3, Failures: 0, Errors: 0, Skipped: 0, Time elapsed: 0.028 sec
Running org.apache.cxf.ws.policy.builder.primitive.NestedPrimitiveAssertionTest
Tests run: 1, Failures: 0, Errors: 0, Skipped: 0, Time elapsed: 0.029 sec
Running org.apache.cxf.service.model.BindingFaultInfoTest
Tests run: 1, Failures: 0, Errors: 0, Skipped: 0, Time elapsed: 0.02 sec
Running org.apache.cxf.ws.policy.builder.primitive.NestedPrimitiveAssertionBuilderTest
Tests run: 5, Failures: 0, Errors: 0, Skipped: 0, Time elapsed: 0.234 sec
Running org.apache.cxf.service.model.InterfaceInfoTest
Tests run: 2, Failures: 0, Errors: 0, Skipped: 0, Time elapsed: 0.031 sec
Running org.apache.cxf.phase.PhaseInterceptorChainTest
Tests run: 16, Failures: 0, Errors: 0, Skipped: 0, Time elapsed: 0.269 sec
Running org.apache.cxf.service.model.BindingOperationInfoTest
Tests run: 6, Failures: 0, Errors: 0, Skipped: 0, Time elapsed: 0.037 sec
Running org.apache.cxf.service.model.MessageInfoTest
Tests run: 2, Failures: 0, Errors: 0, Skipped: 0, Time elapsed: 0.013 sec

Results :

Tests run: 60, Failures: 0, Errors: 0, Skipped: 0

[INFO] [jar:jar]
[INFO] Building jar: /x1/continuum/working-directory/216/api/target/cxf-api-2.1-incubator-SNAPSHOT.jar
[INFO] Preparing javadoc:jar
[WARNING] Removing: check from forked lifecycle, to prevent recursive invocation.
[WARNING] Removing: jar from forked lifecycle, to prevent recursive invocation.
[INFO] [checkstyle:checkstyle {execution: validate}]
[INFO] Starting audit...
Audit done.

[INFO] [dependency:unpack {execution: unpack-schemas}]
[INFO] Configured Artifact: org.apache.cxf:cxf-common-schemas:2.1-incubator-SNAPSHOT:jar
[INFO] cxf-common-schemas-2.1-incubator-SNAPSHOT.jar already unpacked.
[INFO] [cxf-common-xsd:xsdtojava {execution: generate-sources}]
[INFO] [javadoc:jar {execution: package}]
8 warnings
[INFO] Javadoc Warnings
[WARNING] javadoc: warning - Multiple sources of package comments found for package "org.apache.cxf.endpoint"
[WARNING] javadoc: warning - Multiple sources of package comments found for package "org.apache.cxf.transport"
[WARNING] javadoc: warning - Multiple sources of package comments found for package "org.apache.cxf.interceptor"
[WARNING] javadoc: warning - Multiple sources of package comments found for package "org.apache.cxf.service"
[WARNING] javadoc: warning - Multiple sources of package comments found for package "org.apache.cxf.phase"
[WARNING] javadoc: warning - Multiple sources of package comments found for package "org.apache.cxf.binding"
[WARNING] javadoc: warning - Multiple sources of package comments found for package "org.apache.cxf"
[WARNING] /x1/continuum/working-directory/216/api/src/main/java/org/apache/cxf/ws/policy/AssertionBuilderRegistry.java:51: warning - @return tag has no arguments.
[INFO] Building jar: /x1/continuum/working-directory/216/api/target/cxf-api-2.1-incubator-SNAPSHOT-javadoc.jar
[INFO] [install:install]
[INFO] Installing /x1/continuum/working-directory/216/api/target/cxf-api-2.1-incubator-SNAPSHOT.jar to /home/continuum/.m2/repository/org/apache/cxf/cxf-api/2.1-incubator-SNAPSHOT/cxf-api-2.1-incubator-SNAPSHOT.jar
[INFO] Installing /x1/continuum/working-directory/216/api/target/cxf-api-2.1-incubator-SNAPSHOT-javadoc.jar to /home/continuum/.m2/repository/org/apache/cxf/cxf-api/2.1-incubator-SNAPSHOT/cxf-api-2.1-incubator-SNAPSHOT-javadoc.jar
[INFO] ----------------------------------------------------------------------------
[INFO] Building Apache CXF Command Line Tools Common
[INFO]    task-segment: [clean, install]
[INFO] ----------------------------------------------------------------------------
[INFO] [clean:clean]
[INFO] Deleting directory /x1/continuum/working-directory/216/tools/common/target
[INFO] Deleting directory /x1/continuum/working-directory/216/tools/common/target/classes
[INFO] Deleting directory /x1/continuum/working-directory/216/tools/common/target/test-classes
[INFO] Deleting directory /x1/continuum/working-directory/216/tools/common/target/site
[INFO] [checkstyle:checkstyle {execution: validate}]
[INFO] Starting audit...
Audit done.

[INFO] Preparing pmd:check
[INFO] [pmd:pmd]
[INFO] [pmd:check {execution: validate}]
[INFO] 
[INFO] [remote-resources:process {execution: default}]
[INFO] [resources:resources]
[INFO] Using default encoding to copy filtered resources.
[INFO] [compiler:compile]
[INFO] Compiling 72 source files to /x1/continuum/working-directory/216/tools/common/target/classes
[INFO] [resources:testResources]
[INFO] Using default encoding to copy filtered resources.
[INFO] [compiler:testCompile]
[INFO] Compiling 20 source files to /x1/continuum/working-directory/216/tools/common/target/test-classes
[INFO] [surefire:test]
[INFO] Surefire report directory: /x1/continuum/working-directory/216/tools/common/target/surefire-reports

-------------------------------------------------------
 T E S T S
-------------------------------------------------------
Running org.apache.cxf.tools.common.ToolContextTest
Tests run: 1, Failures: 0, Errors: 0, Skipped: 0, Time elapsed: 0.057 sec
Running org.apache.cxf.tools.common.toolspec.parser.CommandLineParserTest
Tests run: 16, Failures: 0, Errors: 0, Skipped: 0, Time elapsed: 3.436 sec
Running org.apache.cxf.tools.common.ProcessorEnvironmentTest
Tests run: 7, Failures: 0, Errors: 0, Skipped: 0, Time elapsed: 0.062 sec
Running org.apache.cxf.tools.common.model.JavaClassTest
Tests run: 2, Failures: 0, Errors: 0, Skipped: 0, Time elapsed: 0.062 sec
Running org.apache.cxf.tools.common.toolspec.ToolSupportTest
Tests run: 1, Failures: 0, Errors: 0, Skipped: 0, Time elapsed: 0.013 sec
Running org.apache.cxf.tools.common.model.JavaParameterTest
Tests run: 1, Failures: 0, Errors: 0, Skipped: 0, Time elapsed: 0.012 sec
Running org.apache.cxf.tools.util.URIParserUtilTest
Tests run: 3, Failures: 0, Errors: 0, Skipped: 0, Time elapsed: 0.052 sec
Running org.apache.cxf.tools.common.model.JavaTypeTest
Tests run: 3, Failures: 0, Errors: 0, Skipped: 0, Time elapsed: 0.016 sec
Running org.apache.cxf.tools.common.toolspec.AbstractToolContainerTest
Tests run: 3, Failures: 0, Errors: 0, Skipped: 0, Time elapsed: 0.223 sec
Running org.apache.cxf.tools.common.dom.SchemaValidatingSAXParserTest
Tests run: 1, Failures: 0, Errors: 0, Skipped: 0, Time elapsed: 0.046 sec
Running org.apache.cxf.tools.common.dom.ExtendedDocumentBuilderTest
Tests run: 2, Failures: 0, Errors: 0, Skipped: 0, Time elapsed: 0.026 sec
Running org.apache.cxf.tools.common.WSDLVersionTest
Tests run: 1, Failures: 0, Errors: 0, Skipped: 0, Time elapsed: 0.023 sec
Running org.apache.cxf.tools.util.BuiltInTypesJavaMappingUtilTest
Tests run: 1, Failures: 0, Errors: 0, Skipped: 0, Time elapsed: 0.017 sec
Running org.apache.cxf.tools.util.NameUtilTest
Tests run: 3, Failures: 0, Errors: 0, Skipped: 0, Time elapsed: 0.021 sec
Running org.apache.cxf.tools.util.FileWriterUtilTest
Tests run: 2, Failures: 0, Errors: 0, Skipped: 0, Time elapsed: 0.037 sec
Running org.apache.cxf.tools.common.toolspec.ToolExceptionTest
Tests run: 1, Failures: 0, Errors: 0, Skipped: 0, Time elapsed: 0.011 sec
Running org.apache.cxf.tools.common.dom.DocumentTest
Tests run: 1, Failures: 0, Errors: 0, Skipped: 1, Time elapsed: 0.006 sec
Running org.apache.cxf.tools.common.model.JavaInterfaceTest
Tests run: 1, Failures: 0, Errors: 0, Skipped: 0, Time elapsed: 0.007 sec
Running org.apache.cxf.tools.common.toolspec.ToolSpecTest
Tests run: 8, Failures: 0, Errors: 0, Skipped: 0, Time elapsed: 0.161 sec

Results :

Tests run: 58, Failures: 0, Errors: 0, Skipped: 1

[INFO] [jar:jar]
[INFO] Building jar: /x1/continuum/working-directory/216/tools/common/target/cxf-tools-common-2.1-incubator-SNAPSHOT.jar
[INFO] [install:install]
[INFO] Installing /x1/continuum/working-directory/216/tools/common/target/cxf-tools-common-2.1-incubator-SNAPSHOT.jar to /home/continuum/.m2/repository/org/apache/cxf/cxf-tools-common/2.1-incubator-SNAPSHOT/cxf-tools-common-2.1-incubator-SNAPSHOT.jar
[INFO] ----------------------------------------------------------------------------
[INFO] Building Apache CXF Runtime Core
[INFO]    task-segment: [clean, install]
[INFO] ----------------------------------------------------------------------------
[INFO] [clean:clean]
[INFO] Deleting directory /x1/continuum/working-directory/216/rt/core/target
[INFO] Deleting directory /x1/continuum/working-directory/216/rt/core/target/classes
[INFO] Deleting directory /x1/continuum/working-directory/216/rt/core/target/test-classes
[INFO] Deleting directory /x1/continuum/working-directory/216/rt/core/target/site
[INFO] [checkstyle:checkstyle {execution: validate}]
[INFO] Starting audit...
Audit done.

[INFO] Preparing pmd:check
[INFO] [pmd:pmd]
[INFO] [pmd:check {execution: validate}]
[INFO] 
[INFO] [remote-resources:process {execution: default}]
[INFO] [resources:resources]
[INFO] Using default encoding to copy filtered resources.
[INFO] [compiler:compile]
[INFO] Compiling 143 source files to /x1/continuum/working-directory/216/rt/core/target/classes
[INFO] [resources:testResources]
[INFO] Using default encoding to copy filtered resources.
[INFO] [compiler:testCompile]
[INFO] Compiling 30 source files to /x1/continuum/working-directory/216/rt/core/target/test-classes
[INFO] [surefire:test]
[INFO] Surefire report directory: /x1/continuum/working-directory/216/rt/core/target/surefire-reports

-------------------------------------------------------
 T E S T S
-------------------------------------------------------
Running org.apache.cxf.interceptor.OutgoingChainInterceptorTest
Tests run: 1, Failures: 0, Errors: 0, Skipped: 0, Time elapsed: 1.236 sec
Running org.apache.cxf.test.XPathAssertTest
Tests run: 2, Failures: 0, Errors: 0, Skipped: 0, Time elapsed: 0.395 sec
Running org.apache.cxf.buslifecycle.CXFBusLifeCycleManagerTest
Tests run: 5, Failures: 0, Errors: 0, Skipped: 0, Time elapsed: 0.054 sec
Running org.apache.cxf.endpoint.EndpointResolverRegistryImplTest
Tests run: 6, Failures: 0, Errors: 0, Skipped: 0, Time elapsed: 0.118 sec
Running org.apache.cxf.bus.extension.ExtensionTest
Tests run: 3, Failures: 0, Errors: 0, Skipped: 0, Time elapsed: 0.17 sec
Running org.apache.cxf.attachment.AttachmentSerializerTest
Tests run: 2, Failures: 0, Errors: 0, Skipped: 0, Time elapsed: 0.307 sec
Running org.apache.cxf.wsdl11.WSDLManagerImplTest
Tests run: 2, Failures: 0, Errors: 0, Skipped: 0, Time elapsed: 0.573 sec
Running org.apache.cxf.configuration.spring.ConfigurerImplTest
Tests run: 4, Failures: 0, Errors: 0, Skipped: 0, Time elapsed: 1.924 sec
Running org.apache.cxf.transport.CachedOutputStreamTest
Tests run: 1, Failures: 0, Errors: 0, Skipped: 0, Time elapsed: 0.111 sec
Running org.apache.cxf.workqueue.AutomaticWorkQueueTest
Tests run: 10, Failures: 0, Errors: 0, Skipped: 0, Time elapsed: 11.282 sec
Running org.apache.cxf.bus.CXFBusImplTest
Tests run: 7, Failures: 0, Errors: 0, Skipped: 0, Time elapsed: 0.994 sec
Running org.apache.cxf.endpoint.ServerRegistryImpTest
Tests run: 1, Failures: 0, Errors: 0, Skipped: 0, Time elapsed: 0.01 sec
Running org.apache.cxf.bus.spring.SpringBusFactoryTest
Tests run: 7, Failures: 0, Errors: 0, Skipped: 0, Time elapsed: 1.779 sec
Running org.apache.cxf.interceptor.ServiceInvokerInterceptorTest
Tests run: 1, Failures: 0, Errors: 0, Skipped: 0, Time elapsed: 0.022 sec
Running org.apache.cxf.wsdl11.WSDLDefinitionBuilderTest
Tests run: 2, Failures: 0, Errors: 0, Skipped: 0, Time elapsed: 0.079 sec
Running org.apache.cxf.bus.spring.BusApplicationContextTest
Tests run: 1, Failures: 0, Errors: 0, Skipped: 0, Time elapsed: 0.442 sec
Running org.apache.cxf.bus.extension.ExtensionFragmentParserTest
Tests run: 1, Failures: 0, Errors: 0, Skipped: 0, Time elapsed: 0.013 sec
Running org.apache.cxf.transport.HttpUriMapperTest
Tests run: 2, Failures: 0, Errors: 0, Skipped: 0, Time elapsed: 0.012 sec
Running org.apache.cxf.bus.extension.ExtensionManagerTest
Tests run: 2, Failures: 0, Errors: 0, Skipped: 0, Time elapsed: 0.023 sec
Running org.apache.cxf.wsdl11.ServiceWSDLBuilderTest
Tests run: 8, Failures: 0, Errors: 0, Skipped: 0, Time elapsed: 0.73 sec
Running org.apache.cxf.bus.spring.BusDefinitionParserTest
Tests run: 1, Failures: 0, Errors: 0, Skipped: 0, Time elapsed: 0.269 sec
Running org.apache.cxf.attachment.AttachmentDeserializerTest
Tests run: 4, Failures: 0, Errors: 0, Skipped: 0, Time elapsed: 0.038 sec
Running org.apache.cxf.wsdl11.WSDLServiceBuilderTest
Tests run: 14, Failures: 0, Errors: 0, Skipped: 0, Time elapsed: 0.98 sec

Results :

Tests run: 87, Failures: 0, Errors: 0, Skipped: 0

[INFO] [jar:jar]
[INFO] Building jar: /x1/continuum/working-directory/216/rt/core/target/cxf-rt-core-2.1-incubator-SNAPSHOT.jar
[INFO] [install:install]
[INFO] Installing /x1/continuum/working-directory/216/rt/core/target/cxf-rt-core-2.1-incubator-SNAPSHOT.jar to /home/continuum/.m2/repository/org/apache/cxf/cxf-rt-core/2.1-incubator-SNAPSHOT/cxf-rt-core-2.1-incubator-SNAPSHOT.jar
[INFO] ----------------------------------------------------------------------------
[INFO] Building Apache CXF Command Line Tools Validator
[INFO]    task-segment: [clean, install]
[INFO] ----------------------------------------------------------------------------
[INFO] [clean:clean]
[INFO] Deleting directory /x1/continuum/working-directory/216/tools/validator/target
[INFO] Deleting directory /x1/continuum/working-directory/216/tools/validator/target/classes
[INFO] Deleting directory /x1/continuum/working-directory/216/tools/validator/target/test-classes
[INFO] Deleting directory /x1/continuum/working-directory/216/tools/validator/target/site
[INFO] [checkstyle:checkstyle {execution: validate}]
[INFO] Starting audit...
Audit done.

[INFO] Preparing pmd:check
[INFO] [pmd:pmd]
[INFO] [pmd:check {execution: validate}]
[INFO] 
[INFO] [remote-resources:process {execution: default}]
[INFO] [resources:resources]
[INFO] Using default encoding to copy filtered resources.
[INFO] [compiler:compile]
[INFO] Compiling 24 source files to /x1/continuum/working-directory/216/tools/validator/target/classes
[INFO] [resources:testResources]
[INFO] Using default encoding to copy filtered resources.
[INFO] [compiler:testCompile]
[INFO] Compiling 5 source files to /x1/continuum/working-directory/216/tools/validator/target/test-classes
[INFO] [surefire:test]
[INFO] Surefire report directory: /x1/continuum/working-directory/216/tools/validator/target/surefire-reports

-------------------------------------------------------
 T E S T S
-------------------------------------------------------
Running org.apache.cxf.tools.validator.WSDLValidationTest
Tests run: 12, Failures: 0, Errors: 0, Skipped: 0, Time elapsed: 7.191 sec
Running org.apache.cxf.tools.validator.internal.WSDLRefValidatorTest
Tests run: 7, Failures: 0, Errors: 0, Skipped: 0, Time elapsed: 0.625 sec
Running org.apache.cxf.tools.validator.internal.WSDL11ValidatorTest
Tests run: 1, Failures: 0, Errors: 0, Skipped: 0, Time elapsed: 0.183 sec
Running org.apache.cxf.tools.validator.internal.Stax2DOMTest
Tests run: 1, Failures: 0, Errors: 0, Skipped: 0, Time elapsed: 0.066 sec
Running org.apache.cxf.tools.validator.internal.model.XNodeTest
Tests run: 3, Failures: 0, Errors: 0, Skipped: 0, Time elapsed: 0.02 sec

Results :

Tests run: 24, Failures: 0, Errors: 0, Skipped: 0

[INFO] [jar:jar]
[INFO] Building jar: /x1/continuum/working-directory/216/tools/validator/target/cxf-tools-validator-2.1-incubator-SNAPSHOT.jar
[INFO] [install:install]
[INFO] Installing /x1/continuum/working-directory/216/tools/validator/target/cxf-tools-validator-2.1-incubator-SNAPSHOT.jar to /home/continuum/.m2/repository/org/apache/cxf/cxf-tools-validator/2.1-incubator-SNAPSHOT/cxf-tools-validator-2.1-incubator-SNAPSHOT.jar
[INFO] ----------------------------------------------------------------------------
[INFO] Building Apache CXF Command Line Tools WSDLTo Core
[INFO]    task-segment: [clean, install]
[INFO] ----------------------------------------------------------------------------
[INFO] [clean:clean]
[INFO] Deleting directory /x1/continuum/working-directory/216/tools/wsdlto/core/target
[INFO] Deleting directory /x1/continuum/working-directory/216/tools/wsdlto/core/target/classes
[INFO] Deleting directory /x1/continuum/working-directory/216/tools/wsdlto/core/target/test-classes
[INFO] Deleting directory /x1/continuum/working-directory/216/tools/wsdlto/core/target/site
[INFO] [checkstyle:checkstyle {execution: validate}]
[INFO] Starting audit...
Audit done.

[INFO] Preparing pmd:check
[INFO] [pmd:pmd]
[INFO] [pmd:check {execution: validate}]
[INFO] 
[INFO] [cxf-common-xsd:xsdtojava {execution: generate-sources}]
[INFO] [remote-resources:process {execution: default}]
[INFO] [resources:resources]
[INFO] Using default encoding to copy filtered resources.
[INFO] [compiler:compile]
[INFO] Compiling 20 source files to /x1/continuum/working-directory/216/tools/wsdlto/core/target/classes
[INFO] [resources:testResources]
[INFO] Using default encoding to copy filtered resources.
[INFO] [compiler:testCompile]
[INFO] Compiling 1 source file to /x1/continuum/working-directory/216/tools/wsdlto/core/target/test-classes
[INFO] [surefire:test]
[INFO] Surefire report directory: /x1/continuum/working-directory/216/tools/wsdlto/core/target/surefire-reports

-------------------------------------------------------
 T E S T S
-------------------------------------------------------
Running org.apache.cxf.tools.wsdlto.WSDLToJavaContainerTest
Tests run: 1, Failures: 0, Errors: 0, Skipped: 0, Time elapsed: 0.161 sec

Results :

Tests run: 1, Failures: 0, Errors: 0, Skipped: 0

[INFO] [jar:jar]
[INFO] Building jar: /x1/continuum/working-directory/216/tools/wsdlto/core/target/cxf-tools-wsdlto-core-2.1-incubator-SNAPSHOT.jar
[INFO] [install:install]
[INFO] Installing /x1/continuum/working-directory/216/tools/wsdlto/core/target/cxf-tools-wsdlto-core-2.1-incubator-SNAPSHOT.jar to /home/continuum/.m2/repository/org/apache/cxf/cxf-tools-wsdlto-core/2.1-incubator-SNAPSHOT/cxf-tools-wsdlto-core-2.1-incubator-SNAPSHOT.jar
[INFO] ----------------------------------------------------------------------------
[INFO] Building Apache CXF Command Line Tools WSDLTo JAXWS Frontend
[INFO]    task-segment: [clean, install]
[INFO] ----------------------------------------------------------------------------
[INFO] [clean:clean]
[INFO] Deleting directory /x1/continuum/working-directory/216/tools/wsdlto/frontend/jaxws/target
[INFO] Deleting directory /x1/continuum/working-directory/216/tools/wsdlto/frontend/jaxws/target/classes
[INFO] Deleting directory /x1/continuum/working-directory/216/tools/wsdlto/frontend/jaxws/target/test-classes
[INFO] Deleting directory /x1/continuum/working-directory/216/tools/wsdlto/frontend/jaxws/target/site
[INFO] [checkstyle:checkstyle {execution: validate}]
[INFO] Starting audit...
Audit done.

[INFO] Preparing pmd:check
[INFO] [pmd:pmd]
[INFO] [pmd:check {execution: validate}]
[INFO] 
[INFO] [remote-resources:process {execution: default}]
[INFO] [resources:resources]
[INFO] Using default encoding to copy filtered resources.
[INFO] [compiler:compile]
[INFO] Compiling 38 source files to /x1/continuum/working-directory/216/tools/wsdlto/frontend/jaxws/target/classes
[INFO] [resources:testResources]
[INFO] Using default encoding to copy filtered resources.
[INFO] [compiler:testCompile]
[INFO] Compiling 12 source files to /x1/continuum/working-directory/216/tools/wsdlto/frontend/jaxws/target/test-classes
[INFO] [surefire:test]
[INFO] Surefire report directory: /x1/continuum/working-directory/216/tools/wsdlto/frontend/jaxws/target/surefire-reports

-------------------------------------------------------
 T E S T S
-------------------------------------------------------
Running org.apache.cxf.tools.wsdlto.frontend.jaxws.processor.internal.PortTypeProcessorTest
Tests run: 1, Failures: 0, Errors: 0, Skipped: 0, Time elapsed: 0.066 sec
Running org.apache.cxf.tools.wsdlto.frontend.jaxws.processor.internal.ProcessorUtilTest
Tests run: 1, Failures: 0, Errors: 0, Skipped: 0, Time elapsed: 0.031 sec
Running org.apache.cxf.tools.wsdlto.frontend.jaxws.processor.internal.mapper.MethodMapperTest
Tests run: 3, Failures: 0, Errors: 0, Skipped: 0, Time elapsed: 0.09 sec
Running org.apache.cxf.tools.wsdlto.frontend.jaxws.processor.internal.annotator.WebParamAnnotatorTest
Tests run: 3, Failures: 0, Errors: 0, Skipped: 0, Time elapsed: 0.037 sec
Running org.apache.cxf.tools.wsdlto.frontend.jaxws.processor.internal.ParameterProcessorTest
Tests run: 1, Failures: 0, Errors: 0, Skipped: 0, Time elapsed: 0.035 sec
Running org.apache.cxf.tools.wsdlto.frontend.jaxws.customization.CustomizationParserTest
Tests run: 6, Failures: 0, Errors: 0, Skipped: 0, Time elapsed: 1.115 sec
Running org.apache.cxf.tools.wsdlto.frontend.jaxws.processor.internal.annotator.WebMethodAnnotatorTest
Tests run: 2, Failures: 0, Errors: 0, Skipped: 0, Time elapsed: 0.031 sec
Running org.apache.cxf.tools.wsdlto.frontend.jaxws.processor.internal.mapper.InterfaceMapperTest
Tests run: 2, Failures: 0, Errors: 0, Skipped: 0, Time elapsed: 0.025 sec
Running org.apache.cxf.tools.wsdlto.frontend.jaxws.JAXWSProfileTest
Tests run: 1, Failures: 0, Errors: 0, Skipped: 0, Time elapsed: 2.088 sec
Running org.apache.cxf.tools.wsdlto.frontend.jaxws.CatalogTest
Tests run: 1, Failures: 0, Errors: 0, Skipped: 0, Time elapsed: 0.106 sec
Running org.apache.cxf.tools.wsdlto.frontend.jaxws.wsdl11.JAXWSDefinitionBuilderTest
Tests run: 3, Failures: 0, Errors: 0, Skipped: 0, Time elapsed: 0.862 sec

Results :

Tests run: 24, Failures: 0, Errors: 0, Skipped: 0

[INFO] [jar:jar]
[INFO] Building jar: /x1/continuum/working-directory/216/tools/wsdlto/frontend/jaxws/target/cxf-tools-wsdlto-frontend-jaxws-2.1-incubator-SNAPSHOT.jar
[INFO] [install:install]
[INFO] Installing /x1/continuum/working-directory/216/tools/wsdlto/frontend/jaxws/target/cxf-tools-wsdlto-frontend-jaxws-2.1-incubator-SNAPSHOT.jar to /home/continuum/.m2/repository/org/apache/cxf/cxf-tools-wsdlto-frontend-jaxws/2.1-incubator-SNAPSHOT/cxf-tools-wsdlto-frontend-jaxws-2.1-incubator-SNAPSHOT.jar
[INFO] ----------------------------------------------------------------------------
[INFO] Building Apache CXF Command Line Tools WSDLTo JAXB Databinding
[INFO]    task-segment: [clean, install]
[INFO] ----------------------------------------------------------------------------
[INFO] [clean:clean]
[INFO] Deleting directory /x1/continuum/working-directory/216/tools/wsdlto/databinding/jaxb/target
[INFO] Deleting directory /x1/continuum/working-directory/216/tools/wsdlto/databinding/jaxb/target/classes
[INFO] Deleting directory /x1/continuum/working-directory/216/tools/wsdlto/databinding/jaxb/target/test-classes
[INFO] Deleting directory /x1/continuum/working-directory/216/tools/wsdlto/databinding/jaxb/target/site
[INFO] [checkstyle:checkstyle {execution: validate}]
[INFO] Starting audit...
Audit done.

[INFO] Preparing pmd:check
[INFO] [pmd:pmd]
[INFO] [pmd:check {execution: validate}]
[INFO] 
[INFO] [remote-resources:process {execution: default}]
[INFO] [resources:resources]
[INFO] Using default encoding to copy filtered resources.
[INFO] [compiler:compile]
[INFO] Compiling 5 source files to /x1/continuum/working-directory/216/tools/wsdlto/databinding/jaxb/target/classes
[INFO] [resources:testResources]
[INFO] Using default encoding to copy filtered resources.
[INFO] [compiler:testCompile]
[INFO] Nothing to compile - all classes are up to date
[INFO] [surefire:test]
[INFO] Surefire report directory: /x1/continuum/working-directory/216/tools/wsdlto/databinding/jaxb/target/surefire-reports

-------------------------------------------------------
 T E S T S
-------------------------------------------------------
There are no tests to run.

Results :

Tests run: 0, Failures: 0, Errors: 0, Skipped: 0

[INFO] [jar:jar]
[INFO] Building jar: /x1/continuum/working-directory/216/tools/wsdlto/databinding/jaxb/target/cxf-tools-wsdlto-databinding-jaxb-2.1-incubator-SNAPSHOT.jar
[INFO] [install:install]
[INFO] Installing /x1/continuum/working-directory/216/tools/wsdlto/databinding/jaxb/target/cxf-tools-wsdlto-databinding-jaxb-2.1-incubator-SNAPSHOT.jar to /home/continuum/.m2/repository/org/apache/cxf/cxf-tools-wsdlto-databinding-jaxb/2.1-incubator-SNAPSHOT/cxf-tools-wsdlto-databinding-jaxb-2.1-incubator-SNAPSHOT.jar
[INFO] ----------------------------------------------------------------------------
[INFO] Building Apache CXF Command Line Tools JavaTo Core
[INFO]    task-segment: [clean, install]
[INFO] ----------------------------------------------------------------------------
[INFO] [clean:clean]
[INFO] Deleting directory /x1/continuum/working-directory/216/tools/javato/core/target
[INFO] Deleting directory /x1/continuum/working-directory/216/tools/javato/core/target/classes
[INFO] Deleting directory /x1/continuum/working-directory/216/tools/javato/core/target/test-classes
[INFO] Deleting directory /x1/continuum/working-directory/216/tools/javato/core/target/site
[INFO] [checkstyle:checkstyle {execution: validate}]
[INFO] Starting audit...
Audit done.

[INFO] Preparing pmd:check
[INFO] [pmd:pmd]
[INFO] [pmd:check {execution: validate}]
[INFO] 
[INFO] [remote-resources:process {execution: default}]
[INFO] [resources:resources]
[INFO] Using default encoding to copy filtered resources.
[INFO] [compiler:compile]
[INFO] Compiling 20 source files to /x1/continuum/working-directory/216/tools/javato/core/target/classes
[INFO] [resources:testResources]
[INFO] Using default encoding to copy filtered resources.
[INFO] [compiler:testCompile]
[INFO] No sources to compile
[INFO] [surefire:test]
[INFO] Surefire report directory: /x1/continuum/working-directory/216/tools/javato/core/target/surefire-reports

-------------------------------------------------------
 T E S T S
-------------------------------------------------------
There are no tests to run.

Results :

Tests run: 0, Failures: 0, Errors: 0, Skipped: 0

[INFO] [jar:jar]
[INFO] Building jar: /x1/continuum/working-directory/216/tools/javato/core/target/cxf-tools-java2wsdl-2.1-incubator-SNAPSHOT.jar
[INFO] [install:install]
[INFO] Installing /x1/continuum/working-directory/216/tools/javato/core/target/cxf-tools-java2wsdl-2.1-incubator-SNAPSHOT.jar to /home/continuum/.m2/repository/org/apache/cxf/cxf-tools-java2wsdl/2.1-incubator-SNAPSHOT/cxf-tools-java2wsdl-2.1-incubator-SNAPSHOT.jar
[INFO] ----------------------------------------------------------------------------
[INFO] Building Apache CXF Code Generation Maven2 Plugins
[INFO]    task-segment: [clean, install]
[INFO] ----------------------------------------------------------------------------
[INFO] [clean:clean]
[INFO] Deleting directory /x1/continuum/working-directory/216/maven-plugins/codegen-plugin/target
[INFO] Deleting directory /x1/continuum/working-directory/216/maven-plugins/codegen-plugin/target/classes
[INFO] Deleting directory /x1/continuum/working-directory/216/maven-plugins/codegen-plugin/target/test-classes
[INFO] Deleting directory /x1/continuum/working-directory/216/maven-plugins/codegen-plugin/target/site
[INFO] [checkstyle:checkstyle {execution: validate}]
[INFO] Starting audit...
Audit done.

[INFO] Preparing pmd:check
[INFO] [pmd:pmd]
[INFO] [pmd:check {execution: validate}]
[INFO] 
[INFO] [plugin:descriptor]
[INFO] Using 2 extractors.
[INFO] Applying extractor for language: java
[INFO] Extractor for language: java found 2 mojo descriptors.
[INFO] Applying extractor for language: bsh
[INFO] Extractor for language: bsh found 0 mojo descriptors.
[INFO] [remote-resources:process {execution: default}]
[INFO] [resources:resources]
[INFO] Using default encoding to copy filtered resources.
[INFO] [compiler:compile]
[INFO] Compiling 4 source files to /x1/continuum/working-directory/216/maven-plugins/codegen-plugin/target/classes
[INFO] [resources:testResources]
[INFO] Using default encoding to copy filtered resources.
[INFO] [compiler:testCompile]
[INFO] Nothing to compile - all classes are up to date
[INFO] [surefire:test]
[INFO] Surefire report directory: /x1/continuum/working-directory/216/maven-plugins/codegen-plugin/target/surefire-reports

-------------------------------------------------------
 T E S T S
-------------------------------------------------------
There are no tests to run.

Results :

Tests run: 0, Failures: 0, Errors: 0, Skipped: 0

[INFO] [jar:jar]
[INFO] Building jar: /x1/continuum/working-directory/216/maven-plugins/codegen-plugin/target/cxf-codegen-plugin-2.1-incubator-SNAPSHOT.jar
[INFO] [plugin:addPluginArtifactMetadata]
[INFO] [install:install]
[INFO] Installing /x1/continuum/working-directory/216/maven-plugins/codegen-plugin/target/cxf-codegen-plugin-2.1-incubator-SNAPSHOT.jar to /home/continuum/.m2/repository/org/apache/cxf/cxf-codegen-plugin/2.1-incubator-SNAPSHOT/cxf-codegen-plugin-2.1-incubator-SNAPSHOT.jar
[INFO] [plugin:updateRegistry]
[INFO] ----------------------------------------------------------------------------
[INFO] Building Apache CXF Test Utilities
[INFO]    task-segment: [clean, install]
[INFO] ----------------------------------------------------------------------------
[INFO] [clean:clean]
[INFO] Deleting directory /x1/continuum/working-directory/216/testutils/target
[INFO] Deleting directory /x1/continuum/working-directory/216/testutils/target/classes
[INFO] Deleting directory /x1/continuum/working-directory/216/testutils/target/test-classes
[INFO] Deleting directory /x1/continuum/working-directory/216/testutils/target/site
[INFO] [checkstyle:checkstyle {execution: validate}]
[INFO] Starting audit...
Audit done.

[INFO] Preparing pmd:check
[INFO] [pmd:pmd]
[INFO] [pmd:check {execution: validate}]
[INFO] 
[INFO] [antrun:run {execution: validate}]
[INFO] Executing tasks
    [mkdir] Created dir: /x1/continuum/working-directory/216/testutils/target/generated/src/main/resources/wsdl/type_test
     [xslt] Processing /x1/continuum/working-directory/216/testutils/src/main/resources/wsdl/type_test/type_test.xsd to /x1/continuum/working-directory/216/testutils/target/generated/src/main/resources/wsdl/type_test/type_test_1.xsd
     [xslt] Loading stylesheet /x1/continuum/working-directory/216/testutils/src/main/resources/wsdl/type_test/type_test_ID_xsd.xsl
     [xslt] Processing /x1/continuum/working-directory/216/testutils/src/main/resources/wsdl/type_test/type_test.xsd to /x1/continuum/working-directory/216/testutils/target/generated/src/main/resources/wsdl/type_test/type_test_2.xsd
     [xslt] Loading stylesheet /x1/continuum/working-directory/216/testutils/src/main/resources/wsdl/type_test/type_test_ID_xsd.xsl
     [xslt] Processing /x1/continuum/working-directory/216/testutils/src/main/resources/wsdl/type_test/type_test.xsd to /x1/continuum/working-directory/216/testutils/target/generated/src/main/resources/wsdl/type_test/type_test_3.xsd
     [xslt] Loading stylesheet /x1/continuum/working-directory/216/testutils/src/main/resources/wsdl/type_test/type_test_ID_xsd.xsl
     [xslt] Processing /x1/continuum/working-directory/216/testutils/src/main/resources/wsdl/type_test/type_test.xsd to /x1/continuum/working-directory/216/testutils/target/generated/src/main/resources/wsdl/type_test/type_test_doclit.wsdl
     [xslt] Loading stylesheet /x1/continuum/working-directory/216/testutils/src/main/resources/wsdl/type_test/type_test_wsdl.xsl
     [xslt] Processing /x1/continuum/working-directory/216/testutils/src/main/resources/wsdl/type_test/type_test.xsd to /x1/continuum/working-directory/216/testutils/target/generated/src/main/resources/wsdl/type_test/type_test_rpclit.wsdl
     [xslt] Loading stylesheet /x1/continuum/working-directory/216/testutils/src/main/resources/wsdl/type_test/type_test_wsdl.xsl
     [xslt] Processing /x1/continuum/working-directory/216/testutils/src/main/resources/wsdl/type_test/type_test.xsd to /x1/continuum/working-directory/216/testutils/target/generated/src/main/resources/wsdl/type_test/type_test_xml_inc.wsdl
     [xslt] Loading stylesheet /x1/continuum/working-directory/216/testutils/src/main/resources/wsdl/type_test/type_test_wsdl.xsl
     [xslt] Processing /x1/continuum/working-directory/216/testutils/src/main/resources/wsdl/type_test/type_test.xsd to /x1/continuum/working-directory/216/testutils/target/generated/src/main/resources/wsdl/type_test/type_test_xml.wsdl
     [xslt] Loading stylesheet /x1/continuum/working-directory/216/testutils/src/main/resources/wsdl/type_test/type_test_xml_wsdl.xsl
     [xslt] Processing /x1/continuum/working-directory/216/testutils/src/main/resources/wsdl/type_test/type_test.xsd to /x1/continuum/working-directory/216/testutils/target/generated/src/main/resources/wsdl/type_test/type_test_doclit_soap.wsdl
     [xslt] Loading stylesheet /x1/continuum/working-directory/216/testutils/src/main/resources/wsdl/type_test/type_test_soap_wsdl.xsl
     [xslt] Processing /x1/continuum/working-directory/216/testutils/src/main/resources/wsdl/type_test/type_test.xsd to /x1/continuum/working-directory/216/testutils/target/generated/src/main/resources/wsdl/type_test/type_test_rpclit_soap.wsdl
     [xslt] Loading stylesheet /x1/continuum/working-directory/216/testutils/src/main/resources/wsdl/type_test/type_test_soap_wsdl.xsl
    [mkdir] Created dir: /x1/continuum/working-directory/216/testutils/target/generated/src/main/java/org/apache/cxf/systest/type_test
     [xslt] Processing /x1/continuum/working-directory/216/testutils/src/main/resources/wsdl/type_test/type_test.xsd to /x1/continuum/working-directory/216/testutils/target/generated/src/main/java/org/apache/cxf/systest/type_test/TypeTestImpl.java
     [xslt] Loading stylesheet /x1/continuum/working-directory/216/testutils/src/main/resources/wsdl/type_test/type_test_impl_java.xsl
     [xslt] Processing /x1/continuum/working-directory/216/testutils/src/main/resources/wsdl/type_test/type_test.xsd to /x1/continuum/working-directory/216/testutils/target/generated/src/main/java/org/apache/cxf/systest/type_test/TypeTestTester.java
     [xslt] Loading stylesheet /x1/continuum/working-directory/216/testutils/src/main/resources/wsdl/type_test/type_test_tester_java.xsl
[INFO] Executed tasks
[INFO] Registering compile source root /x1/continuum/working-directory/216/testutils/target/generated/src/main/java
[INFO] [cxf-codegen:wsdl2java {execution: generate-sources}]
Aug 1, 2007 12:07:02 AM org.apache.cxf.tools.wsdlto.core.PluginLoader loadPlugin
INFO: Loading plugin jar:file:/x1/continuum/working-directory/216/tools/wsdlto/frontend/jaxws/target/cxf-tools-wsdlto-frontend-jaxws-2.1-incubator-SNAPSHOT.jar!/META-INF/tools-plugin.xml
Aug 1, 2007 12:07:02 AM org.apache.cxf.tools.wsdlto.core.PluginLoader loadPlugin
INFO: Found 1 frontends in <jaxws> plugin.
Aug 1, 2007 12:07:02 AM org.apache.cxf.tools.wsdlto.core.PluginLoader loadPlugin
INFO: Loading <jaxws> frontend from <jaxws> plugin.
Aug 1, 2007 12:07:02 AM org.apache.cxf.tools.wsdlto.core.PluginLoader loadPlugin
INFO: Loading plugin jar:file:/x1/continuum/working-directory/216/tools/wsdlto/databinding/jaxb/target/cxf-tools-wsdlto-databinding-jaxb-2.1-incubator-SNAPSHOT.jar!/META-INF/tools-plugin.xml
Aug 1, 2007 12:07:02 AM org.apache.cxf.tools.wsdlto.core.PluginLoader loadPlugin
INFO: Found 1 databindings in <jaxb> plugin.
Aug 1, 2007 12:07:02 AM org.apache.cxf.tools.wsdlto.core.PluginLoader loadPlugin
INFO: Loading <jaxb> databinding from <jaxb> plugin.
Aug 1, 2007 12:07:03 AM org.springframework.context.support.AbstractApplicationContext refresh
INFO: Refreshing org.apache.cxf.bus.spring.BusApplicationContext@efeeca: display name [org.apache.cxf.bus.spring.BusApplicationContext@efeeca]; startup date [Wed Aug 01 00:07:03 PDT 2007]; root of context hierarchy
Aug 1, 2007 12:07:03 AM org.springframework.beans.factory.xml.XmlBeanDefinitionReader loadBeanDefinitions
INFO: Loading XML bean definitions from class path resource [META-INF/cxf/cxf.xml]
Aug 1, 2007 12:07:03 AM org.springframework.context.support.AbstractApplicationContext refresh
INFO: Bean factory for application context [org.apache.cxf.bus.spring.BusApplicationContext@efeeca]: org.springframework.beans.factory.support.DefaultListableBeanFactory@8eadf4
Aug 1, 2007 12:07:04 AM org.springframework.context.support.AbstractApplicationContext$BeanPostProcessorChecker postProcessAfterInitialization
INFO: Bean 'org.apache.cxf.bus.spring.Jsr250BeanPostProcessor' is not eligible for getting processed by all BeanPostProcessors (for example: not eligible for auto-proxying)
Aug 1, 2007 12:07:04 AM org.springframework.context.support.AbstractApplicationContext$BeanPostProcessorChecker postProcessAfterInitialization
INFO: Bean 'cxf' is not eligible for getting processed by all BeanPostProcessors (for example: not eligible for auto-proxying)
Aug 1, 2007 12:07:04 AM org.springframework.context.support.AbstractApplicationContext$BeanPostProcessorChecker postProcessAfterInitialization
INFO: Bean 'org.apache.cxf.bus.spring.BusExtensionPostProcessor' is not eligible for getting processed by all BeanPostProcessors (for example: not eligible for auto-proxying)
Aug 1, 2007 12:07:04 AM org.springframework.beans.factory.support.DefaultListableBeanFactory preInstantiateSingletons
INFO: Pre-instantiating singletons in org.springframework.beans.factory.support.DefaultListableBeanFactory@8eadf4: defining beans [cxf,org.apache.cxf.bus.spring.Jsr250BeanPostProcessor,org.apache.cxf.bus.spring.BusExtensionPostProcessor,org.apache.cxf.resource.ResourceManager,org.apache.cxf.binding.BindingFactoryManager,org.apache.cxf.transport.DestinationFactoryManager,org.apache.cxf.transport.ConduitInitiatorManager,org.apache.cxf.wsdl.WSDLManager,org.apache.cxf.phase.PhaseManager,org.apache.cxf.workqueue.WorkQueueManager,org.apache.cxf.buslifecycle.BusLifeCycleManager,org.apache.cxf.endpoint.ServerRegistry,org.apache.cxf.endpoint.ServerLifeCycleManager,org.apache.cxf.endpoint.ClientLifeCycleManager,org.apache.cxf.transports.http.QueryHandlerRegistry,org.apache.cxf.endpoint.EndpointResolverRegistry,org.apache.cxf.headers.HeaderManager,org.apache.cxf.catalog.OASISCatalogManager]; root of factory hierarchy
[INFO] ------------------------------------------------------------------------
[ERROR] BUILD ERROR
[INFO] ------------------------------------------------------------------------
[INFO] Java heap space

[INFO] ------------------------------------------------------------------------
[INFO] For more information, run Maven with the -e switch
[INFO] ------------------------------------------------------------------------
[INFO] Total time: 6 minutes 32 seconds
[INFO] Finished at: Wed Aug 01 00:07:47 PDT 2007
[INFO] Final Memory: 60M/63M
[INFO] ------------------------------------------------------------------------

****************************************************************************



Mime
View raw message