cxf-notifications mailing list archives

Site index · List index
Message view « Date » · « Thread »
Top « Date » · « Thread »
From Apache Hudson Server <hud...@hudson.zones.apache.org>
Subject Build failed in Hudson: CXF-2.0.x-JDK15 » Apache CXF Runtime Aegis Databinding #58
Date Wed, 10 Jun 2009 14:50:17 GMT
See http://hudson.zones.apache.org/hudson/job/CXF-2.0.x-JDK15/org.apache.cxf$cxf-rt-databinding-aegis/58/

------------------------------------------
[INFO] ------------------------------------------------------------------------
[INFO] Building Apache CXF Runtime Aegis Databinding
[INFO]    task-segment: [clean, install]
[INFO] ------------------------------------------------------------------------
[INFO] [clean:clean]
[INFO] Deleting directory http://hudson.zones.apache.org/hudson/job/CXF-2.0.x-JDK15/org.apache.cxf$cxf-rt-databinding-aegis/ws/target

[INFO] [checkstyle:checkstyle {execution: validate}]
[WARNING] File encoding has not been set, using platform encoding UTF-8, i.e. build is platform
dependent!
[INFO] Starting audit...
Audit done.

[INFO] Preparing pmd:check
[HUDSON] Archiving http://hudson.zones.apache.org/hudson/job/CXF-2.0.x-JDK15/org.apache.cxf$cxf-rt-databinding-aegis/ws/pom.xml
 to /export/home/hudson/hudson/jobs/CXF-2.0.x-JDK15/modules/org.apache.cxf$cxf-rt-databinding-aegis/builds/2009-06-10_14-39-13/archive/org.apache.cxf/cxf-rt-databinding-aegis/2.0.12-SNAPSHOT/pom.xml
[INFO] [pmd:pmd]
[HUDSON] Archiving http://hudson.zones.apache.org/hudson/job/CXF-2.0.x-JDK15/org.apache.cxf$cxf-rt-databinding-aegis/ws/pom.xml
 to /export/home/hudson/hudson/jobs/CXF-2.0.x-JDK15/modules/org.apache.cxf$cxf-rt-databinding-aegis/builds/2009-06-10_14-39-13/archive/org.apache.cxf/cxf-rt-databinding-aegis/2.0.12-SNAPSHOT/pom.xml
[INFO] [pmd:check {execution: validate}]
[INFO] 
[INFO] [build-helper:add-source {execution: add-source}]
[INFO] Source directory: http://hudson.zones.apache.org/hudson/job/CXF-2.0.x-JDK15/org.apache.cxf$cxf-rt-databinding-aegis/ws/src/main/generated
 added.
[INFO] [remote-resources:process {execution: default}]
[INFO] [resources:resources]
[INFO] Using default encoding to copy filtered resources.
[INFO] [compiler:compile]
[INFO] Compiling 94 source files to http://hudson.zones.apache.org/hudson/job/CXF-2.0.x-JDK15/org.apache.cxf$cxf-rt-databinding-aegis/ws/target/classes

[HUDSON] Archiving http://hudson.zones.apache.org/hudson/job/CXF-2.0.x-JDK15/org.apache.cxf$cxf-rt-databinding-aegis/ws/pom.xml
 to /export/home/hudson/hudson/jobs/CXF-2.0.x-JDK15/modules/org.apache.cxf$cxf-rt-databinding-aegis/builds/2009-06-10_14-39-13/archive/org.apache.cxf/cxf-rt-databinding-aegis/2.0.12-SNAPSHOT/pom.xml
[INFO] ------------------------------------------------------------------------
[ERROR] BUILD FAILURE
[INFO] ------------------------------------------------------------------------
[INFO] Compilation failure

http://hudson.zones.apache.org/hudson/job/CXF-2.0.x-JDK15/org.apache.cxf$cxf-rt-databinding-aegis/ws/src/main/java/org/apache/cxf/aegis/type/mtom/DataHandlerType.java
:[60,36] cannot find symbol
symbol  : variable HttpHeaderHelper
location: class org.apache.cxf.aegis.type.mtom.DataHandlerType

http://hudson.zones.apache.org/hudson/job/CXF-2.0.x-JDK15/org.apache.cxf$cxf-rt-databinding-aegis/ws/src/main/java/org/apache/cxf/aegis/type/mtom/DataHandlerType.java
:[64,17] cannot find symbol
symbol  : class UnsupportedEncodingException
location: class org.apache.cxf.aegis.type.mtom.DataHandlerType

http://hudson.zones.apache.org/hudson/job/CXF-2.0.x-JDK15/org.apache.cxf$cxf-rt-databinding-aegis/ws/src/main/java/org/apache/cxf/aegis/type/mtom/DataHandlerType.java
:[72,8] cannot find symbol
symbol  : class ByteArrayOutputStream
location: class org.apache.cxf.aegis.type.mtom.DataHandlerType

http://hudson.zones.apache.org/hudson/job/CXF-2.0.x-JDK15/org.apache.cxf$cxf-rt-databinding-aegis/ws/src/main/java/org/apache/cxf/aegis/type/mtom/DataHandlerType.java
:[72,41] cannot find symbol
symbol  : class ByteArrayOutputStream
location: class org.apache.cxf.aegis.type.mtom.DataHandlerType

http://hudson.zones.apache.org/hudson/job/CXF-2.0.x-JDK15/org.apache.cxf$cxf-rt-databinding-aegis/ws/src/main/java/org/apache/cxf/aegis/type/mtom/DataHandlerType.java
:[74,12] cannot find symbol
symbol  : class InputStream
location: class org.apache.cxf.aegis.type.mtom.DataHandlerType

http://hudson.zones.apache.org/hudson/job/CXF-2.0.x-JDK15/org.apache.cxf$cxf-rt-databinding-aegis/ws/src/main/java/org/apache/cxf/aegis/type/mtom/DataHandlerType.java
:[75,12] cannot find symbol
symbol  : variable IOUtils
location: class org.apache.cxf.aegis.type.mtom.DataHandlerType

http://hudson.zones.apache.org/hudson/job/CXF-2.0.x-JDK15/org.apache.cxf$cxf-rt-databinding-aegis/ws/src/main/java/org/apache/cxf/aegis/type/mtom/DataHandlerType.java
:[76,17] cannot find symbol
symbol  : class IOException
location: class org.apache.cxf.aegis.type.mtom.DataHandlerType


[INFO] ------------------------------------------------------------------------
[INFO] Trace
org.apache.maven.BuildFailureException: Compilation failure
	at org.apache.maven.lifecycle.DefaultLifecycleExecutor.executeGoals(DefaultLifecycleExecutor.java:579)
	at org.apache.maven.lifecycle.DefaultLifecycleExecutor.executeGoalWithLifecycle(DefaultLifecycleExecutor.java:499)
	at org.apache.maven.lifecycle.DefaultLifecycleExecutor.executeGoal(DefaultLifecycleExecutor.java:478)
	at org.apache.maven.lifecycle.DefaultLifecycleExecutor.executeGoalAndHandleFailures(DefaultLifecycleExecutor.java:330)
	at org.apache.maven.lifecycle.DefaultLifecycleExecutor.executeTaskSegments(DefaultLifecycleExecutor.java:291)
	at org.apache.maven.lifecycle.DefaultLifecycleExecutor.execute(DefaultLifecycleExecutor.java:142)
	at org.apache.maven.lifecycle.LifecycleExecutorInterceptor.execute(LifecycleExecutorInterceptor.java:65)
	at org.apache.maven.DefaultMaven.doExecute(DefaultMaven.java:336)
	at org.apache.maven.DefaultMaven.execute(DefaultMaven.java:129)
	at org.apache.maven.cli.MavenCli.main(MavenCli.java:287)
	at sun.reflect.NativeMethodAccessorImpl.invoke0(Native Method)
	at sun.reflect.NativeMethodAccessorImpl.invoke(NativeMethodAccessorImpl.java:39)
	at sun.reflect.DelegatingMethodAccessorImpl.invoke(DelegatingMethodAccessorImpl.java:25)
	at java.lang.reflect.Method.invoke(Method.java:585)
	at org.codehaus.classworlds.Launcher.launchEnhanced(Launcher.java:315)
	at org.codehaus.classworlds.Launcher.launch(Launcher.java:255)
	at hudson.maven.agent.Main.launch(Main.java:158)
	at hudson.maven.MavenBuilder.call(MavenBuilder.java:162)
	at hudson.maven.MavenModuleSetBuild$Builder.call(MavenModuleSetBuild.java:579)
	at hudson.maven.MavenModuleSetBuild$Builder.call(MavenModuleSetBuild.java:525)
	at hudson.remoting.UserRequest.perform(UserRequest.java:69)
	at hudson.remoting.UserRequest.perform(UserRequest.java:23)
	at hudson.remoting.Request$2.run(Request.java:213)
	at java.util.concurrent.Executors$RunnableAdapter.call(Executors.java:417)
	at java.util.concurrent.FutureTask$Sync.innerRun(FutureTask.java:269)
	at java.util.concurrent.FutureTask.run(FutureTask.java:123)
	at java.util.concurrent.ThreadPoolExecutor$Worker.runTask(ThreadPoolExecutor.java:650)
	at java.util.concurrent.ThreadPoolExecutor$Worker.run(ThreadPoolExecutor.java:675)
	at java.lang.Thread.run(Thread.java:595)
Caused by: org.apache.maven.plugin.CompilationFailureException: Compilation failure
	at org.apache.maven.plugin.AbstractCompilerMojo.execute(AbstractCompilerMojo.java:516)
	at org.apache.maven.plugin.CompilerMojo.execute(CompilerMojo.java:114)
	at org.apache.maven.plugin.DefaultPluginManager.executeMojo(DefaultPluginManager.java:451)
	at hudson.maven.agent.PluginManagerInterceptor.executeMojo(PluginManagerInterceptor.java:182)
	at org.apache.maven.lifecycle.DefaultLifecycleExecutor.executeGoals(DefaultLifecycleExecutor.java:558)
	... 28 more
[INFO] ------------------------------------------------------------------------
[INFO] Total time: 10 minutes 47 seconds
[INFO] Finished at: Wed Jun 10 08:14:10 PDT 2009
[INFO] Final Memory: 80M/160M
[INFO] ------------------------------------------------------------------------


Mime
View raw message