cxf-notifications mailing list archives

Site index · List index
Message view « Date » · « Thread »
Top « Date » · « Thread »
From Apache Hudson Server <hud...@hudson.zones.apache.org>
Subject Build failed in Hudson: CXF-2.2.x-JDK15 » Apache CXF Uncategorized System Tests #122
Date Tue, 01 Sep 2009 21:04:06 GMT
See http://hudson.zones.apache.org/hudson/job/CXF-2.2.x-JDK15/org.apache.cxf$cxf-systests-uncategorized/122/

------------------------------------------
[INFO] ------------------------------------------------------------------------
[INFO] Building Apache CXF Uncategorized System Tests
[INFO]    task-segment: [clean, install]
[INFO] ------------------------------------------------------------------------
[INFO] [clean:clean {execution: default-clean}]
[INFO] [checkstyle:checkstyle {execution: validate}]
[INFO] Starting audit...
http://hudson.zones.apache.org/hudson/job/CXF-2.2.x-JDK15/org.apache.cxf$cxf-systests-uncategorized/ws/src/test/java/org/apache/cxf/systest/jaxws/ClientServerMiscTest.java
:52:8: Unused import - org.apache.cxf.common.WSDLConstants.
Audit done.

[HUDSON] Archiving http://hudson.zones.apache.org/hudson/job/CXF-2.2.x-JDK15/org.apache.cxf$cxf-systests-uncategorized/ws/pom.xml
 to /export/home/hudson/hudson/jobs/CXF-2.2.x-JDK15/modules/org.apache.cxf$cxf-systests-uncategorized/builds/2009-09-01_20-42-14/archive/org.apache.cxf/cxf-systests-uncategorized/2.2.4-SNAPSHOT/pom.xml
[INFO] ------------------------------------------------------------------------
[ERROR] BUILD ERROR
[INFO] ------------------------------------------------------------------------
[INFO] An error has occurred in Checkstyle report generation.

Embedded error: There are 1 checkstyle errors.
[INFO] ------------------------------------------------------------------------
[INFO] Trace
org.apache.maven.lifecycle.LifecycleExecutionException: An error has occurred in Checkstyle
report generation.
	at org.apache.maven.lifecycle.DefaultLifecycleExecutor.executeGoals(DefaultLifecycleExecutor.java:719)
	at org.apache.maven.lifecycle.DefaultLifecycleExecutor.executeGoalWithLifecycle(DefaultLifecycleExecutor.java:556)
	at org.apache.maven.lifecycle.DefaultLifecycleExecutor.executeGoal(DefaultLifecycleExecutor.java:535)
	at org.apache.maven.lifecycle.DefaultLifecycleExecutor.executeGoalAndHandleFailures(DefaultLifecycleExecutor.java:387)
	at org.apache.maven.lifecycle.DefaultLifecycleExecutor.executeTaskSegments(DefaultLifecycleExecutor.java:348)
	at org.apache.maven.lifecycle.DefaultLifecycleExecutor.execute(DefaultLifecycleExecutor.java:180)
	at org.apache.maven.lifecycle.LifecycleExecutorInterceptor.execute(LifecycleExecutorInterceptor.java:65)
	at org.apache.maven.DefaultMaven.doExecute(DefaultMaven.java:328)
	at org.apache.maven.DefaultMaven.execute(DefaultMaven.java:138)
	at org.apache.maven.cli.MavenCli.main(MavenCli.java:362)
	at sun.reflect.NativeMethodAccessorImpl.invoke0(Native Method)
	at sun.reflect.NativeMethodAccessorImpl.invoke(NativeMethodAccessorImpl.java:39)
	at sun.reflect.DelegatingMethodAccessorImpl.invoke(DelegatingMethodAccessorImpl.java:25)
	at java.lang.reflect.Method.invoke(Method.java:585)
	at org.codehaus.classworlds.Launcher.launchEnhanced(Launcher.java:315)
	at org.codehaus.classworlds.Launcher.launch(Launcher.java:255)
	at hudson.maven.agent.Main.launch(Main.java:158)
	at hudson.maven.MavenBuilder.call(MavenBuilder.java:162)
	at hudson.maven.MavenModuleSetBuild$Builder.call(MavenModuleSetBuild.java:579)
	at hudson.maven.MavenModuleSetBuild$Builder.call(MavenModuleSetBuild.java:525)
	at hudson.remoting.UserRequest.perform(UserRequest.java:69)
	at hudson.remoting.UserRequest.perform(UserRequest.java:23)
	at hudson.remoting.Request$2.run(Request.java:213)
	at java.util.concurrent.Executors$RunnableAdapter.call(Executors.java:417)
	at java.util.concurrent.FutureTask$Sync.innerRun(FutureTask.java:269)
	at java.util.concurrent.FutureTask.run(FutureTask.java:123)
	at java.util.concurrent.ThreadPoolExecutor$Worker.runTask(ThreadPoolExecutor.java:650)
	at java.util.concurrent.ThreadPoolExecutor$Worker.run(ThreadPoolExecutor.java:675)
	at java.lang.Thread.run(Thread.java:595)
Caused by: org.apache.maven.plugin.MojoExecutionException: An error has occurred in Checkstyle
report generation.
	at org.apache.maven.reporting.AbstractMavenReport.execute(AbstractMavenReport.java:79)
	at org.apache.maven.plugin.DefaultPluginManager.executeMojo(DefaultPluginManager.java:490)
	at hudson.maven.agent.PluginManagerInterceptor.executeMojo(PluginManagerInterceptor.java:182)
	at org.apache.maven.lifecycle.DefaultLifecycleExecutor.executeGoals(DefaultLifecycleExecutor.java:694)
	... 28 more
Caused by: org.apache.maven.reporting.MavenReportException: There are 1 checkstyle errors.
	at org.apache.maven.plugin.checkstyle.CheckstyleReport.executeCheckstyle(CheckstyleReport.java:955)
	at org.apache.maven.plugin.checkstyle.CheckstyleReport.executeReport(CheckstyleReport.java:635)
	at org.apache.maven.reporting.AbstractMavenReport.generate(AbstractMavenReport.java:98)
	at org.apache.maven.reporting.AbstractMavenReport.execute(AbstractMavenReport.java:73)
	... 31 more
[INFO] ------------------------------------------------------------------------
[INFO] Total time: 21 minutes 43 seconds
[INFO] Finished at: Tue Sep 01 21:04:03 UTC 2009
[INFO] Final Memory: 111M/180M
[INFO] ------------------------------------------------------------------------


Mime
View raw message