cxf-notifications mailing list archives

Site index · List index
Message view « Date » · « Thread »
Top « Date » · « Thread »
From Apache Hudson Server <hud...@hudson.zones.apache.org>
Subject Build failed in Hudson: CXF-2.1.x-JDK15 #253
Date Fri, 16 Oct 2009 17:12:29 GMT
See <http://hudson.zones.apache.org/hudson/job/CXF-2.1.x-JDK15/253/changes>

Changes:

[dkulp] Merged revisions 826002 via svnmerge from 
https://svn.apache.org/repos/asf/cxf/branches/2.2.x-fixes

................
  r826002 | dkulp | 2009-10-16 13:01:30 -0400 (Fri, 16 Oct 2009) | 11 lines
  
  Merged revisions 826001 via svnmerge from 
  https://svn.apache.org/repos/asf/cxf/trunk
  
  ........
    r826001 | dkulp | 2009-10-16 12:55:13 -0400 (Fri, 16 Oct 2009) | 3 lines
    
    [CXF-2339] Add jaxb-xjc to deps for dynamic_client pom.
    Update JAXBUtils to hunt for the tools.jar to create the SchemaCompiler
    things to help in the case where xjc isn't found
  ........
................

[dkulp] Merged revisions 825735 via svnmerge from 
https://svn.apache.org/repos/asf/cxf/branches/2.2.x-fixes

................
  r825735 | dkulp | 2009-10-15 21:39:57 -0400 (Thu, 15 Oct 2009) | 9 lines
  
  Merged revisions 825716 via svnmerge from 
  https://svn.apache.org/repos/asf/cxf/trunk
  
  ........
    r825716 | dkulp | 2009-10-15 20:36:26 -0400 (Thu, 15 Oct 2009) | 1 line
    
    Remove some unused namespaces
  ........
................

------------------------------------------
[...truncated 34 lines...]
[INFO]   Apache CXF Command Line Tools WSDLTo Core
[INFO]   Apache CXF Command Line Tools WSDLTo JAXWS Frontend
[INFO]   Apache CXF WSDL Validator Maven2 Plugin
[INFO]   Apache CXF Command Line Tools WSDLTo JAXB Databinding
[INFO]   Apache CXF Code Generation Maven2 Plugins
[INFO]   Apache CXF Test Utilities
[INFO]   Apache CXF Runtime JAXB DataBinding
[INFO]   Apache CXF Runtime XML Binding
[INFO]   Apache CXF Runtime SOAP Binding
[INFO]   Apache CXF Runtime Local Transport
[INFO]   Apache CXF Runtime Simple Frontend
[INFO]   Apache CXF Runtime HTTP Transport
[INFO]   Apache CXF Runtime HTTP Jetty Transport
[INFO]   Apache CXF Runtime WS Addressing
[INFO]   Apache CXF Runtime JAX-WS Frontend
[INFO]   Apache CXF Test Case Support
[INFO]   Apache CXF Runtime Aegis Databinding
[INFO]   Apache CXF Runtime JavaScript Client Generator
[INFO]   Apache CXF Command Line Tools WSDL to JavaScript Front End
[INFO]   Apache CXF Runtime Management
[INFO]   Apache CXF Runtime JMS Transport
[INFO]   Apache CXF Runtime XmlBeans DataBinding
[INFO]   Apache CXF Command Line Tools WSDLTo Test
[INFO]   Apache CXF Command Line Tools WSDLTo Misctools
[INFO]   Apache CXF Command Line Tools
[INFO]   Apache CXF Command Line Tools WSDLTo
[INFO]   Apache CXF Command Line Tools JavaTo WS
[INFO]   Apache CXF Command Line Tools JavaTo
[INFO]   Apache CXF Runtime CORBA Binding
[INFO]   Apache CXF Command Line Tools CORBA
[INFO]   Apache CXF Ant Tasks
[INFO]   Apache CXF Runtime HTTP Binding
[INFO]   Apache CXF Runtime Object Binding
[INFO]   Apache CXF Runtime Colocated Binding
[INFO]   Apache CXF Runtime JBI Binding
[INFO]   Apache CXF Runtime
[INFO]   Apache CXF Runtime Bindings
[INFO]   Apache CXF Runtime JAX-RS Frontend
[INFO]   Apache CXF Runtime JavaScript Frontend
[INFO]   Apache CXF Runtime JBI Transport
[INFO]   Apache CXF Runtime WS Policy
[INFO]   Apache CXF Runtime WS Reliable Messaging
[INFO]   Apache CXF Runtime WS Security
[INFO]   Apache CXF JBI Integration
[INFO]   Apache CXF JCA Connection
[INFO]   Apache CXF Integration
[INFO]   Apache CXF Java2WS Maven2 Plugin
[INFO]   Apache CXF CORBA Tools Maven2 Plugins
[INFO]   Apache CXF Archetype - Simple JAX-WS Java First
[INFO]   Apache CXF Maven Archetypes
[INFO]   Apache CXF Eclipse Plugin Generator Maven2 Plugin
[INFO]   Apache CXF Maven Plugins
[INFO]   Apache CXF Uncategorized System Tests
[INFO]   Apache CXF Transport System Tests
[INFO]   Apache CXF JAX-WS System Tests
[INFO]   Apache CXF Databinding System Tests
[INFO]   Apache CXF JAX-RS System Tests
[INFO]   Apache CXF WS-* Specifications System Tests
[INFO]   Apache CXF System Tests
[INFO] ------------------------------------------------------------------------
[INFO] Building Apache CXF
[INFO]    task-segment: [clean, install]
[INFO] ------------------------------------------------------------------------
[INFO] [clean:clean]
[INFO] [site:attach-descriptor]
[INFO] [install:install]
[INFO] Installing <http://hudson.zones.apache.org/hudson/job/CXF-2.1.x-JDK15/ws/cxf-2.1.x-fixes/pom.xml>
to <http://hudson.zones.apache.org/hudson/job/CXF-2.1.x-JDK15/ws/.repository/org/apache/cxf/cxf/2.1.8-SNAPSHOT/cxf-2.1.8-SNAPSHOT.pom>
[HUDSON] Archiving <http://hudson.zones.apache.org/hudson/job/CXF-2.1.x-JDK15/ws/cxf-2.1.x-fixes/pom.xml>
to /export/home/hudson/hudson/jobs/CXF-2.1.x-JDK15/modules/org.apache.cxf$cxf/builds/2009-10-16_17-11-09/archive/org.apache.cxf/cxf/2.1.8-SNAPSHOT/pom.xml
[INFO] ------------------------------------------------------------------------
[INFO] Building Apache CXF Buildtools
[INFO]    task-segment: [clean, install]
[INFO] ------------------------------------------------------------------------
[INFO] [clean:clean]
[INFO] Deleting directory <http://hudson.zones.apache.org/hudson/job/CXF-2.1.x-JDK15/ws/cxf-2.1.x-fixes/buildtools/target>
[INFO] [resources:resources]
[INFO] Using 'UTF-8' encoding to copy filtered resources.
[INFO] Copying 11 resources
[INFO] [compiler:compile]
[INFO] Compiling 3 source files to <http://hudson.zones.apache.org/hudson/job/CXF-2.1.x-JDK15/ws/cxf-2.1.x-fixes/buildtools/target/classes>
[INFO] [resources:testResources]
[INFO] Using 'UTF-8' encoding to copy filtered resources.
[INFO] skip non existing resourceDirectory <http://hudson.zones.apache.org/hudson/job/CXF-2.1.x-JDK15/ws/cxf-2.1.x-fixes/buildtools/src/test/resources>
[INFO] [compiler:testCompile]
[INFO] Not compiling test sources
[INFO] [surefire:test]
[INFO] Tests are skipped.
[INFO] [jar:jar]
[INFO] Building jar: <http://hudson.zones.apache.org/hudson/job/CXF-2.1.x-JDK15/ws/cxf-2.1.x-fixes/buildtools/target/cxf-buildtools-2.1.8-SNAPSHOT.jar>
[INFO] [install:install]
[INFO] Installing <http://hudson.zones.apache.org/hudson/job/CXF-2.1.x-JDK15/ws/cxf-2.1.x-fixes/buildtools/target/cxf-buildtools-2.1.8-SNAPSHOT.jar>
to <http://hudson.zones.apache.org/hudson/job/CXF-2.1.x-JDK15/ws/.repository/org/apache/cxf/cxf-buildtools/2.1.8-SNAPSHOT/cxf-buildtools-2.1.8-SNAPSHOT.jar>
[HUDSON] Archiving <http://hudson.zones.apache.org/hudson/job/CXF-2.1.x-JDK15/ws/cxf-2.1.x-fixes/buildtools/pom.xml>
to /export/home/hudson/hudson/jobs/CXF-2.1.x-JDK15/modules/org.apache.cxf$cxf-buildtools/builds/2009-10-16_17-11-09/archive/org.apache.cxf/cxf-buildtools/2.1.8-SNAPSHOT/pom.xml
[HUDSON] Archiving <http://hudson.zones.apache.org/hudson/job/CXF-2.1.x-JDK15/ws/cxf-2.1.x-fixes/buildtools/target/cxf-buildtools-2.1.8-SNAPSHOT.jar>
to /export/home/hudson/hudson/jobs/CXF-2.1.x-JDK15/modules/org.apache.cxf$cxf-buildtools/builds/2009-10-16_17-11-09/archive/org.apache.cxf/cxf-buildtools/2.1.8-SNAPSHOT/cxf-buildtools-2.1.8-SNAPSHOT.jar
[INFO] ------------------------------------------------------------------------
[INFO] Building Apache CXF XML to FastInfoset Maven2 Plugin
[INFO]    task-segment: [clean, install]
[INFO] ------------------------------------------------------------------------
[INFO] [clean:clean]
[INFO] Deleting directory <http://hudson.zones.apache.org/hudson/job/CXF-2.1.x-JDK15/ws/cxf-2.1.x-fixes/maven-plugins/xml2fastinfoset-plugin/target>
[INFO] [plugin:descriptor]
[WARNING] Using platform encoding (UTF-8 actually) to read mojo metadata, i.e. build is platform
dependent!
[INFO] Applying mojo extractor for language: java
[INFO] Mojo extractor for language: java found 1 mojo descriptors.
[INFO] Applying mojo extractor for language: bsh
[INFO] Mojo extractor for language: bsh found 0 mojo descriptors.
[INFO] [resources:resources]
[INFO] Using 'UTF-8' encoding to copy filtered resources.
[INFO] skip non existing resourceDirectory <http://hudson.zones.apache.org/hudson/job/CXF-2.1.x-JDK15/ws/cxf-2.1.x-fixes/maven-plugins/xml2fastinfoset-plugin/src/main/resources>
[INFO] [compiler:compile]
[INFO] Compiling 1 source file to <http://hudson.zones.apache.org/hudson/job/CXF-2.1.x-JDK15/ws/cxf-2.1.x-fixes/maven-plugins/xml2fastinfoset-plugin/target/classes>
[INFO] [resources:testResources]
[INFO] Using 'UTF-8' encoding to copy filtered resources.
[INFO] skip non existing resourceDirectory <http://hudson.zones.apache.org/hudson/job/CXF-2.1.x-JDK15/ws/cxf-2.1.x-fixes/maven-plugins/xml2fastinfoset-plugin/src/test/resources>
[INFO] [compiler:testCompile]
[INFO] No sources to compile
[INFO] [surefire:test]
[INFO] No tests to run.
[HUDSON] Recording test results
[INFO] [jar:jar]
[INFO] Building jar: <http://hudson.zones.apache.org/hudson/job/CXF-2.1.x-JDK15/ws/cxf-2.1.x-fixes/maven-plugins/xml2fastinfoset-plugin/target/cxf-xml2fastinfoset-plugin-2.1.8-SNAPSHOT.jar>
[INFO] [plugin:addPluginArtifactMetadata]
[INFO] [install:install]
[INFO] Installing <http://hudson.zones.apache.org/hudson/job/CXF-2.1.x-JDK15/ws/cxf-2.1.x-fixes/maven-plugins/xml2fastinfoset-plugin/target/cxf-xml2fastinfoset-plugin-2.1.8-SNAPSHOT.jar>
to <http://hudson.zones.apache.org/hudson/job/CXF-2.1.x-JDK15/ws/.repository/org/apache/cxf/cxf-xml2fastinfoset-plugin/2.1.8-SNAPSHOT/cxf-xml2fastinfoset-plugin-2.1.8-SNAPSHOT.jar>
[INFO] [plugin:updateRegistry]
[HUDSON] Archiving <http://hudson.zones.apache.org/hudson/job/CXF-2.1.x-JDK15/ws/cxf-2.1.x-fixes/maven-plugins/xml2fastinfoset-plugin/pom.xml>
to /export/home/hudson/hudson/jobs/CXF-2.1.x-JDK15/modules/org.apache.cxf$cxf-xml2fastinfoset-plugin/builds/2009-10-16_17-11-09/archive/org.apache.cxf/cxf-xml2fastinfoset-plugin/2.1.8-SNAPSHOT/pom.xml
[HUDSON] Archiving <http://hudson.zones.apache.org/hudson/job/CXF-2.1.x-JDK15/ws/cxf-2.1.x-fixes/maven-plugins/xml2fastinfoset-plugin/target/cxf-xml2fastinfoset-plugin-2.1.8-SNAPSHOT.jar>
to /export/home/hudson/hudson/jobs/CXF-2.1.x-JDK15/modules/org.apache.cxf$cxf-xml2fastinfoset-plugin/builds/2009-10-16_17-11-09/archive/org.apache.cxf/cxf-xml2fastinfoset-plugin/2.1.8-SNAPSHOT/cxf-xml2fastinfoset-plugin-2.1.8-SNAPSHOT.jar
[INFO] ------------------------------------------------------------------------
[INFO] Building Apache CXF Parent
[INFO]    task-segment: [clean, install]
[INFO] ------------------------------------------------------------------------
[INFO] [clean:clean]
[INFO] Deleting directory <http://hudson.zones.apache.org/hudson/job/CXF-2.1.x-JDK15/ws/cxf-2.1.x-fixes/parent/target>
[INFO] snapshot org.apache.cxf:cxf-buildtools:2.1.8-SNAPSHOT: checking for updates from apache.snapshots
[INFO] [checkstyle:checkstyle {execution: validate}]
[INFO] Source directory does not exist - skipping report.
[INFO] Preparing pmd:check
[HUDSON] Archiving <http://hudson.zones.apache.org/hudson/job/CXF-2.1.x-JDK15/ws/cxf-2.1.x-fixes/parent/pom.xml>
to /export/home/hudson/hudson/jobs/CXF-2.1.x-JDK15/modules/org.apache.cxf$cxf-parent/builds/2009-10-16_17-11-09/archive/org.apache.cxf/cxf-parent/2.1.8-SNAPSHOT/pom.xml
[INFO] [pmd:pmd]
[INFO] [pmd:check {execution: validate}]
[INFO] [cxf-xml2fastinfoset:xml2fastinfoset {execution: xml2fastinfoset}]
[INFO] Setting property: classpath.resource.loader.class => 'org.codehaus.plexus.velocity.ContextClassLoaderResourceLoader'.
[INFO] Setting property: velocimacro.messages.on => 'false'.
[INFO] Setting property: resource.loader => 'classpath'.
[INFO] Setting property: resource.manager.logwhenfound => 'false'.
[INFO] [remote-resources:process {execution: default}]
[INFO] [site:attach-descriptor]
[INFO] [install:install]
[INFO] Installing <http://hudson.zones.apache.org/hudson/job/CXF-2.1.x-JDK15/ws/cxf-2.1.x-fixes/parent/pom.xml>
to <http://hudson.zones.apache.org/hudson/job/CXF-2.1.x-JDK15/ws/.repository/org/apache/cxf/cxf-parent/2.1.8-SNAPSHOT/cxf-parent-2.1.8-SNAPSHOT.pom>
[INFO] ------------------------------------------------------------------------
[INFO] Building Apache CXF Common Utilities
[INFO]    task-segment: [clean, install]
[INFO] ------------------------------------------------------------------------
[INFO] [clean:clean]
[INFO] Deleting directory <http://hudson.zones.apache.org/hudson/job/CXF-2.1.x-JDK15/ws/cxf-2.1.x-fixes/common/common/target>
[INFO] [checkstyle:checkstyle {execution: validate}]
[INFO] Starting audit...
Audit done.

[INFO] Setting property: classpath.resource.loader.class => 'org.codehaus.plexus.velocity.ContextClassLoaderResourceLoader'.
[INFO] Setting property: velocimacro.messages.on => 'false'.
[INFO] Setting property: resource.loader => 'classpath'.
[INFO] Setting property: resource.manager.logwhenfound => 'false'.
[INFO] Preparing pmd:check
[HUDSON] Archiving <http://hudson.zones.apache.org/hudson/job/CXF-2.1.x-JDK15/ws/cxf-2.1.x-fixes/common/common/pom.xml>
to /export/home/hudson/hudson/jobs/CXF-2.1.x-JDK15/modules/org.apache.cxf$cxf-common-utilities/builds/2009-10-16_17-11-09/archive/org.apache.cxf/cxf-common-utilities/2.1.8-SNAPSHOT/pom.xml
[INFO] [pmd:pmd]
[INFO] [pmd:check {execution: validate}]
[INFO] 
[INFO] [cxf-xml2fastinfoset:xml2fastinfoset {execution: xml2fastinfoset}]
[INFO] [remote-resources:process {execution: default}]
[INFO] [resources:resources]
[INFO] Using 'UTF-8' encoding to copy filtered resources.
[INFO] Copying 8 resources
[INFO] Copying 2 resources
[INFO] Copying 1 resource
[INFO] skip non existing resourceDirectory <http://hudson.zones.apache.org/hudson/job/CXF-2.1.x-JDK15/ws/cxf-2.1.x-fixes/common/common/target/generated/src/main/resources>
[INFO] Copying 3 resources
[INFO] [compiler:compile]
[INFO] Compiling 127 source files to <http://hudson.zones.apache.org/hudson/job/CXF-2.1.x-JDK15/ws/cxf-2.1.x-fixes/common/common/target/classes>
[INFO] ------------------------------------------------------------------------
[ERROR] BUILD FAILURE
[INFO] ------------------------------------------------------------------------
[INFO] Compilation failure
<http://hudson.zones.apache.org/hudson/job/CXF-2.1.x-JDK15/ws/cxf-2.1.x-fixes/common/common/src/main/java/org/apache/cxf/jaxb/JAXBUtils.java>:[508,21]
cannot find symbol
symbol  : variable StringUtils
location: class org.apache.cxf.jaxb.JAXBUtils



<http://hudson.zones.apache.org/hudson/job/CXF-2.1.x-JDK15/ws/cxf-2.1.x-fixes/common/common/src/main/java/org/apache/cxf/jaxb/JAXBUtils.java>:[508,21]
cannot find symbol
symbol  : variable StringUtils
location: class org.apache.cxf.jaxb.JAXBUtils


[INFO] ------------------------------------------------------------------------
[INFO] Trace
org.apache.maven.BuildFailureException: Compilation failure
<http://hudson.zones.apache.org/hudson/job/CXF-2.1.x-JDK15/ws/cxf-2.1.x-fixes/common/common/src/main/java/org/apache/cxf/jaxb/JAXBUtils.java>:[508,21]
cannot find symbol
symbol  : variable StringUtils
location: class org.apache.cxf.jaxb.JAXBUtils


	at org.apache.maven.lifecycle.DefaultLifecycleExecutor.executeGoals(DefaultLifecycleExecutor.java:579)
	at org.apache.maven.lifecycle.DefaultLifecycleExecutor.executeGoalWithLifecycle(DefaultLifecycleExecutor.java:499)
	at org.apache.maven.lifecycle.DefaultLifecycleExecutor.executeGoal(DefaultLifecycleExecutor.java:478)
	at org.apache.maven.lifecycle.DefaultLifecycleExecutor.executeGoalAndHandleFailures(DefaultLifecycleExecutor.java:330)
	at org.apache.maven.lifecycle.DefaultLifecycleExecutor.executeTaskSegments(DefaultLifecycleExecutor.java:291)
	at org.apache.maven.lifecycle.DefaultLifecycleExecutor.execute(DefaultLifecycleExecutor.java:142)
	at org.apache.maven.lifecycle.LifecycleExecutorInterceptor.execute(LifecycleExecutorInterceptor.java:65)
	at org.apache.maven.DefaultMaven.doExecute(DefaultMaven.java:336)
	at org.apache.maven.DefaultMaven.execute(DefaultMaven.java:129)
	at org.apache.maven.cli.MavenCli.main(MavenCli.java:287)
	at sun.reflect.NativeMethodAccessorImpl.invoke0(Native Method)
	at sun.reflect.NativeMethodAccessorImpl.invoke(NativeMethodAccessorImpl.java:39)
	at sun.reflect.DelegatingMethodAccessorImpl.invoke(DelegatingMethodAccessorImpl.java:25)
	at java.lang.reflect.Method.invoke(Method.java:585)
	at org.codehaus.classworlds.Launcher.launchEnhanced(Launcher.java:315)
	at org.codehaus.classworlds.Launcher.launch(Launcher.java:255)
	at hudson.maven.agent.Main.launch(Main.java:165)
	at hudson.maven.MavenBuilder.call(MavenBuilder.java:159)
	at hudson.maven.MavenModuleSetBuild$Builder.call(MavenModuleSetBuild.java:687)
	at hudson.maven.MavenModuleSetBuild$Builder.call(MavenModuleSetBuild.java:633)
	at hudson.remoting.UserRequest.perform(UserRequest.java:104)
	at hudson.remoting.UserRequest.perform(UserRequest.java:48)
	at hudson.remoting.Request$2.run(Request.java:236)
	at java.util.concurrent.Executors$RunnableAdapter.call(Executors.java:417)
	at java.util.concurrent.FutureTask$Sync.innerRun(FutureTask.java:269)
	at java.util.concurrent.FutureTask.run(FutureTask.java:123)
	at java.util.concurrent.ThreadPoolExecutor$Worker.runTask(ThreadPoolExecutor.java:650)
	at java.util.concurrent.ThreadPoolExecutor$Worker.run(ThreadPoolExecutor.java:675)
	at java.lang.Thread.run(Thread.java:595)
Caused by: org.apache.maven.plugin.CompilationFailureException: Compilation failure
<http://hudson.zones.apache.org/hudson/job/CXF-2.1.x-JDK15/ws/cxf-2.1.x-fixes/common/common/src/main/java/org/apache/cxf/jaxb/JAXBUtils.java>:[508,21]
cannot find symbol
symbol  : variable StringUtils
location: class org.apache.cxf.jaxb.JAXBUtils


	at org.apache.maven.plugin.AbstractCompilerMojo.execute(AbstractCompilerMojo.java:516)
	at org.apache.maven.plugin.CompilerMojo.execute(CompilerMojo.java:114)
	at org.apache.maven.plugin.DefaultPluginManager.executeMojo(DefaultPluginManager.java:451)
	at hudson.maven.agent.PluginManagerInterceptor.executeMojo(PluginManagerInterceptor.java:182)
	at org.apache.maven.lifecycle.DefaultLifecycleExecutor.executeGoals(DefaultLifecycleExecutor.java:558)
	... 28 more
[INFO] ------------------------------------------------------------------------
[INFO] Total time: 55 seconds
[INFO] Finished at: Fri Oct 16 17:13:37 UTC 2009
[INFO] Final Memory: 47M/97M
[INFO] ------------------------------------------------------------------------
Waiting for Hudson to finish collecting data
Sending e-mails to: notifications@cxf.apache.org dkulp@apache.org
channel stopped


Mime
View raw message