cxf-notifications mailing list archives

Site index · List index
Message view « Date » · « Thread »
Top « Date » · « Thread »
From Apache Hudson Server <hud...@hudson.zones.apache.org>
Subject Build failed in Hudson: CXF-2.1.x-JDK15 » Apache CXF Common Utilities #253
Date Fri, 16 Oct 2009 17:12:27 GMT
See <http://hudson.zones.apache.org/hudson/job/CXF-2.1.x-JDK15/org.apache.cxf$cxf-common-utilities/253/changes>

Changes:

[dkulp] Merged revisions 826002 via svnmerge from 
https://svn.apache.org/repos/asf/cxf/branches/2.2.x-fixes

................
  r826002 | dkulp | 2009-10-16 13:01:30 -0400 (Fri, 16 Oct 2009) | 11 lines
  
  Merged revisions 826001 via svnmerge from 
  https://svn.apache.org/repos/asf/cxf/trunk
  
  ........
    r826001 | dkulp | 2009-10-16 12:55:13 -0400 (Fri, 16 Oct 2009) | 3 lines
    
    [CXF-2339] Add jaxb-xjc to deps for dynamic_client pom.
    Update JAXBUtils to hunt for the tools.jar to create the SchemaCompiler
    things to help in the case where xjc isn't found
  ........
................

------------------------------------------
[INFO] ------------------------------------------------------------------------
[INFO] Building Apache CXF Common Utilities
[INFO]    task-segment: [clean, install]
[INFO] ------------------------------------------------------------------------
[INFO] [clean:clean]
[INFO] Deleting directory <http://hudson.zones.apache.org/hudson/job/CXF-2.1.x-JDK15/org.apache.cxf$cxf-common-utilities/ws/target>
[INFO] [checkstyle:checkstyle {execution: validate}]
[INFO] Starting audit...
Audit done.

[INFO] Setting property: classpath.resource.loader.class => 'org.codehaus.plexus.velocity.ContextClassLoaderResourceLoader'.
[INFO] Setting property: velocimacro.messages.on => 'false'.
[INFO] Setting property: resource.loader => 'classpath'.
[INFO] Setting property: resource.manager.logwhenfound => 'false'.
[INFO] Preparing pmd:check
[HUDSON] Archiving <http://hudson.zones.apache.org/hudson/job/CXF-2.1.x-JDK15/org.apache.cxf$cxf-common-utilities/ws/pom.xml>
to /export/home/hudson/hudson/jobs/CXF-2.1.x-JDK15/modules/org.apache.cxf$cxf-common-utilities/builds/2009-10-16_17-11-09/archive/org.apache.cxf/cxf-common-utilities/2.1.8-SNAPSHOT/pom.xml
[INFO] [pmd:pmd]
[INFO] [pmd:check {execution: validate}]
[INFO] 
[INFO] [cxf-xml2fastinfoset:xml2fastinfoset {execution: xml2fastinfoset}]
[INFO] [remote-resources:process {execution: default}]
[INFO] [resources:resources]
[INFO] Using 'UTF-8' encoding to copy filtered resources.
[INFO] Copying 8 resources
[INFO] Copying 2 resources
[INFO] Copying 1 resource
[INFO] skip non existing resourceDirectory <http://hudson.zones.apache.org/hudson/job/CXF-2.1.x-JDK15/org.apache.cxf$cxf-common-utilities/ws/target/generated/src/main/resources>
[INFO] Copying 3 resources
[INFO] [compiler:compile]
[INFO] Compiling 127 source files to <http://hudson.zones.apache.org/hudson/job/CXF-2.1.x-JDK15/org.apache.cxf$cxf-common-utilities/ws/target/classes>
[INFO] ------------------------------------------------------------------------
[ERROR] BUILD FAILURE
[INFO] ------------------------------------------------------------------------
[INFO] Compilation failure
<http://hudson.zones.apache.org/hudson/job/CXF-2.1.x-JDK15/org.apache.cxf$cxf-common-utilities/ws/src/main/java/org/apache/cxf/jaxb/JAXBUtils.java>:[508,21]
cannot find symbol
symbol  : variable StringUtils
location: class org.apache.cxf.jaxb.JAXBUtils



<http://hudson.zones.apache.org/hudson/job/CXF-2.1.x-JDK15/org.apache.cxf$cxf-common-utilities/ws/src/main/java/org/apache/cxf/jaxb/JAXBUtils.java>:[508,21]
cannot find symbol
symbol  : variable StringUtils
location: class org.apache.cxf.jaxb.JAXBUtils


[INFO] ------------------------------------------------------------------------
[INFO] Trace
org.apache.maven.BuildFailureException: Compilation failure
<http://hudson.zones.apache.org/hudson/job/CXF-2.1.x-JDK15/org.apache.cxf$cxf-common-utilities/ws/src/main/java/org/apache/cxf/jaxb/JAXBUtils.java>:[508,21]
cannot find symbol
symbol  : variable StringUtils
location: class org.apache.cxf.jaxb.JAXBUtils


	at org.apache.maven.lifecycle.DefaultLifecycleExecutor.executeGoals(DefaultLifecycleExecutor.java:579)
	at org.apache.maven.lifecycle.DefaultLifecycleExecutor.executeGoalWithLifecycle(DefaultLifecycleExecutor.java:499)
	at org.apache.maven.lifecycle.DefaultLifecycleExecutor.executeGoal(DefaultLifecycleExecutor.java:478)
	at org.apache.maven.lifecycle.DefaultLifecycleExecutor.executeGoalAndHandleFailures(DefaultLifecycleExecutor.java:330)
	at org.apache.maven.lifecycle.DefaultLifecycleExecutor.executeTaskSegments(DefaultLifecycleExecutor.java:291)
	at org.apache.maven.lifecycle.DefaultLifecycleExecutor.execute(DefaultLifecycleExecutor.java:142)
	at org.apache.maven.lifecycle.LifecycleExecutorInterceptor.execute(LifecycleExecutorInterceptor.java:65)
	at org.apache.maven.DefaultMaven.doExecute(DefaultMaven.java:336)
	at org.apache.maven.DefaultMaven.execute(DefaultMaven.java:129)
	at org.apache.maven.cli.MavenCli.main(MavenCli.java:287)
	at sun.reflect.NativeMethodAccessorImpl.invoke0(Native Method)
	at sun.reflect.NativeMethodAccessorImpl.invoke(NativeMethodAccessorImpl.java:39)
	at sun.reflect.DelegatingMethodAccessorImpl.invoke(DelegatingMethodAccessorImpl.java:25)
	at java.lang.reflect.Method.invoke(Method.java:585)
	at org.codehaus.classworlds.Launcher.launchEnhanced(Launcher.java:315)
	at org.codehaus.classworlds.Launcher.launch(Launcher.java:255)
	at hudson.maven.agent.Main.launch(Main.java:165)
	at hudson.maven.MavenBuilder.call(MavenBuilder.java:159)
	at hudson.maven.MavenModuleSetBuild$Builder.call(MavenModuleSetBuild.java:687)
	at hudson.maven.MavenModuleSetBuild$Builder.call(MavenModuleSetBuild.java:633)
	at hudson.remoting.UserRequest.perform(UserRequest.java:104)
	at hudson.remoting.UserRequest.perform(UserRequest.java:48)
	at hudson.remoting.Request$2.run(Request.java:236)
	at java.util.concurrent.Executors$RunnableAdapter.call(Executors.java:417)
	at java.util.concurrent.FutureTask$Sync.innerRun(FutureTask.java:269)
	at java.util.concurrent.FutureTask.run(FutureTask.java:123)
	at java.util.concurrent.ThreadPoolExecutor$Worker.runTask(ThreadPoolExecutor.java:650)
	at java.util.concurrent.ThreadPoolExecutor$Worker.run(ThreadPoolExecutor.java:675)
	at java.lang.Thread.run(Thread.java:595)
Caused by: org.apache.maven.plugin.CompilationFailureException: Compilation failure
<http://hudson.zones.apache.org/hudson/job/CXF-2.1.x-JDK15/org.apache.cxf$cxf-common-utilities/ws/src/main/java/org/apache/cxf/jaxb/JAXBUtils.java>:[508,21]
cannot find symbol
symbol  : variable StringUtils
location: class org.apache.cxf.jaxb.JAXBUtils


	at org.apache.maven.plugin.AbstractCompilerMojo.execute(AbstractCompilerMojo.java:516)
	at org.apache.maven.plugin.CompilerMojo.execute(CompilerMojo.java:114)
	at org.apache.maven.plugin.DefaultPluginManager.executeMojo(DefaultPluginManager.java:451)
	at hudson.maven.agent.PluginManagerInterceptor.executeMojo(PluginManagerInterceptor.java:182)
	at org.apache.maven.lifecycle.DefaultLifecycleExecutor.executeGoals(DefaultLifecycleExecutor.java:558)
	... 28 more
[INFO] ------------------------------------------------------------------------
[INFO] Total time: 55 seconds
[INFO] Finished at: Fri Oct 16 17:13:37 UTC 2009
[INFO] Final Memory: 47M/97M
[INFO] ------------------------------------------------------------------------
Waiting for Hudson to finish collecting data


Mime
View raw message