cxf-notifications mailing list archives

Site index · List index
Message view « Date » · « Thread »
Top « Date » · « Thread »
From Apache Hudson Server <hud...@hudson.zones.apache.org>
Subject Build failed in Hudson: CXF-2.1.x-JDK15 #309
Date Mon, 11 Jan 2010 18:58:33 GMT
See <http://hudson.zones.apache.org/hudson/job/CXF-2.1.x-JDK15/309/changes>

Changes:

[dkulp] Blocked revisions 897228,897325,897327,897818,897947,897949,897952-897954,897958 via
svnmerge

................
  r897228 | sergeyb | 2010-01-08 10:20:15 -0500 (Fri, 08 Jan 2010) | 9 lines
  
  Merged revisions 897226 via svnmerge from 
  https://svn.apache.org/repos/asf/cxf/trunk
  
  ........
    r897226 | sergeyb | 2010-01-08 15:15:31 +0000 (Fri, 08 Jan 2010) | 1 line
    
    Fixing JAXRS multipart test
  ........
................
  r897325 | dkulp | 2010-01-08 16:30:54 -0500 (Fri, 08 Jan 2010) | 10 lines
  
  Merged revisions 897310 via svnmerge from 
  https://svn.apache.org/repos/asf/cxf/trunk
  
  ........
    r897310 | dkulp | 2010-01-08 14:46:40 -0500 (Fri, 08 Jan 2010) | 2 lines
    
    [CXF-1816] Copy some JDK hacks from Tomcat to try and get jars not to
    lock.
  ........
................
  r897327 | dkulp | 2010-01-08 16:33:13 -0500 (Fri, 08 Jan 2010) | 10 lines
  
  Merged revisions 897324 via svnmerge from 
  https://svn.apache.org/repos/asf/cxf/trunk
  
  ........
    r897324 | dkulp | 2010-01-08 16:28:22 -0500 (Fri, 08 Jan 2010) | 2 lines
    
    [CXF-2598] Add support for the minOccurs and nillable annotations on the
    method return/params
  ........
................
  r897818 | sergeyb | 2010-01-11 04:40:44 -0500 (Mon, 11 Jan 2010) | 9 lines
  
  Merged revisions 897812 via svnmerge from 
  https://svn.apache.org/repos/asf/cxf/trunk
  
  ........
    r897812 | sergeyb | 2010-01-11 09:31:09 +0000 (Mon, 11 Jan 2010) | 1 line
    
    JAXRS support for reading Document and fixes to do with updating destinations when request
URIs are equal to endpoint addresses 
  ........
................
  r897947 | dkulp | 2010-01-11 12:06:39 -0500 (Mon, 11 Jan 2010) | 9 lines
  
  Merged revisions 897329 via svnmerge from 
  https://svn.apache.org/repos/asf/cxf/trunk
  
  ........
    r897329 | dkulp | 2010-01-08 16:42:36 -0500 (Fri, 08 Jan 2010) | 1 line
    
    Add a string to try and diagnose failures on hudson
  ........
................
  r897949 | dkulp | 2010-01-11 12:09:45 -0500 (Mon, 11 Jan 2010) | 9 lines
  
  Merged revisions 897567 via svnmerge from 
  https://svn.apache.org/repos/asf/cxf/trunk
  
  ........
    r897567 | cschneider | 2010-01-09 17:31:37 -0500 (Sat, 09 Jan 2010) | 1 line
    
    Fix for CXF-2612
  ........
................
  r897952 | dkulp | 2010-01-11 12:11:07 -0500 (Mon, 11 Jan 2010) | 9 lines
  
  Merged revisions 897596 via svnmerge from 
  https://svn.apache.org/repos/asf/cxf/trunk
  
  ........
    r897596 | cschneider | 2010-01-10 02:49:39 -0500 (Sun, 10 Jan 2010) | 1 line
    
    CXF-2611 Removed generating temporary file generation to add wsdlLocation to binding as
an empty wsdlLocation has the same effect
  ........
................
  r897953 | dkulp | 2010-01-11 12:16:42 -0500 (Mon, 11 Jan 2010) | 9 lines
  
  Merged revisions 897597 via svnmerge from 
  https://svn.apache.org/repos/asf/cxf/trunk
  
  ........
    r897597 | cschneider | 2010-01-10 02:50:50 -0500 (Sun, 10 Jan 2010) | 1 line
    
    Added documentation to explain how the defaults in codegen plugin work.
  ........
................
  r897954 | dkulp | 2010-01-11 12:21:26 -0500 (Mon, 11 Jan 2010) | 9 lines
  
  Merged revisions 897613 via svnmerge from 
  https://svn.apache.org/repos/asf/cxf/trunk
  
  ........
    r897613 | cschneider | 2010-01-10 06:03:51 -0500 (Sun, 10 Jan 2010) | 1 line
    
    Fix CXF-2459 set SecurityContext in jms transport for Tibco EMS
  ........
................
  r897958 | dkulp | 2010-01-11 12:26:58 -0500 (Mon, 11 Jan 2010) | 10 lines
  
  Merged revisions 897950 via svnmerge from 
  https://svn.apache.org/repos/asf/cxf/trunk
  
  ........
    r897950 | dkulp | 2010-01-11 12:10:11 -0500 (Mon, 11 Jan 2010) | 2 lines
    
    [CXF-2613] Fix tests with IBM 1.6 JDK and restricted jars
    Patch from Eamonn Dwyer applied
  ........
................

[dkulp] Merged revisions 897957 via svnmerge from 
https://svn.apache.org/repos/asf/cxf/branches/2.2.x-fixes

................
  r897957 | dkulp | 2010-01-11 12:23:50 -0500 (Mon, 11 Jan 2010) | 9 lines
  
  Merged revisions 897944 via svnmerge from 
  https://svn.apache.org/repos/asf/cxf/trunk
  
  ........
    r897944 | dkulp | 2010-01-11 12:00:25 -0500 (Mon, 11 Jan 2010) | 1 line
    
    Some versions of Sun's jaxp throw and exception, they don't return null.
  ........
................

[dkulp] Merged revisions 897291 via svnmerge from 
https://svn.apache.org/repos/asf/cxf/branches/2.2.x-fixes

................
  r897291 | cleclerc | 2010-01-08 13:41:37 -0500 (Fri, 08 Jan 2010) | 9 lines
  
  Merged revisions 897290 via svnmerge from 
  https://svn.apache.org/repos/asf/cxf/trunk
  
  ........
    r897290 | cleclerc | 2010-01-08 19:36:46 +0100 (Fri, 08 Jan 2010) | 1 line
    
    [CXF-2610] trim logger class name
  ........
................

------------------------------------------
[...truncated 23 lines...]
[INFO]   Apache CXF XJC Default Value Plugin Tests
[INFO]   Apache CXF XJC toString Plugin Tests
[INFO]   Apache CXF XJC Plugins
[INFO]   Apache CXF Common
[INFO]   Apache CXF API
[INFO]   Apache CXF Runtime Core
[INFO]   Apache CXF Command Line Tools Common
[INFO]   Apache CXF Command Line Tools Validator
[INFO]   Apache CXF Command Line Tools WSDLTo Core
[INFO]   Apache CXF Command Line Tools WSDLTo JAXWS Frontend
[INFO]   Apache CXF WSDL Validator Maven2 Plugin
[INFO]   Apache CXF Command Line Tools WSDLTo JAXB Databinding
[INFO]   Apache CXF Code Generation Maven2 Plugins
[INFO]   Apache CXF Test Utilities
[INFO]   Apache CXF Runtime JAXB DataBinding
[INFO]   Apache CXF Runtime XML Binding
[INFO]   Apache CXF Runtime SOAP Binding
[INFO]   Apache CXF Runtime Local Transport
[INFO]   Apache CXF Runtime Simple Frontend
[INFO]   Apache CXF Runtime HTTP Transport
[INFO]   Apache CXF Runtime HTTP Jetty Transport
[INFO]   Apache CXF Runtime WS Addressing
[INFO]   Apache CXF Runtime JAX-WS Frontend
[INFO]   Apache CXF Test Case Support
[INFO]   Apache CXF Runtime Aegis Databinding
[INFO]   Apache CXF Runtime JavaScript Client Generator
[INFO]   Apache CXF Command Line Tools WSDL to JavaScript Front End
[INFO]   Apache CXF Runtime Management
[INFO]   Apache CXF Runtime JMS Transport
[INFO]   Apache CXF Runtime XmlBeans DataBinding
[INFO]   Apache CXF Command Line Tools WSDLTo Test
[INFO]   Apache CXF Command Line Tools WSDLTo Misctools
[INFO]   Apache CXF Command Line Tools
[INFO]   Apache CXF Command Line Tools WSDLTo
[INFO]   Apache CXF Command Line Tools JavaTo WS
[INFO]   Apache CXF Command Line Tools JavaTo
[INFO]   Apache CXF Runtime CORBA Binding
[INFO]   Apache CXF Command Line Tools CORBA
[INFO]   Apache CXF Ant Tasks
[INFO]   Apache CXF Runtime HTTP Binding
[INFO]   Apache CXF Runtime Object Binding
[INFO]   Apache CXF Runtime Colocated Binding
[INFO]   Apache CXF Runtime JBI Binding
[INFO]   Apache CXF Runtime
[INFO]   Apache CXF Runtime Bindings
[INFO]   Apache CXF Runtime JAX-RS Frontend
[INFO]   Apache CXF Runtime JavaScript Frontend
[INFO]   Apache CXF Runtime JBI Transport
[INFO]   Apache CXF Runtime WS Policy
[INFO]   Apache CXF Runtime WS Reliable Messaging
[INFO]   Apache CXF Runtime WS Security
[INFO]   Apache CXF JBI Integration
[INFO]   Apache CXF JCA Connection
[INFO]   Apache CXF Integration
[INFO]   Apache CXF Java2WS Maven2 Plugin
[INFO]   Apache CXF CORBA Tools Maven2 Plugins
[INFO]   Apache CXF Archetype - Simple JAX-WS Java First
[INFO]   Apache CXF Maven Archetypes
[INFO]   Apache CXF Eclipse Plugin Generator Maven2 Plugin
[INFO]   Apache CXF Maven Plugins
[INFO]   Apache CXF Uncategorized System Tests
[INFO]   Apache CXF Transport System Tests
[INFO]   Apache CXF JAX-WS System Tests
[INFO]   Apache CXF Databinding System Tests
[INFO]   Apache CXF JAX-RS System Tests
[INFO]   Apache CXF WS-* Specifications System Tests
[INFO]   Apache CXF System Tests
[INFO] ------------------------------------------------------------------------
[INFO] Building Apache CXF
[INFO]    task-segment: [clean, install]
[INFO] ------------------------------------------------------------------------
[INFO] [clean:clean]
[INFO] [site:attach-descriptor]
[INFO] [install:install]
[INFO] Installing <http://hudson.zones.apache.org/hudson/job/CXF-2.1.x-JDK15/ws/cxf-2.1.x-fixes/pom.xml>
to <http://hudson.zones.apache.org/hudson/job/CXF-2.1.x-JDK15/ws/.repository/org/apache/cxf/cxf/2.1.9-SNAPSHOT/cxf-2.1.9-SNAPSHOT.pom>
[HUDSON] Archiving <http://hudson.zones.apache.org/hudson/job/CXF-2.1.x-JDK15/ws/cxf-2.1.x-fixes/pom.xml>
to /export/home/hudson/hudson/jobs/CXF-2.1.x-JDK15/modules/org.apache.cxf$cxf/builds/2010-01-11_18-56-42/archive/org.apache.cxf/cxf/2.1.9-SNAPSHOT/pom.xml
[INFO] ------------------------------------------------------------------------
[INFO] Building Apache CXF Buildtools
[INFO]    task-segment: [clean, install]
[INFO] ------------------------------------------------------------------------
[INFO] [clean:clean]
[INFO] Deleting directory <http://hudson.zones.apache.org/hudson/job/CXF-2.1.x-JDK15/ws/cxf-2.1.x-fixes/buildtools/target>
[INFO] [resources:resources]
[INFO] Using 'UTF-8' encoding to copy filtered resources.
[INFO] Copying 11 resources
[INFO] [compiler:compile]
[INFO] Compiling 3 source files to <http://hudson.zones.apache.org/hudson/job/CXF-2.1.x-JDK15/ws/cxf-2.1.x-fixes/buildtools/target/classes>
[INFO] [resources:testResources]
[INFO] Using 'UTF-8' encoding to copy filtered resources.
[INFO] skip non existing resourceDirectory <http://hudson.zones.apache.org/hudson/job/CXF-2.1.x-JDK15/ws/cxf-2.1.x-fixes/buildtools/src/test/resources>
[INFO] [compiler:testCompile]
[INFO] Not compiling test sources
[INFO] [surefire:test]
[INFO] Tests are skipped.
[INFO] [jar:jar]
[INFO] Building jar: <http://hudson.zones.apache.org/hudson/job/CXF-2.1.x-JDK15/ws/cxf-2.1.x-fixes/buildtools/target/cxf-buildtools-2.1.9-SNAPSHOT.jar>
[INFO] [install:install]
[INFO] Installing <http://hudson.zones.apache.org/hudson/job/CXF-2.1.x-JDK15/ws/cxf-2.1.x-fixes/buildtools/target/cxf-buildtools-2.1.9-SNAPSHOT.jar>
to <http://hudson.zones.apache.org/hudson/job/CXF-2.1.x-JDK15/ws/.repository/org/apache/cxf/cxf-buildtools/2.1.9-SNAPSHOT/cxf-buildtools-2.1.9-SNAPSHOT.jar>
[HUDSON] Archiving <http://hudson.zones.apache.org/hudson/job/CXF-2.1.x-JDK15/ws/cxf-2.1.x-fixes/buildtools/pom.xml>
to /export/home/hudson/hudson/jobs/CXF-2.1.x-JDK15/modules/org.apache.cxf$cxf-buildtools/builds/2010-01-11_18-56-42/archive/org.apache.cxf/cxf-buildtools/2.1.9-SNAPSHOT/pom.xml
[HUDSON] Archiving <http://hudson.zones.apache.org/hudson/job/CXF-2.1.x-JDK15/ws/cxf-2.1.x-fixes/buildtools/target/cxf-buildtools-2.1.9-SNAPSHOT.jar>
to /export/home/hudson/hudson/jobs/CXF-2.1.x-JDK15/modules/org.apache.cxf$cxf-buildtools/builds/2010-01-11_18-56-42/archive/org.apache.cxf/cxf-buildtools/2.1.9-SNAPSHOT/cxf-buildtools-2.1.9-SNAPSHOT.jar
[INFO] ------------------------------------------------------------------------
[INFO] Building Apache CXF XML to FastInfoset Maven2 Plugin
[INFO]    task-segment: [clean, install]
[INFO] ------------------------------------------------------------------------
[INFO] [clean:clean]
[INFO] Deleting directory <http://hudson.zones.apache.org/hudson/job/CXF-2.1.x-JDK15/ws/cxf-2.1.x-fixes/maven-plugins/xml2fastinfoset-plugin/target>
[INFO] [plugin:descriptor]
[WARNING] Using platform encoding (UTF-8 actually) to read mojo metadata, i.e. build is platform
dependent!
[INFO] Applying mojo extractor for language: java
[INFO] Mojo extractor for language: java found 1 mojo descriptors.
[INFO] Applying mojo extractor for language: bsh
[INFO] Mojo extractor for language: bsh found 0 mojo descriptors.
[INFO] [resources:resources]
[INFO] Using 'UTF-8' encoding to copy filtered resources.
[INFO] skip non existing resourceDirectory <http://hudson.zones.apache.org/hudson/job/CXF-2.1.x-JDK15/ws/cxf-2.1.x-fixes/maven-plugins/xml2fastinfoset-plugin/src/main/resources>
[INFO] [compiler:compile]
[INFO] Compiling 1 source file to <http://hudson.zones.apache.org/hudson/job/CXF-2.1.x-JDK15/ws/cxf-2.1.x-fixes/maven-plugins/xml2fastinfoset-plugin/target/classes>
[INFO] [resources:testResources]
[INFO] Using 'UTF-8' encoding to copy filtered resources.
[INFO] skip non existing resourceDirectory <http://hudson.zones.apache.org/hudson/job/CXF-2.1.x-JDK15/ws/cxf-2.1.x-fixes/maven-plugins/xml2fastinfoset-plugin/src/test/resources>
[INFO] [compiler:testCompile]
[INFO] No sources to compile
[INFO] [surefire:test]
[INFO] No tests to run.
[HUDSON] Recording test results
[INFO] [jar:jar]
[INFO] Building jar: <http://hudson.zones.apache.org/hudson/job/CXF-2.1.x-JDK15/ws/cxf-2.1.x-fixes/maven-plugins/xml2fastinfoset-plugin/target/cxf-xml2fastinfoset-plugin-2.1.9-SNAPSHOT.jar>
[INFO] [plugin:addPluginArtifactMetadata]
[INFO] [install:install]
[INFO] Installing <http://hudson.zones.apache.org/hudson/job/CXF-2.1.x-JDK15/ws/cxf-2.1.x-fixes/maven-plugins/xml2fastinfoset-plugin/target/cxf-xml2fastinfoset-plugin-2.1.9-SNAPSHOT.jar>
to <http://hudson.zones.apache.org/hudson/job/CXF-2.1.x-JDK15/ws/.repository/org/apache/cxf/cxf-xml2fastinfoset-plugin/2.1.9-SNAPSHOT/cxf-xml2fastinfoset-plugin-2.1.9-SNAPSHOT.jar>
[INFO] [plugin:updateRegistry]
[HUDSON] Archiving <http://hudson.zones.apache.org/hudson/job/CXF-2.1.x-JDK15/ws/cxf-2.1.x-fixes/maven-plugins/xml2fastinfoset-plugin/pom.xml>
to /export/home/hudson/hudson/jobs/CXF-2.1.x-JDK15/modules/org.apache.cxf$cxf-xml2fastinfoset-plugin/builds/2010-01-11_18-56-42/archive/org.apache.cxf/cxf-xml2fastinfoset-plugin/2.1.9-SNAPSHOT/pom.xml
[HUDSON] Archiving <http://hudson.zones.apache.org/hudson/job/CXF-2.1.x-JDK15/ws/cxf-2.1.x-fixes/maven-plugins/xml2fastinfoset-plugin/target/cxf-xml2fastinfoset-plugin-2.1.9-SNAPSHOT.jar>
to /export/home/hudson/hudson/jobs/CXF-2.1.x-JDK15/modules/org.apache.cxf$cxf-xml2fastinfoset-plugin/builds/2010-01-11_18-56-42/archive/org.apache.cxf/cxf-xml2fastinfoset-plugin/2.1.9-SNAPSHOT/cxf-xml2fastinfoset-plugin-2.1.9-SNAPSHOT.jar
[INFO] ------------------------------------------------------------------------
[INFO] Building Apache CXF Parent
[INFO]    task-segment: [clean, install]
[INFO] ------------------------------------------------------------------------
[INFO] [clean:clean]
[INFO] Deleting directory <http://hudson.zones.apache.org/hudson/job/CXF-2.1.x-JDK15/ws/cxf-2.1.x-fixes/parent/target>
[INFO] snapshot org.apache.cxf:cxf-buildtools:2.1.9-SNAPSHOT: checking for updates from apache.snapshots
[INFO] [checkstyle:checkstyle {execution: validate}]
[INFO] Source directory does not exist - skipping report.
[INFO] Preparing pmd:check
[HUDSON] Archiving <http://hudson.zones.apache.org/hudson/job/CXF-2.1.x-JDK15/ws/cxf-2.1.x-fixes/parent/pom.xml>
to /export/home/hudson/hudson/jobs/CXF-2.1.x-JDK15/modules/org.apache.cxf$cxf-parent/builds/2010-01-11_18-56-42/archive/org.apache.cxf/cxf-parent/2.1.9-SNAPSHOT/pom.xml
[INFO] [pmd:pmd]
[INFO] [pmd:check {execution: validate}]
[INFO] [cxf-xml2fastinfoset:xml2fastinfoset {execution: xml2fastinfoset}]
[INFO] Setting property: classpath.resource.loader.class => 'org.codehaus.plexus.velocity.ContextClassLoaderResourceLoader'.
[INFO] Setting property: velocimacro.messages.on => 'false'.
[INFO] Setting property: resource.loader => 'classpath'.
[INFO] Setting property: resource.manager.logwhenfound => 'false'.
[INFO] [remote-resources:process {execution: default}]
[INFO] [site:attach-descriptor]
[INFO] [install:install]
[INFO] Installing <http://hudson.zones.apache.org/hudson/job/CXF-2.1.x-JDK15/ws/cxf-2.1.x-fixes/parent/pom.xml>
to <http://hudson.zones.apache.org/hudson/job/CXF-2.1.x-JDK15/ws/.repository/org/apache/cxf/cxf-parent/2.1.9-SNAPSHOT/cxf-parent-2.1.9-SNAPSHOT.pom>
[INFO] ------------------------------------------------------------------------
[INFO] Building Apache CXF Common Utilities
[INFO]    task-segment: [clean, install]
[INFO] ------------------------------------------------------------------------
[INFO] [clean:clean]
[INFO] Deleting directory <http://hudson.zones.apache.org/hudson/job/CXF-2.1.x-JDK15/ws/cxf-2.1.x-fixes/common/common/target>
[INFO] [checkstyle:checkstyle {execution: validate}]
[INFO] Starting audit...
Audit done.

[INFO] Setting property: classpath.resource.loader.class => 'org.codehaus.plexus.velocity.ContextClassLoaderResourceLoader'.
[INFO] Setting property: velocimacro.messages.on => 'false'.
[INFO] Setting property: resource.loader => 'classpath'.
[INFO] Setting property: resource.manager.logwhenfound => 'false'.
[INFO] Preparing pmd:check
[HUDSON] Archiving <http://hudson.zones.apache.org/hudson/job/CXF-2.1.x-JDK15/ws/cxf-2.1.x-fixes/common/common/pom.xml>
to /export/home/hudson/hudson/jobs/CXF-2.1.x-JDK15/modules/org.apache.cxf$cxf-common-utilities/builds/2010-01-11_18-56-42/archive/org.apache.cxf/cxf-common-utilities/2.1.9-SNAPSHOT/pom.xml
[INFO] [pmd:pmd]
[INFO] [pmd:check {execution: validate}]
[INFO] 
[INFO] [cxf-xml2fastinfoset:xml2fastinfoset {execution: xml2fastinfoset}]
[INFO] [remote-resources:process {execution: default}]
[INFO] [resources:resources]
[INFO] Using 'UTF-8' encoding to copy filtered resources.
[INFO] Copying 8 resources
[INFO] Copying 2 resources
[INFO] Copying 1 resource
[INFO] skip non existing resourceDirectory <http://hudson.zones.apache.org/hudson/job/CXF-2.1.x-JDK15/ws/cxf-2.1.x-fixes/common/common/target/generated/src/main/resources>
[INFO] Copying 3 resources
[INFO] [compiler:compile]
[INFO] Compiling 127 source files to <http://hudson.zones.apache.org/hudson/job/CXF-2.1.x-JDK15/ws/cxf-2.1.x-fixes/common/common/target/classes>
[INFO] ------------------------------------------------------------------------
[ERROR] BUILD FAILURE
[INFO] ------------------------------------------------------------------------
[INFO] Compilation failure

<http://hudson.zones.apache.org/hudson/job/CXF-2.1.x-JDK15/ws/cxf-2.1.x-fixes/common/common/src/main/java/org/apache/cxf/staxutils/StaxUtils.java>:[986,56]
cannot find symbol
symbol  : class StreamSource
location: class org.apache.cxf.staxutils.StaxUtils

<http://hudson.zones.apache.org/hudson/job/CXF-2.1.x-JDK15/ws/cxf-2.1.x-fixes/common/common/src/main/java/org/apache/cxf/staxutils/StaxUtils.java>:[988,20]
cannot find symbol
symbol  : class StreamSource
location: class org.apache.cxf.staxutils.StaxUtils

<http://hudson.zones.apache.org/hudson/job/CXF-2.1.x-JDK15/ws/cxf-2.1.x-fixes/common/common/src/main/java/org/apache/cxf/staxutils/StaxUtils.java>:[988,39]
cannot find symbol
symbol  : class StreamSource
location: class org.apache.cxf.staxutils.StaxUtils


[INFO] ------------------------------------------------------------------------
[INFO] Trace
org.apache.maven.BuildFailureException: Compilation failure
	at org.apache.maven.lifecycle.DefaultLifecycleExecutor.executeGoals(DefaultLifecycleExecutor.java:579)
	at org.apache.maven.lifecycle.DefaultLifecycleExecutor.executeGoalWithLifecycle(DefaultLifecycleExecutor.java:499)
	at org.apache.maven.lifecycle.DefaultLifecycleExecutor.executeGoal(DefaultLifecycleExecutor.java:478)
	at org.apache.maven.lifecycle.DefaultLifecycleExecutor.executeGoalAndHandleFailures(DefaultLifecycleExecutor.java:330)
	at org.apache.maven.lifecycle.DefaultLifecycleExecutor.executeTaskSegments(DefaultLifecycleExecutor.java:291)
	at org.apache.maven.lifecycle.DefaultLifecycleExecutor.execute(DefaultLifecycleExecutor.java:142)
	at org.apache.maven.lifecycle.LifecycleExecutorInterceptor.execute(LifecycleExecutorInterceptor.java:65)
	at org.apache.maven.DefaultMaven.doExecute(DefaultMaven.java:336)
	at org.apache.maven.DefaultMaven.execute(DefaultMaven.java:129)
	at org.apache.maven.cli.MavenCli.main(MavenCli.java:287)
	at sun.reflect.NativeMethodAccessorImpl.invoke0(Native Method)
	at sun.reflect.NativeMethodAccessorImpl.invoke(NativeMethodAccessorImpl.java:39)
	at sun.reflect.DelegatingMethodAccessorImpl.invoke(DelegatingMethodAccessorImpl.java:25)
	at java.lang.reflect.Method.invoke(Method.java:585)
	at org.codehaus.classworlds.Launcher.launchEnhanced(Launcher.java:315)
	at org.codehaus.classworlds.Launcher.launch(Launcher.java:255)
	at hudson.maven.agent.Main.launch(Main.java:165)
	at hudson.maven.MavenBuilder.call(MavenBuilder.java:159)
	at hudson.maven.MavenModuleSetBuild$Builder.call(MavenModuleSetBuild.java:688)
	at hudson.maven.MavenModuleSetBuild$Builder.call(MavenModuleSetBuild.java:632)
	at hudson.remoting.UserRequest.perform(UserRequest.java:104)
	at hudson.remoting.UserRequest.perform(UserRequest.java:48)
	at hudson.remoting.Request$2.run(Request.java:236)
	at java.util.concurrent.Executors$RunnableAdapter.call(Executors.java:417)
	at java.util.concurrent.FutureTask$Sync.innerRun(FutureTask.java:269)
	at java.util.concurrent.FutureTask.run(FutureTask.java:123)
	at java.util.concurrent.ThreadPoolExecutor$Worker.runTask(ThreadPoolExecutor.java:650)
	at java.util.concurrent.ThreadPoolExecutor$Worker.run(ThreadPoolExecutor.java:675)
	at java.lang.Thread.run(Thread.java:595)
Caused by: org.apache.maven.plugin.CompilationFailureException: Compilation failure
	at org.apache.maven.plugin.AbstractCompilerMojo.execute(AbstractCompilerMojo.java:516)
	at org.apache.maven.plugin.CompilerMojo.execute(CompilerMojo.java:114)
	at org.apache.maven.plugin.DefaultPluginManager.executeMojo(DefaultPluginManager.java:451)
	at hudson.maven.agent.PluginManagerInterceptor.executeMojo(PluginManagerInterceptor.java:182)
	at org.apache.maven.lifecycle.DefaultLifecycleExecutor.executeGoals(DefaultLifecycleExecutor.java:558)
	... 28 more
[INFO] ------------------------------------------------------------------------
[INFO] Total time: 52 seconds
[INFO] Finished at: Mon Jan 11 19:04:16 UTC 2010
[INFO] Final Memory: 47M/100M
[INFO] ------------------------------------------------------------------------
Sending e-mails to: notifications@cxf.apache.org dkulp@apache.org
channel stopped


Mime
View raw message