cxf-notifications mailing list archives

Site index · List index
Message view « Date » · « Thread »
Top « Date » · « Thread »
From Apache Hudson Server <hud...@hudson.zones.apache.org>
Subject Build failed in Hudson: CXF-Trunk-JDK16 #254
Date Sat, 16 Jan 2010 05:31:25 GMT
See <http://hudson.zones.apache.org/hudson/job/CXF-Trunk-JDK16/254/changes>

Changes:

[dkulp] [CXF-2618] On the server side as well

[dkulp] [CXF-2618] Fix problem of secureSocketProtocol not being configurable

[dkulp] Make the xjc plugins more self standing and usable without CXF stuff
Pull xjc plugins from the bundle as there isn't a way to really disable
them if on the classpath and they can cause problems with other xjc
plugins

[dkulp] Use non-deprecated properly spelled methods

[sergeyb] JAX-RS : minor changes to do with the injection of contexts

------------------------------------------
[...truncated 2469 lines...]

[HUDSON] Recording test results
[INFO] [jar:jar]
[INFO] Building jar: <http://hudson.zones.apache.org/hudson/job/CXF-Trunk-JDK16/ws/trunk/rt/frontend/jaxws/target/cxf-rt-frontend-jaxws-2.3.0-SNAPSHOT.jar>
[INFO] [install:install]
[INFO] Installing <http://hudson.zones.apache.org/hudson/job/CXF-Trunk-JDK16/ws/trunk/rt/frontend/jaxws/target/cxf-rt-frontend-jaxws-2.3.0-SNAPSHOT.jar>
to <http://hudson.zones.apache.org/hudson/job/CXF-Trunk-JDK16/ws/.repository/org/apache/cxf/cxf-rt-frontend-jaxws/2.3.0-SNAPSHOT/cxf-rt-frontend-jaxws-2.3.0-SNAPSHOT.jar>
[HUDSON] Archiving <http://hudson.zones.apache.org/hudson/job/CXF-Trunk-JDK16/ws/trunk/rt/frontend/jaxws/target/cxf-rt-frontend-jaxws-2.3.0-SNAPSHOT.jar>
to /export/home/hudson/hudson/jobs/CXF-Trunk-JDK16/modules/org.apache.cxf$cxf-rt-frontend-jaxws/builds/2010-01-16_05-03-28/archive/org.apache.cxf/cxf-rt-frontend-jaxws/2.3.0-SNAPSHOT/cxf-rt-frontend-jaxws-2.3.0-SNAPSHOT.jar
[INFO] ------------------------------------------------------------------------
[INFO] Building Apache CXF Test Case Support
[INFO]    task-segment: [clean, install]
[INFO] ------------------------------------------------------------------------
[INFO] [clean:clean]
[INFO] Deleting file set: <http://hudson.zones.apache.org/hudson/job/CXF-Trunk-JDK16/ws/trunk/rt/testsupport/target>
(included: [**], excluded: [])
[INFO] [checkstyle:checkstyle {execution: validate}]
[INFO] Starting audit...
Audit done.

[INFO] Preparing pmd:check
[HUDSON] Archiving <http://hudson.zones.apache.org/hudson/job/CXF-Trunk-JDK16/ws/trunk/rt/testsupport/pom.xml>
to /export/home/hudson/hudson/jobs/CXF-Trunk-JDK16/modules/org.apache.cxf$cxf-rt-testsupport/builds/2010-01-16_05-03-28/archive/org.apache.cxf/cxf-rt-testsupport/2.3.0-SNAPSHOT/pom.xml
[INFO] [pmd:pmd]
[INFO] [pmd:check {execution: validate}]
[INFO] 
[INFO] [cxf-xml2fastinfoset:xml2fastinfoset {execution: xml2fastinfoset}]
[INFO] [remote-resources:process {execution: default}]
[INFO] [resources:resources]
[INFO] Using 'UTF-8' encoding to copy filtered resources.
[INFO] Copying 0 resource
[INFO] Copying 1 resource
[INFO] skip non existing resourceDirectory <http://hudson.zones.apache.org/hudson/job/CXF-Trunk-JDK16/ws/trunk/rt/testsupport/src/main/resources-filtered>
[INFO] skip non existing resourceDirectory <http://hudson.zones.apache.org/hudson/job/CXF-Trunk-JDK16/ws/trunk/rt/testsupport/target/generated/src/main/resources>
[INFO] Copying 3 resources
[INFO] [compiler:compile]
[INFO] Compiling 3 source files to <http://hudson.zones.apache.org/hudson/job/CXF-Trunk-JDK16/ws/trunk/rt/testsupport/target/classes>
[INFO] [resources:testResources]
[INFO] Using 'UTF-8' encoding to copy filtered resources.
[INFO] Copying 0 resource
[INFO] skip non existing resourceDirectory <http://hudson.zones.apache.org/hudson/job/CXF-Trunk-JDK16/ws/trunk/rt/testsupport/src/test/resources>
[INFO] skip non existing resourceDirectory <http://hudson.zones.apache.org/hudson/job/CXF-Trunk-JDK16/ws/trunk/rt/testsupport/target/generated/src/test/resources>
[INFO] Copying 3 resources
[INFO] [compiler:testCompile]
[INFO] Nothing to compile - all classes are up to date
[INFO] [surefire:test]
[INFO] Surefire report directory: <http://hudson.zones.apache.org/hudson/job/CXF-Trunk-JDK16/ws/trunk/rt/testsupport/target/surefire-reports>

-------------------------------------------------------
 T E S T S
-------------------------------------------------------
There are no tests to run.

Results :

Tests run: 0, Failures: 0, Errors: 0, Skipped: 0

[HUDSON] Recording test results
[INFO] [jar:jar]
[INFO] Building jar: <http://hudson.zones.apache.org/hudson/job/CXF-Trunk-JDK16/ws/trunk/rt/testsupport/target/cxf-rt-testsupport-2.3.0-SNAPSHOT.jar>
[INFO] [install:install]
[INFO] Installing <http://hudson.zones.apache.org/hudson/job/CXF-Trunk-JDK16/ws/trunk/rt/testsupport/target/cxf-rt-testsupport-2.3.0-SNAPSHOT.jar>
to <http://hudson.zones.apache.org/hudson/job/CXF-Trunk-JDK16/ws/.repository/org/apache/cxf/cxf-rt-testsupport/2.3.0-SNAPSHOT/cxf-rt-testsupport-2.3.0-SNAPSHOT.jar>
[HUDSON] Archiving <http://hudson.zones.apache.org/hudson/job/CXF-Trunk-JDK16/ws/trunk/rt/testsupport/target/cxf-rt-testsupport-2.3.0-SNAPSHOT.jar>
to /export/home/hudson/hudson/jobs/CXF-Trunk-JDK16/modules/org.apache.cxf$cxf-rt-testsupport/builds/2010-01-16_05-03-28/archive/org.apache.cxf/cxf-rt-testsupport/2.3.0-SNAPSHOT/cxf-rt-testsupport-2.3.0-SNAPSHOT.jar
[INFO] ------------------------------------------------------------------------
[INFO] Building Apache CXF Runtime Aegis Databinding
[INFO]    task-segment: [clean, install]
[INFO] ------------------------------------------------------------------------
[INFO] [clean:clean]
[INFO] Deleting file set: <http://hudson.zones.apache.org/hudson/job/CXF-Trunk-JDK16/ws/trunk/rt/databinding/aegis/target>
(included: [**], excluded: [])
[INFO] [checkstyle:checkstyle {execution: validate}]
[INFO] Starting audit...
Audit done.

[INFO] Preparing pmd:check
[HUDSON] Archiving <http://hudson.zones.apache.org/hudson/job/CXF-Trunk-JDK16/ws/trunk/rt/databinding/aegis/pom.xml>
to /export/home/hudson/hudson/jobs/CXF-Trunk-JDK16/modules/org.apache.cxf$cxf-rt-databinding-aegis/builds/2010-01-16_05-03-28/archive/org.apache.cxf/cxf-rt-databinding-aegis/2.3.0-SNAPSHOT/pom.xml
[INFO] [pmd:pmd]
[INFO] [pmd:check {execution: validate}]
[INFO] 
[INFO] [cxf-xml2fastinfoset:xml2fastinfoset {execution: xml2fastinfoset}]
[INFO] [build-helper:add-source {execution: add-source}]
[INFO] Source directory: <http://hudson.zones.apache.org/hudson/job/CXF-Trunk-JDK16/ws/trunk/rt/databinding/aegis/src/main/generated>
added.
[INFO] [remote-resources:process {execution: default}]
[INFO] [resources:resources]
[INFO] Using 'UTF-8' encoding to copy filtered resources.
[INFO] Copying 3 resources
[INFO] Copying 3 resources
[INFO] skip non existing resourceDirectory <http://hudson.zones.apache.org/hudson/job/CXF-Trunk-JDK16/ws/trunk/rt/databinding/aegis/src/main/resources-filtered>
[INFO] skip non existing resourceDirectory <http://hudson.zones.apache.org/hudson/job/CXF-Trunk-JDK16/ws/trunk/rt/databinding/aegis/target/generated/src/main/resources>
[INFO] Copying 3 resources
[INFO] [compiler:compile]
[INFO] Compiling 117 source files to <http://hudson.zones.apache.org/hudson/job/CXF-Trunk-JDK16/ws/trunk/rt/databinding/aegis/target/classes>
[INFO] [resources:testResources]
[INFO] Using 'UTF-8' encoding to copy filtered resources.
[INFO] Copying 84 resources
[INFO] Copying 5 resources
[INFO] skip non existing resourceDirectory <http://hudson.zones.apache.org/hudson/job/CXF-Trunk-JDK16/ws/trunk/rt/databinding/aegis/target/generated/src/test/resources>
[INFO] Copying 3 resources
[INFO] [compiler:testCompile]
[INFO] Compiling 187 source files to <http://hudson.zones.apache.org/hudson/job/CXF-Trunk-JDK16/ws/trunk/rt/databinding/aegis/target/test-classes>
[INFO] [surefire:test]
[INFO] Surefire report directory: <http://hudson.zones.apache.org/hudson/job/CXF-Trunk-JDK16/ws/trunk/rt/databinding/aegis/target/surefire-reports>

-------------------------------------------------------
 T E S T S
-------------------------------------------------------
Running org.apache.cxf.aegis.namespaces.NamespaceConfusionTest
Tests run: 1, Failures: 0, Errors: 0, Skipped: 0, Time elapsed: 1.016 sec
Running org.apache.cxf.aegis.type.java5.map.StudentTest
Tests run: 4, Failures: 0, Errors: 0, Skipped: 0, Time elapsed: 0.642 sec
Running org.apache.cxf.aegis.type.java5.JaxbTypeTest
Tests run: 7, Failures: 0, Errors: 0, Skipped: 0, Time elapsed: 0.399 sec
Running org.apache.cxf.aegis.type.java5.XFireXmlParamTypeTest
Tests run: 2, Failures: 0, Errors: 0, Skipped: 0, Time elapsed: 0.089 sec
Running org.apache.cxf.aegis.type.encoded.ArrayTypeInfoTest
Tests run: 1, Failures: 0, Errors: 0, Skipped: 0, Time elapsed: 0.046 sec
Running org.apache.cxf.aegis.client.ClientServiceConfigTest
Tests run: 2, Failures: 0, Errors: 0, Skipped: 0, Time elapsed: 0.344 sec
Running org.apache.cxf.aegis.xml.stax.ReaderTest
Tests run: 1, Failures: 0, Errors: 0, Skipped: 0, Time elapsed: 0.238 sec
Running org.apache.cxf.aegis.inheritance.intf.InterfaceInheritanceTest
Tests run: 1, Failures: 0, Errors: 0, Skipped: 0, Time elapsed: 0.136 sec
Running org.apache.cxf.aegis.integration.DOMMappingTest
Tests run: 3, Failures: 0, Errors: 0, Skipped: 0, Time elapsed: 0.16 sec
Running org.apache.cxf.aegis.type.streams.XMLStreamReaderMappingTest
Tests run: 1, Failures: 0, Errors: 0, Skipped: 0, Time elapsed: 0.028 sec
Running org.apache.cxf.aegis.jaxws.AegisJaxwsGetTest
Tests run: 2, Failures: 0, Errors: 0, Skipped: 0, Time elapsed: 0.668 sec
Running org.apache.cxf.aegis.standalone.StandaloneReadTest
Tests run: 4, Failures: 0, Errors: 0, Skipped: 0, Time elapsed: 0.037 sec
Running org.apache.cxf.aegis.type.encoded.StructTypeTest
Tests run: 3, Failures: 0, Errors: 0, Skipped: 0, Time elapsed: 0.13 sec
Running org.apache.cxf.aegis.xml.stax.WriterTest
Tests run: 1, Failures: 0, Errors: 0, Skipped: 0, Time elapsed: 0.08 sec
Running org.apache.cxf.aegis.type.java5.CollectionTest
Tests run: 11, Failures: 0, Errors: 0, Skipped: 0, Time elapsed: 0.72 sec
Running org.apache.cxf.aegis.type.basic.ByteDataTest
Tests run: 1, Failures: 0, Errors: 0, Skipped: 0, Time elapsed: 0.079 sec
Running org.apache.cxf.aegis.integration.WrappedTest
Tests run: 7, Failures: 0, Errors: 0, Skipped: 1, Time elapsed: 1.237 sec
Running org.apache.cxf.aegis.type.java5.AnnotatedTypeTest
Tests run: 7, Failures: 0, Errors: 0, Skipped: 0, Time elapsed: 0.28 sec
Running org.apache.cxf.aegis.type.java5.XmlParamTypeTest
Tests run: 2, Failures: 0, Errors: 0, Skipped: 0, Time elapsed: 0.059 sec
Running org.apache.cxf.aegis.type.java5.EnumTypeTest
Tests run: 8, Failures: 0, Errors: 0, Skipped: 0, Time elapsed: 0.201 sec
Running org.apache.cxf.aegis.standalone.SchemaAddinsTest
Tests run: 1, Failures: 0, Errors: 0, Skipped: 0, Time elapsed: 0.008 sec
Running org.apache.cxf.aegis.type.basic.DateTimezoneTest
Tests run: 2, Failures: 0, Errors: 0, Skipped: 0, Time elapsed: 0.059 sec
Running org.apache.cxf.aegis.override.OverrideTypeTest
Tests run: 1, Failures: 0, Errors: 0, Skipped: 0, Time elapsed: 0.029 sec
Running org.apache.cxf.aegis.custom.CustomMappingTest
Tests run: 1, Failures: 0, Errors: 0, Skipped: 0, Time elapsed: 0.038 sec
Running org.apache.cxf.aegis.xmlconfig.NillableTest
Tests run: 1, Failures: 0, Errors: 0, Skipped: 0, Time elapsed: 0.053 sec
Running org.apache.cxf.aegis.exception.ExceptionTest
Tests run: 4, Failures: 0, Errors: 0, Skipped: 1, Time elapsed: 0.162 sec
Running org.apache.cxf.aegis.type.basic.BeanTest
Tests run: 15, Failures: 0, Errors: 0, Skipped: 0, Time elapsed: 0.617 sec
Running org.apache.cxf.aegis.type.basic.DynamicProxyTest
Tests run: 6, Failures: 0, Errors: 0, Skipped: 0, Time elapsed: 0.144 sec
Running org.apache.cxf.aegis.integration.ParameterMappingTest
Tests run: 3, Failures: 0, Errors: 0, Skipped: 0, Time elapsed: 0.454 sec
Running org.apache.cxf.aegis.type.java5.MapTest
Tests run: 6, Failures: 0, Errors: 0, Skipped: 0, Time elapsed: 0.145 sec
Running org.apache.cxf.aegis.type.java5.OperationNSTest
Tests run: 1, Failures: 0, Errors: 0, Skipped: 0, Time elapsed: 0.044 sec
Running org.apache.cxf.aegis.type.array.DuplicateArrayTest
Tests run: 1, Failures: 0, Errors: 0, Skipped: 0, Time elapsed: 0.062 sec
Running org.apache.cxf.aegis.type.java5.DualOutServiceTest
Tests run: 1, Failures: 0, Errors: 0, Skipped: 0, Time elapsed: 0.055 sec
Running org.apache.cxf.aegis.type.basic.QualificationTest
Tests run: 4, Failures: 0, Errors: 0, Skipped: 0, Time elapsed: 0.121 sec
Running org.apache.cxf.aegis.type.basic.BadXMLTest
Tests run: 1, Failures: 0, Errors: 0, Skipped: 0, Time elapsed: 0.011 sec
Running org.apache.cxf.aegis.type.missing.MissingTypeWSDLTest
Tests run: 1, Failures: 0, Errors: 0, Skipped: 0, Time elapsed: 0.072 sec
Running org.apache.cxf.aegis.type.java5.ConfigurationTest
Tests run: 6, Failures: 0, Errors: 0, Skipped: 0, Time elapsed: 0.124 sec
Running org.apache.cxf.doclitbare.DocLitBareTest
Tests run: 1, Failures: 0, Errors: 0, Skipped: 0, Time elapsed: 0.092 sec
Running org.apache.cxf.aegis.type.TypeCreationOptionsSpringTest
Tests run: 1, Failures: 0, Errors: 0, Skipped: 0, Time elapsed: 0.446 sec
Running org.apache.cxf.aegis.services.base64.BinaryDataTest
Tests run: 1, Failures: 0, Errors: 0, Skipped: 0, Time elapsed: 0.036 sec
Running org.apache.cxf.aegis.proxy.ProxyTest
Tests run: 1, Failures: 0, Errors: 0, Skipped: 0, Time elapsed: 0.033 sec
Running org.apache.cxf.aegis.type.java5.JaxbXmlParamTypeTest
Tests run: 2, Failures: 0, Errors: 0, Skipped: 0, Time elapsed: 0.048 sec
Running org.apache.cxf.aegis.type.java5.XFireTypeTest
Tests run: 7, Failures: 0, Errors: 0, Skipped: 0, Time elapsed: 0.238 sec
Running org.apache.cxf.aegis.standalone.StandaloneWriteTest
Tests run: 4, Failures: 0, Errors: 0, Skipped: 0, Time elapsed: 0.035 sec
Running org.apache.cxf.aegis.custom.CustomBeansTest
Tests run: 1, Failures: 0, Errors: 0, Skipped: 0, Time elapsed: 0.074 sec
Running org.apache.cxf.aegis.type.encoded.SoapArrayTypeTest
Tests run: 11, Failures: 0, Errors: 0, Skipped: 0, Time elapsed: 0.399 sec
Running org.apache.cxf.aegis.type.array.FlatArrayTest
Tests run: 4, Failures: 0, Errors: 0, Skipped: 0, Time elapsed: 0.332 sec
Running org.apache.cxf.aegis.integration.SchemaValidationTest
Tests run: 1, Failures: 0, Errors: 0, Skipped: 0, Time elapsed: 0.289 sec
Running org.apache.cxf.aegis.type.map.MapsTest
Tests run: 4, Failures: 0, Errors: 0, Skipped: 1, Time elapsed: 0.33 sec
Running org.apache.cxf.aegis.inheritance.ExceptionInheritanceTest
Tests run: 1, Failures: 0, Errors: 0, Skipped: 0, Time elapsed: 0.188 sec
Running org.apache.cxf.aegis.namespaces.ExplicitPrefixTest
Tests run: 1, Failures: 0, Errors: 0, Skipped: 0, Time elapsed: 0.045 sec
Running org.apache.cxf.aegis.inheritance.InheritancePOJOTest
Tests run: 3, Failures: 0, Errors: 0, Skipped: 0, Time elapsed: 0.125 sec

Results :

Tests run: 167, Failures: 0, Errors: 0, Skipped: 3

[HUDSON] Recording test results
[locks-and-latches] Releasing all the locks
[locks-and-latches] All the locks released
ERROR: Failed to parse POMs
hudson.util.IOException2: Failed to join the process
	at hudson.Proc$RemoteProc.join(Proc.java:311)
	at hudson.maven.ProcessCache$MavenProcess.call(ProcessCache.java:164)
	at hudson.maven.MavenModuleSetBuild$RunnerImpl.doRun(MavenModuleSetBuild.java:480)
	at hudson.model.AbstractBuild$AbstractRunner.run(AbstractBuild.java:417)
	at hudson.model.Run.run(Run.java:1179)
	at hudson.maven.MavenModuleSetBuild.run(MavenModuleSetBuild.java:304)
	at hudson.model.ResourceController.execute(ResourceController.java:88)
	at hudson.model.Executor.run(Executor.java:122)
Caused by: java.util.concurrent.ExecutionException: hudson.remoting.RequestAbortedException:
java.io.EOFException
	at hudson.remoting.Request$1.get(Request.java:218)
	at hudson.remoting.Request$1.get(Request.java:172)
	at hudson.remoting.FutureAdapter.get(FutureAdapter.java:55)
	at hudson.Proc$RemoteProc.join(Proc.java:303)
	... 7 more
Caused by: hudson.remoting.RequestAbortedException: java.io.EOFException
	at hudson.remoting.Request.abort(Request.java:257)
	at hudson.remoting.Channel.terminate(Channel.java:594)
	at hudson.remoting.Channel$ReaderThread.run(Channel.java:872)
Caused by: java.io.EOFException
	at java.io.ObjectInputStream$BlockDataInputStream.peekByte(ObjectInputStream.java:2554)
	at java.io.ObjectInputStream.readObject0(ObjectInputStream.java:1297)
	at java.io.ObjectInputStream.readObject(ObjectInputStream.java:351)
	at hudson.remoting.Channel$ReaderThread.run(Channel.java:852)
FATAL: channel is already closed
hudson.remoting.ChannelClosedException: channel is already closed
	at hudson.remoting.Channel.send(Channel.java:408)
	at hudson.remoting.Request.call(Request.java:105)
	at hudson.remoting.Channel.call(Channel.java:547)
	at hudson.Launcher$RemoteLauncher.kill(Launcher.java:734)
	at hudson.model.AbstractBuild$AbstractRunner.run(AbstractBuild.java:422)
	at hudson.model.Run.run(Run.java:1179)
	at hudson.maven.MavenModuleSetBuild.run(MavenModuleSetBuild.java:304)
	at hudson.model.ResourceController.execute(ResourceController.java:88)
	at hudson.model.Executor.run(Executor.java:122)


Mime
View raw message