cxf-notifications mailing list archives

Site index · List index
Message view « Date » · « Thread »
Top « Date » · « Thread »
From Apache Hudson Server <hud...@hudson.zones.apache.org>
Subject Build failed in Hudson: CXF-Trunk-JDK15 #1092
Date Sat, 13 Feb 2010 23:38:53 GMT
See <http://hudson.zones.apache.org/hudson/job/CXF-Trunk-JDK15/1092/changes>

Changes:

[cleclerc] [CXF-2672] Enhance CXF client message in case of HttpRetryException (http codes
401 and 407)

------------------------------------------
[...truncated 1345 lines...]
Tests run: 1, Failures: 0, Errors: 0, Skipped: 0, Time elapsed: 0.164 sec
Running org.apache.cxf.binding.soap.MustUnderstandInterceptorTest
Tests run: 4, Failures: 0, Errors: 0, Skipped: 0, Time elapsed: 0.449 sec
Running org.apache.cxf.binding.soap.interceptor.SoapFaultSerializerTest
Tests run: 4, Failures: 0, Errors: 0, Skipped: 0, Time elapsed: 0.148 sec
Running org.apache.cxf.binding.soap.SoapBindingFactoryTest
Tests run: 3, Failures: 0, Errors: 0, Skipped: 0, Time elapsed: 0.103 sec
Running org.apache.cxf.binding.soap.RPCInInterceptorTest
Tests run: 2, Failures: 0, Errors: 0, Skipped: 0, Time elapsed: 0.362 sec
Running org.apache.cxf.binding.soap.jms.interceptor.SoapFaultFactoryTest
Tests run: 2, Failures: 0, Errors: 0, Skipped: 0, Time elapsed: 0.198 sec
Running org.apache.cxf.binding.soap.RPCOutInterceptorTest
Tests run: 2, Failures: 0, Errors: 0, Skipped: 0, Time elapsed: 0.06 sec
Running org.apache.cxf.binding.soap.SoapBindingTest
Tests run: 1, Failures: 0, Errors: 0, Skipped: 0, Time elapsed: 0.004 sec
Running org.apache.cxf.binding.soap.saaj.SAAJInInterceptorTest
Tests run: 2, Failures: 0, Errors: 0, Skipped: 0, Time elapsed: 0.113 sec
Running org.apache.cxf.binding.soap.SoapActionInterceptorTest
Tests run: 1, Failures: 0, Errors: 0, Skipped: 0, Time elapsed: 0.006 sec
Running org.apache.cxf.binding.soap.ServiceModelUtilTest
Tests run: 1, Failures: 0, Errors: 0, Skipped: 0, Time elapsed: 0.014 sec
Running org.apache.cxf.binding.soap.tcp.TCPConduitTest
Tests run: 1, Failures: 0, Errors: 0, Skipped: 1, Time elapsed: 0.004 sec
Running org.apache.cxf.binding.soap.SoapOutInterceptorTest
Tests run: 2, Failures: 0, Errors: 0, Skipped: 0, Time elapsed: 0.015 sec
Running org.apache.cxf.binding.soap.ReadHeaderInterceptorTest
Tests run: 3, Failures: 0, Errors: 0, Skipped: 0, Time elapsed: 0.011 sec

Results :

Tests run: 29, Failures: 0, Errors: 0, Skipped: 1

[HUDSON] Recording test results
[INFO] [jar:jar {execution: default-jar}]
[INFO] Building jar: <http://hudson.zones.apache.org/hudson/job/CXF-Trunk-JDK15/ws/trunk/rt/bindings/soap/target/cxf-rt-bindings-soap-2.3.0-SNAPSHOT.jar>
[INFO] [install:install {execution: default-install}]
[INFO] Installing <http://hudson.zones.apache.org/hudson/job/CXF-Trunk-JDK15/ws/trunk/rt/bindings/soap/target/cxf-rt-bindings-soap-2.3.0-SNAPSHOT.jar>
to <http://hudson.zones.apache.org/hudson/job/CXF-Trunk-JDK15/ws/.repository/org/apache/cxf/cxf-rt-bindings-soap/2.3.0-SNAPSHOT/cxf-rt-bindings-soap-2.3.0-SNAPSHOT.jar>
[HUDSON] Archiving <http://hudson.zones.apache.org/hudson/job/CXF-Trunk-JDK15/ws/trunk/rt/bindings/soap/target/cxf-rt-bindings-soap-2.3.0-SNAPSHOT.jar>
to /export/home/hudson/hudson/jobs/CXF-Trunk-JDK15/modules/org.apache.cxf$cxf-rt-bindings-soap/builds/2010-02-13_23-32-02/archive/org.apache.cxf/cxf-rt-bindings-soap/2.3.0-SNAPSHOT/cxf-rt-bindings-soap-2.3.0-SNAPSHOT.jar
[INFO] ------------------------------------------------------------------------
[INFO] Building Apache CXF Runtime Local Transport
[INFO]    task-segment: [clean, install]
[INFO] ------------------------------------------------------------------------
[INFO] [clean:clean {execution: default-clean}]
[INFO] Deleting file set: <http://hudson.zones.apache.org/hudson/job/CXF-Trunk-JDK15/ws/trunk/rt/transports/local/target>
(included: [**], excluded: [])
[INFO] [checkstyle:checkstyle {execution: validate}]
[INFO] Starting audit...
Audit done.

[INFO] Preparing pmd:check
[HUDSON] Archiving <http://hudson.zones.apache.org/hudson/job/CXF-Trunk-JDK15/ws/trunk/rt/transports/local/pom.xml>
to /export/home/hudson/hudson/jobs/CXF-Trunk-JDK15/modules/org.apache.cxf$cxf-rt-transports-local/builds/2010-02-13_23-32-02/archive/org.apache.cxf/cxf-rt-transports-local/2.3.0-SNAPSHOT/pom.xml
[INFO] [pmd:pmd {execution: pmd}]
[INFO] [pmd:check {execution: validate}]
[INFO] 
[INFO] [cxf-xml2fastinfoset:xml2fastinfoset {execution: xml2fastinfoset}]
[INFO] [remote-resources:process {execution: default}]
[INFO] [resources:resources {execution: default-resources}]
[INFO] Using 'UTF-8' encoding to copy filtered resources.
[INFO] Copying 1 resource
[INFO] Copying 2 resources
[INFO] skip non existing resourceDirectory <http://hudson.zones.apache.org/hudson/job/CXF-Trunk-JDK15/ws/trunk/rt/transports/local/src/main/resources-filtered>
[INFO] Copying 1 resource
[INFO] Copying 3 resources
[INFO] [compiler:compile {execution: default-compile}]
[INFO] Compiling 3 source files to <http://hudson.zones.apache.org/hudson/job/CXF-Trunk-JDK15/ws/trunk/rt/transports/local/target/classes>
[INFO] [resources:testResources {execution: default-testResources}]
[INFO] Using 'UTF-8' encoding to copy filtered resources.
[INFO] Copying 0 resource
[INFO] skip non existing resourceDirectory <http://hudson.zones.apache.org/hudson/job/CXF-Trunk-JDK15/ws/trunk/rt/transports/local/src/test/resources>
[INFO] skip non existing resourceDirectory <http://hudson.zones.apache.org/hudson/job/CXF-Trunk-JDK15/ws/trunk/rt/transports/local/target/generated/src/test/resources>
[INFO] Copying 3 resources
[INFO] [compiler:testCompile {execution: default-testCompile}]
[INFO] Compiling 1 source file to <http://hudson.zones.apache.org/hudson/job/CXF-Trunk-JDK15/ws/trunk/rt/transports/local/target/test-classes>
[INFO] [surefire:test {execution: default-test}]
[INFO] Surefire report directory: <http://hudson.zones.apache.org/hudson/job/CXF-Trunk-JDK15/ws/trunk/rt/transports/local/target/surefire-reports>

-------------------------------------------------------
 T E S T S
-------------------------------------------------------
Running org.apache.cxf.transport.local.LocalTransportFactoryTest
Tests run: 2, Failures: 0, Errors: 0, Skipped: 0, Time elapsed: 0.115 sec

Results :

Tests run: 2, Failures: 0, Errors: 0, Skipped: 0

[HUDSON] Recording test results
[INFO] [jar:jar {execution: default-jar}]
[INFO] Building jar: <http://hudson.zones.apache.org/hudson/job/CXF-Trunk-JDK15/ws/trunk/rt/transports/local/target/cxf-rt-transports-local-2.3.0-SNAPSHOT.jar>
[INFO] [install:install {execution: default-install}]
[INFO] Installing <http://hudson.zones.apache.org/hudson/job/CXF-Trunk-JDK15/ws/trunk/rt/transports/local/target/cxf-rt-transports-local-2.3.0-SNAPSHOT.jar>
to <http://hudson.zones.apache.org/hudson/job/CXF-Trunk-JDK15/ws/.repository/org/apache/cxf/cxf-rt-transports-local/2.3.0-SNAPSHOT/cxf-rt-transports-local-2.3.0-SNAPSHOT.jar>
[HUDSON] Archiving <http://hudson.zones.apache.org/hudson/job/CXF-Trunk-JDK15/ws/trunk/rt/transports/local/target/cxf-rt-transports-local-2.3.0-SNAPSHOT.jar>
to /export/home/hudson/hudson/jobs/CXF-Trunk-JDK15/modules/org.apache.cxf$cxf-rt-transports-local/builds/2010-02-13_23-32-02/archive/org.apache.cxf/cxf-rt-transports-local/2.3.0-SNAPSHOT/cxf-rt-transports-local-2.3.0-SNAPSHOT.jar
[INFO] ------------------------------------------------------------------------
[INFO] Building Apache CXF Runtime Simple Frontend
[INFO]    task-segment: [clean, install]
[INFO] ------------------------------------------------------------------------
[INFO] [clean:clean {execution: default-clean}]
[INFO] Deleting file set: <http://hudson.zones.apache.org/hudson/job/CXF-Trunk-JDK15/ws/trunk/rt/frontend/simple/target>
(included: [**], excluded: [])
[INFO] [checkstyle:checkstyle {execution: validate}]
[INFO] Starting audit...
Audit done.

[INFO] Preparing pmd:check
[HUDSON] Archiving <http://hudson.zones.apache.org/hudson/job/CXF-Trunk-JDK15/ws/trunk/rt/frontend/simple/pom.xml>
to /export/home/hudson/hudson/jobs/CXF-Trunk-JDK15/modules/org.apache.cxf$cxf-rt-frontend-simple/builds/2010-02-13_23-32-02/archive/org.apache.cxf/cxf-rt-frontend-simple/2.3.0-SNAPSHOT/pom.xml
[INFO] [pmd:pmd {execution: pmd}]
[INFO] [pmd:check {execution: validate}]
[INFO] 
[INFO] [cxf-xml2fastinfoset:xml2fastinfoset {execution: xml2fastinfoset}]
[INFO] [remote-resources:process {execution: default}]
[INFO] [resources:resources {execution: default-resources}]
[INFO] Using 'UTF-8' encoding to copy filtered resources.
[INFO] Copying 2 resources
[INFO] Copying 3 resources
[INFO] skip non existing resourceDirectory <http://hudson.zones.apache.org/hudson/job/CXF-Trunk-JDK15/ws/trunk/rt/frontend/simple/src/main/resources-filtered>
[INFO] skip non existing resourceDirectory <http://hudson.zones.apache.org/hudson/job/CXF-Trunk-JDK15/ws/trunk/rt/frontend/simple/target/generated/src/main/resources>
[INFO] Copying 3 resources
[INFO] [compiler:compile {execution: default-compile}]
[INFO] Compiling 16 source files to <http://hudson.zones.apache.org/hudson/job/CXF-Trunk-JDK15/ws/trunk/rt/frontend/simple/target/classes>
[INFO] [resources:testResources {execution: default-testResources}]
[INFO] Using 'UTF-8' encoding to copy filtered resources.
[INFO] Copying 7 resources
[INFO] skip non existing resourceDirectory <http://hudson.zones.apache.org/hudson/job/CXF-Trunk-JDK15/ws/trunk/rt/frontend/simple/src/test/resources>
[INFO] skip non existing resourceDirectory <http://hudson.zones.apache.org/hudson/job/CXF-Trunk-JDK15/ws/trunk/rt/frontend/simple/target/generated/src/test/resources>
[INFO] Copying 3 resources
[INFO] [compiler:testCompile {execution: default-testCompile}]
[INFO] Compiling 11 source files to <http://hudson.zones.apache.org/hudson/job/CXF-Trunk-JDK15/ws/trunk/rt/frontend/simple/target/test-classes>
[INFO] [surefire:test {execution: default-test}]
[INFO] Surefire report directory: <http://hudson.zones.apache.org/hudson/job/CXF-Trunk-JDK15/ws/trunk/rt/frontend/simple/target/surefire-reports>

-------------------------------------------------------
 T E S T S
-------------------------------------------------------
Running org.apache.cxf.frontend.spring.SpringBeansTest
Tests run: 2, Failures: 0, Errors: 0, Skipped: 0, Time elapsed: 1.85 sec
Running org.apache.cxf.frontend.soap.SoapBindingSelectionTest
Tests run: 1, Failures: 0, Errors: 0, Skipped: 0, Time elapsed: 0.182 sec
Running org.apache.cxf.service.factory.ClientFactoryBeanTest
Tests run: 2, Failures: 0, Errors: 0, Skipped: 0, Time elapsed: 0.408 sec
Running org.apache.cxf.frontend.spring.ClientServerTest
Tests run: 1, Failures: 0, Errors: 0, Skipped: 0, Time elapsed: 0.152 sec
Running org.apache.cxf.service.factory.ServerFactoryTest
Tests run: 3, Failures: 0, Errors: 0, Skipped: 0, Time elapsed: 0.194 sec
Running org.apache.cxf.service.factory.ReflectionServiceFactoryTest
Tests run: 4, Failures: 0, Errors: 0, Skipped: 0, Time elapsed: 0.175 sec
Running org.apache.cxf.service.stax.StaxDatabindingTest
Tests run: 2, Failures: 0, Errors: 0, Skipped: 0, Time elapsed: 0.12 sec
Running org.apache.cxf.service.factory.RountripTest
Tests run: 2, Failures: 0, Errors: 0, Skipped: 0, Time elapsed: 0.189 sec

Results :

Tests run: 17, Failures: 0, Errors: 0, Skipped: 0

[HUDSON] Recording test results
[INFO] [jar:jar {execution: default-jar}]
[INFO] Building jar: <http://hudson.zones.apache.org/hudson/job/CXF-Trunk-JDK15/ws/trunk/rt/frontend/simple/target/cxf-rt-frontend-simple-2.3.0-SNAPSHOT.jar>
[INFO] [install:install {execution: default-install}]
[INFO] Installing <http://hudson.zones.apache.org/hudson/job/CXF-Trunk-JDK15/ws/trunk/rt/frontend/simple/target/cxf-rt-frontend-simple-2.3.0-SNAPSHOT.jar>
to <http://hudson.zones.apache.org/hudson/job/CXF-Trunk-JDK15/ws/.repository/org/apache/cxf/cxf-rt-frontend-simple/2.3.0-SNAPSHOT/cxf-rt-frontend-simple-2.3.0-SNAPSHOT.jar>
[HUDSON] Archiving <http://hudson.zones.apache.org/hudson/job/CXF-Trunk-JDK15/ws/trunk/rt/frontend/simple/target/cxf-rt-frontend-simple-2.3.0-SNAPSHOT.jar>
to /export/home/hudson/hudson/jobs/CXF-Trunk-JDK15/modules/org.apache.cxf$cxf-rt-frontend-simple/builds/2010-02-13_23-32-02/archive/org.apache.cxf/cxf-rt-frontend-simple/2.3.0-SNAPSHOT/cxf-rt-frontend-simple-2.3.0-SNAPSHOT.jar
[INFO] ------------------------------------------------------------------------
[INFO] Building Apache CXF Runtime HTTP Transport
[INFO]    task-segment: [clean, install]
[INFO] ------------------------------------------------------------------------
[INFO] [clean:clean {execution: default-clean}]
[INFO] Deleting file set: <http://hudson.zones.apache.org/hudson/job/CXF-Trunk-JDK15/ws/trunk/rt/transports/http/target>
(included: [**], excluded: [])
[INFO] [checkstyle:checkstyle {execution: validate}]
[INFO] Starting audit...
Audit done.

[INFO] Preparing pmd:check
[HUDSON] Archiving <http://hudson.zones.apache.org/hudson/job/CXF-Trunk-JDK15/ws/trunk/rt/transports/http/pom.xml>
to /export/home/hudson/hudson/jobs/CXF-Trunk-JDK15/modules/org.apache.cxf$cxf-rt-transports-http/builds/2010-02-13_23-32-02/archive/org.apache.cxf/cxf-rt-transports-http/2.3.0-SNAPSHOT/pom.xml
[INFO] [pmd:pmd {execution: pmd}]
[INFO] [pmd:check {execution: validate}]
[INFO] 
[INFO] [cxf-xml2fastinfoset:xml2fastinfoset {execution: xml2fastinfoset}]
[INFO] [cxf-xjc:xsdtojava {execution: generate-sources}]
[INFO] [remote-resources:process {execution: default}]
[INFO] [resources:resources {execution: default-resources}]
[INFO] Using 'UTF-8' encoding to copy filtered resources.
[INFO] Copying 6 resources
[INFO] Copying 10 resources
[INFO] skip non existing resourceDirectory <http://hudson.zones.apache.org/hudson/job/CXF-Trunk-JDK15/ws/trunk/rt/transports/http/src/main/resources-filtered>
[INFO] Copying 2 resources
[INFO] Copying 3 resources
[INFO] [compiler:compile {execution: default-compile}]
[INFO] Compiling 58 source files to <http://hudson.zones.apache.org/hudson/job/CXF-Trunk-JDK15/ws/trunk/rt/transports/http/target/classes>
[INFO] ------------------------------------------------------------------------
[ERROR] BUILD FAILURE
[INFO] ------------------------------------------------------------------------
[INFO] Compilation failure

<http://hudson.zones.apache.org/hudson/job/CXF-Trunk-JDK15/ws/trunk/rt/transports/http/src/main/java/org/apache/cxf/transport/http/HTTPConduit.java>:[2030,22]
cannot find symbol
symbol  : constructor IOException(java.lang.String,java.net.HttpRetryException)
location: class java.io.IOException

<http://hudson.zones.apache.org/hudson/job/CXF-Trunk-JDK15/ws/trunk/rt/transports/http/src/main/java/org/apache/cxf/transport/servlet/AbstractHTTPServlet.java>:[241,19]
[deprecation] getRealPath(java.lang.String) in javax.servlet.ServletRequest has been deprecated

<http://hudson.zones.apache.org/hudson/job/CXF-Trunk-JDK15/ws/trunk/rt/transports/http/src/main/java/org/apache/cxf/transport/servlet/AbstractHTTPServlet.java>:[241,19]
[deprecation] isRequestedSessionIdFromUrl() in javax.servlet.http.HttpServletRequest has been
deprecated

<http://hudson.zones.apache.org/hudson/job/CXF-Trunk-JDK15/ws/trunk/rt/transports/http/src/main/java/org/apache/cxf/transport/servlet/AbstractHTTPServlet.java>:[241,19]
[deprecation] getRealPath(java.lang.String) in javax.servlet.ServletRequest has been deprecated


[INFO] ------------------------------------------------------------------------
[INFO] Trace
org.apache.maven.BuildFailureException: Compilation failure
	at org.apache.maven.lifecycle.DefaultLifecycleExecutor.executeGoals(DefaultLifecycleExecutor.java:715)
	at org.apache.maven.lifecycle.DefaultLifecycleExecutor.executeGoalWithLifecycle(DefaultLifecycleExecutor.java:556)
	at org.apache.maven.lifecycle.DefaultLifecycleExecutor.executeGoal(DefaultLifecycleExecutor.java:535)
	at org.apache.maven.lifecycle.DefaultLifecycleExecutor.executeGoalAndHandleFailures(DefaultLifecycleExecutor.java:387)
	at org.apache.maven.lifecycle.DefaultLifecycleExecutor.executeTaskSegments(DefaultLifecycleExecutor.java:348)
	at org.apache.maven.lifecycle.DefaultLifecycleExecutor.execute(DefaultLifecycleExecutor.java:180)
	at org.apache.maven.lifecycle.LifecycleExecutorInterceptor.execute(LifecycleExecutorInterceptor.java:65)
	at org.apache.maven.DefaultMaven.doExecute(DefaultMaven.java:328)
	at org.apache.maven.DefaultMaven.execute(DefaultMaven.java:138)
	at org.apache.maven.cli.MavenCli.main(MavenCli.java:362)
	at sun.reflect.NativeMethodAccessorImpl.invoke0(Native Method)
	at sun.reflect.NativeMethodAccessorImpl.invoke(NativeMethodAccessorImpl.java:39)
	at sun.reflect.DelegatingMethodAccessorImpl.invoke(DelegatingMethodAccessorImpl.java:25)
	at java.lang.reflect.Method.invoke(Method.java:592)
	at org.codehaus.classworlds.Launcher.launchEnhanced(Launcher.java:315)
	at org.codehaus.classworlds.Launcher.launch(Launcher.java:255)
	at hudson.maven.agent.Main.launch(Main.java:165)
	at hudson.maven.MavenBuilder.call(MavenBuilder.java:159)
	at hudson.maven.MavenModuleSetBuild$Builder.call(MavenModuleSetBuild.java:688)
	at hudson.maven.MavenModuleSetBuild$Builder.call(MavenModuleSetBuild.java:632)
	at hudson.remoting.UserRequest.perform(UserRequest.java:104)
	at hudson.remoting.UserRequest.perform(UserRequest.java:48)
	at hudson.remoting.Request$2.run(Request.java:236)
	at java.util.concurrent.Executors$RunnableAdapter.call(Executors.java:417)
	at java.util.concurrent.FutureTask$Sync.innerRun(FutureTask.java:269)
	at java.util.concurrent.FutureTask.run(FutureTask.java:123)
	at java.util.concurrent.ThreadPoolExecutor$Worker.runTask(ThreadPoolExecutor.java:651)
	at java.util.concurrent.ThreadPoolExecutor$Worker.run(ThreadPoolExecutor.java:676)
	at java.lang.Thread.run(Thread.java:595)
Caused by: org.apache.maven.plugin.CompilationFailureException: Compilation failure
	at org.apache.maven.plugin.AbstractCompilerMojo.execute(AbstractCompilerMojo.java:516)
	at org.apache.maven.plugin.CompilerMojo.execute(CompilerMojo.java:114)
	at org.apache.maven.plugin.DefaultPluginManager.executeMojo(DefaultPluginManager.java:490)
	at hudson.maven.agent.PluginManagerInterceptor.executeMojo(PluginManagerInterceptor.java:182)
	at org.apache.maven.lifecycle.DefaultLifecycleExecutor.executeGoals(DefaultLifecycleExecutor.java:694)
	... 28 more
[INFO] ------------------------------------------------------------------------
[INFO] Total time: 6 minutes 14 seconds
[INFO] Finished at: Sat Feb 13 23:38:38 UTC 2010
[INFO] Final Memory: 92M/165M
[INFO] ------------------------------------------------------------------------
Sending e-mails to: notifications@cxf.apache.org cleclerc@apache.org
channel stopped
[locks-and-latches] Releasing all the locks
[locks-and-latches] All the locks released


Mime
View raw message