cxf-notifications mailing list archives

Site index · List index
Message view « Date » · « Thread »
Top « Date » · « Thread »
From Apache Hudson Server <hud...@hudson.zones.apache.org>
Subject Build failed in Hudson: CXF-DOSGi » Distributed OSGI Security Sample Bundle #145
Date Wed, 31 Mar 2010 21:33:31 GMT
See <http://hudson.zones.apache.org/hudson/job/CXF-DOSGi/org.apache.cxf.dosgi.samples$cxf-dosgi-ri-bundles-sample-security/145/changes>

Changes:

[sergeyb] DOSGI-67 : applying a patch on behalf of Josh Holtzman

------------------------------------------
[INFO] ------------------------------------------------------------------------
[INFO] Building Distributed OSGI Security Sample Bundle
[INFO]    task-segment: [clean, install]
[INFO] ------------------------------------------------------------------------
[INFO] [clean:clean]
Downloading: http://s3.amazonaws.com/maven.springframework.org/milestone/javax/servlet/servlet-api/2.5/servlet-api-2.5.pom
Downloading: http://repository.springsource.com/maven/bundles/release/javax/servlet/servlet-api/2.5/servlet-api-2.5.pom
Downloading: http://repository.springsource.com/maven/bundles/external/javax/servlet/servlet-api/2.5/servlet-api-2.5.pom
Downloading: http://repo1.maven.org/maven2/javax/servlet/servlet-api/2.5/servlet-api-2.5.pom
Downloading: http://s3.amazonaws.com/maven.springframework.org/milestone/javax/servlet/servlet-api/2.5/servlet-api-2.5.jar
Downloading: http://repository.springsource.com/maven/bundles/release/javax/servlet/servlet-api/2.5/servlet-api-2.5.jar
Downloading: http://repository.springsource.com/maven/bundles/external/javax/servlet/servlet-api/2.5/servlet-api-2.5.jar
Downloading: http://repo1.maven.org/maven2/javax/servlet/servlet-api/2.5/servlet-api-2.5.jar
[INFO] [remote-resources:process {execution: default}]
[INFO] [resources:resources]
[INFO] Using default encoding to copy filtered resources.
[INFO] [compiler:compile]
[INFO] Compiling 2 source files to <http://hudson.zones.apache.org/hudson/job/CXF-DOSGi/org.apache.cxf.dosgi.samples$cxf-dosgi-ri-bundles-sample-security/ws/target/classes>
[HUDSON] Archiving <http://hudson.zones.apache.org/hudson/job/CXF-DOSGi/org.apache.cxf.dosgi.samples$cxf-dosgi-ri-bundles-sample-security/ws/pom.xml>
to /export/home/hudson/hudson/jobs/CXF-DOSGi/modules/org.apache.cxf.dosgi.samples$cxf-dosgi-ri-bundles-sample-security/builds/2010-03-31_21-31-20/archive/org.apache.cxf.dosgi.samples/cxf-dosgi-ri-bundles-sample-security/1.2-SNAPSHOT/pom.xml
[INFO] ------------------------------------------------------------------------
[ERROR] BUILD FAILURE
[INFO] ------------------------------------------------------------------------
[INFO] Compilation failure
<http://hudson.zones.apache.org/hudson/job/CXF-DOSGi/org.apache.cxf.dosgi.samples$cxf-dosgi-ri-bundles-sample-security/ws/src/main/java/org/apache/cxf/dosgi/samples/security/Activator.java>:[52,83]
cannot find symbol
symbol  : class SampleSecurityFilter
location: class org.apache.cxf.dosgi.samples.security.Activator



<http://hudson.zones.apache.org/hudson/job/CXF-DOSGi/org.apache.cxf.dosgi.samples$cxf-dosgi-ri-bundles-sample-security/ws/src/main/java/org/apache/cxf/dosgi/samples/security/Activator.java>:[52,83]
cannot find symbol
symbol  : class SampleSecurityFilter
location: class org.apache.cxf.dosgi.samples.security.Activator


[INFO] ------------------------------------------------------------------------
[INFO] Trace
org.apache.maven.BuildFailureException: Compilation failure
<http://hudson.zones.apache.org/hudson/job/CXF-DOSGi/org.apache.cxf.dosgi.samples$cxf-dosgi-ri-bundles-sample-security/ws/src/main/java/org/apache/cxf/dosgi/samples/security/Activator.java>:[52,83]
cannot find symbol
symbol  : class SampleSecurityFilter
location: class org.apache.cxf.dosgi.samples.security.Activator


	at org.apache.maven.lifecycle.DefaultLifecycleExecutor.executeGoals(DefaultLifecycleExecutor.java:580)
	at org.apache.maven.lifecycle.DefaultLifecycleExecutor.executeGoalWithLifecycle(DefaultLifecycleExecutor.java:500)
	at org.apache.maven.lifecycle.DefaultLifecycleExecutor.executeGoal(DefaultLifecycleExecutor.java:479)
	at org.apache.maven.lifecycle.DefaultLifecycleExecutor.executeGoalAndHandleFailures(DefaultLifecycleExecutor.java:331)
	at org.apache.maven.lifecycle.DefaultLifecycleExecutor.executeTaskSegments(DefaultLifecycleExecutor.java:292)
	at org.apache.maven.lifecycle.DefaultLifecycleExecutor.execute(DefaultLifecycleExecutor.java:142)
	at org.apache.maven.lifecycle.LifecycleExecutorInterceptor.execute(LifecycleExecutorInterceptor.java:65)
	at org.apache.maven.DefaultMaven.doExecute(DefaultMaven.java:336)
	at org.apache.maven.DefaultMaven.execute(DefaultMaven.java:129)
	at org.apache.maven.cli.MavenCli.main(MavenCli.java:301)
	at sun.reflect.NativeMethodAccessorImpl.invoke0(Native Method)
	at sun.reflect.NativeMethodAccessorImpl.invoke(NativeMethodAccessorImpl.java:39)
	at sun.reflect.DelegatingMethodAccessorImpl.invoke(DelegatingMethodAccessorImpl.java:25)
	at java.lang.reflect.Method.invoke(Method.java:597)
	at org.codehaus.classworlds.Launcher.launchEnhanced(Launcher.java:315)
	at org.codehaus.classworlds.Launcher.launch(Launcher.java:255)
	at hudson.maven.agent.Main.launch(Main.java:165)
	at hudson.maven.MavenBuilder.call(MavenBuilder.java:159)
	at hudson.maven.MavenModuleSetBuild$Builder.call(MavenModuleSetBuild.java:688)
	at hudson.maven.MavenModuleSetBuild$Builder.call(MavenModuleSetBuild.java:632)
	at hudson.remoting.UserRequest.perform(UserRequest.java:104)
	at hudson.remoting.UserRequest.perform(UserRequest.java:48)
	at hudson.remoting.Request$2.run(Request.java:236)
	at java.util.concurrent.Executors$RunnableAdapter.call(Executors.java:441)
	at java.util.concurrent.FutureTask$Sync.innerRun(FutureTask.java:303)
	at java.util.concurrent.FutureTask.run(FutureTask.java:138)
	at java.util.concurrent.ThreadPoolExecutor$Worker.runTask(ThreadPoolExecutor.java:886)
	at java.util.concurrent.ThreadPoolExecutor$Worker.run(ThreadPoolExecutor.java:908)
	at java.lang.Thread.run(Thread.java:619)
Caused by: org.apache.maven.plugin.CompilationFailureException: Compilation failure
<http://hudson.zones.apache.org/hudson/job/CXF-DOSGi/org.apache.cxf.dosgi.samples$cxf-dosgi-ri-bundles-sample-security/ws/src/main/java/org/apache/cxf/dosgi/samples/security/Activator.java>:[52,83]
cannot find symbol
symbol  : class SampleSecurityFilter
location: class org.apache.cxf.dosgi.samples.security.Activator


	at org.apache.maven.plugin.AbstractCompilerMojo.execute(AbstractCompilerMojo.java:516)
	at org.apache.maven.plugin.CompilerMojo.execute(CompilerMojo.java:114)
	at org.apache.maven.plugin.DefaultPluginManager.executeMojo(DefaultPluginManager.java:453)
	at hudson.maven.agent.PluginManagerInterceptor.executeMojo(PluginManagerInterceptor.java:182)
	at org.apache.maven.lifecycle.DefaultLifecycleExecutor.executeGoals(DefaultLifecycleExecutor.java:559)
	... 28 more
[INFO] ------------------------------------------------------------------------
[INFO] Total time: 1 minute 53 seconds
[INFO] Finished at: Wed Mar 31 21:33:27 UTC 2010
[INFO] Final Memory: 122M/148M
[INFO] ------------------------------------------------------------------------


Mime
View raw message