cxf-notifications mailing list archives

Site index · List index
Message view « Date » · « Thread »
Top « Date » · « Thread »
From Apache Hudson Server <hud...@hudson.zones.apache.org>
Subject Build failed in Hudson: CXF-2.2.x-JDK15 #429
Date Tue, 25 May 2010 19:09:12 GMT
See <http://hudson.zones.apache.org/hudson/job/CXF-2.2.x-JDK15/429/changes>

Changes:

[dkulp] Merged revisions 948131 via svnmerge from 
https://svn.apache.org/repos/asf/cxf/trunk

........
  r948131 | dkulp | 2010-05-25 13:52:01 -0400 (Tue, 25 May 2010) | 1 line
  
  Turn off DTD and Entity expansion stuff in the XMLStreamReaders
........

[dkulp] Merged revisions 947948 via svnmerge from 
https://svn.apache.org/repos/asf/cxf/trunk

........
  r947948 | ema | 2010-05-25 03:15:51 -0400 (Tue, 25 May 2010) | 1 line
  
  [CXF-2822]:Added the interceptors in ClientFactoryBean to ClientIml. This made <jaxws:client>
configuration work for dispatch client
........

[dkulp] Merged revisions 947878 via svnmerge from 
https://svn.apache.org/repos/asf/cxf/trunk

........
  r947878 | dkulp | 2010-05-24 20:42:56 -0400 (Mon, 24 May 2010) | 2 lines
  
  WS-Addressing spec, section 4.4.4 dictates how the fault action should
  be generated.   We were not doing it correctly
........

[dkulp] Merged revisions 947793 via svnmerge from 
https://svn.apache.org/repos/asf/cxf/trunk

........
  r947793 | dkulp | 2010-05-24 16:28:52 -0400 (Mon, 24 May 2010) | 2 lines
  
  Add some validation when only anonymous or only non-anonymous addressing
  it required.
........

[dkulp] Merged revisions 946968 via svnmerge from 
https://svn.apache.org/repos/asf/cxf/trunk

........
  r946968 | ema | 2010-05-21 06:40:14 -0400 (Fri, 21 May 2010) | 1 line
  
  [CXF-2819]:Added the lines wrongly deleted in previous commit
........

[dkulp] Merged revisions 946963 via svnmerge from 
https://svn.apache.org/repos/asf/cxf/trunk

........
  r946963 | ema | 2010-05-21 06:08:13 -0400 (Fri, 21 May 2010) | 1 line
  
  [CXF-2819]:Modified the bindingID to SOAP12HTTPBinding when the SOAP12Binding transportid
from wsdl is http://schemas.xmlsoap.org/soap/http
........

[dkulp] Merged revisions 946960 via svnmerge from 
https://svn.apache.org/repos/asf/cxf/trunk

........
  r946960 | ema | 2010-05-21 05:53:18 -0400 (Fri, 21 May 2010) | 1 line
  
  [CXF-2788]:Close all the connection when bus shutdown
........

[dkulp] Merged revisions 946825 via svnmerge from 
https://svn.apache.org/repos/asf/cxf/trunk

........
  r946825 | dkulp | 2010-05-20 19:34:52 -0400 (Thu, 20 May 2010) | 1 line
  
  Fix broken tests
........

[dkulp] Merged revisions 946824 via svnmerge from 
https://svn.apache.org/repos/asf/cxf/trunk

........
  r946824 | dkulp | 2010-05-20 19:34:31 -0400 (Thu, 20 May 2010) | 1 line
  
  If the action is empty, don't output an annotation
........

[dkulp] Merged revisions 946823 via svnmerge from 
https://svn.apache.org/repos/asf/cxf/trunk

........
  r946823 | dkulp | 2010-05-20 19:34:15 -0400 (Thu, 20 May 2010) | 2 lines
  
  JAX-WS 2.2 spec mandates use of addressing metadata spec.   Add those
  extensors along with the older extensors
........

[dkulp] Merged revisions 946821 via svnmerge from 
https://svn.apache.org/repos/asf/cxf/trunk

........
  r946821 | dkulp | 2010-05-20 19:33:50 -0400 (Thu, 20 May 2010) | 1 line
  
  Remove a println inadvertantly left in
........

[dkulp] Merged revisions 946820 via svnmerge from 
https://svn.apache.org/repos/asf/cxf/trunk

........
  r946820 | dkulp | 2010-05-20 19:33:35 -0400 (Thu, 20 May 2010) | 3 lines
  
  Section 3.3 of JAX-WS spec states final and static methods are not
  WebMethods unless the @WebMethod annotation specifically says they
  should be.
........

[dkulp] Merged revisions 946529 via svnmerge from 
https://svn.apache.org/repos/asf/cxf/trunk

........
  r946529 | gmazza | 2010-05-20 01:14:53 -0400 (Thu, 20 May 2010) | 4 lines
  
  CXF-2816 Fix: CachedOutputStream leaves behind temp files if resetOut() is called.  
  Patch by Aaron Pieper.
    
........

[dkulp] Merged revisions 946524 via svnmerge from 
https://svn.apache.org/repos/asf/cxf/trunk

........
  r946524 | gmazza | 2010-05-20 00:51:00 -0400 (Thu, 20 May 2010) | 2 lines
  
  Fixed method arguments (CXF-2806)
........

[dkulp] Merged revisions 946523 via svnmerge from 
https://svn.apache.org/repos/asf/cxf/trunk

........
  r946523 | gmazza | 2010-05-20 00:30:49 -0400 (Thu, 20 May 2010) | 2 lines
  
  Typos and grammatical errors fixed (CXF-2817)
........

[dkulp] Merged revisions 946521 via svnmerge from 
https://svn.apache.org/repos/asf/cxf/trunk

........
  r946521 | gmazza | 2010-05-20 00:19:34 -0400 (Thu, 20 May 2010) | 2 lines
  
  Misspelling fixed (CXF-2818)
........

------------------------------------------
[...truncated 2069 lines...]
[INFO] [pmd:pmd {execution: pmd}]
[INFO] [pmd:check {execution: validate}]
[INFO] 
[INFO] [cxf-xml2fastinfoset:xml2fastinfoset {execution: xml2fastinfoset}]
[INFO] [cxf-common-xsd:xsdtojava {execution: generate-sources}]
[INFO] [remote-resources:process {execution: default}]
[INFO] [resources:resources {execution: default-resources}]
[INFO] Using 'UTF-8' encoding to copy filtered resources.
[INFO] Copying 2 resources
[INFO] Copying 6 resources
[INFO] skip non existing resourceDirectory <http://hudson.zones.apache.org/hudson/job/CXF-2.2.x-JDK15/ws/2.2.x-fixes/rt/transports/http-jetty/src/main/resources-filtered>
[INFO] Copying 1 resource
[INFO] Copying 3 resources
[INFO] [compiler:compile {execution: default-compile}]
[INFO] Compiling 25 source files to <http://hudson.zones.apache.org/hudson/job/CXF-2.2.x-JDK15/ws/2.2.x-fixes/rt/transports/http-jetty/target/classes>
[INFO] [resources:testResources {execution: default-testResources}]
[INFO] Using 'UTF-8' encoding to copy filtered resources.
[INFO] Copying 9 resources
[INFO] skip non existing resourceDirectory <http://hudson.zones.apache.org/hudson/job/CXF-2.2.x-JDK15/ws/2.2.x-fixes/rt/transports/http-jetty/src/test/resources>
[INFO] skip non existing resourceDirectory <http://hudson.zones.apache.org/hudson/job/CXF-2.2.x-JDK15/ws/2.2.x-fixes/rt/transports/http-jetty/target/generated/src/test/resources>
[INFO] Copying 3 resources
[INFO] [compiler:testCompile {execution: default-testCompile}]
[INFO] Compiling 9 source files to <http://hudson.zones.apache.org/hudson/job/CXF-2.2.x-JDK15/ws/2.2.x-fixes/rt/transports/http-jetty/target/test-classes>
[WARNING] <http://hudson.zones.apache.org/hudson/job/CXF-2.2.x-JDK15/ws/2.2.x-fixes/rt/transports/http-jetty/src/test/java/org/apache/cxf/transport/http_jetty/JettyHTTPServerEngineTest.java>:[184,22]
[unchecked] unchecked conversion
found   : java.util.Set
required: java.util.Set<javax.management.ObjectName>

[WARNING] <http://hudson.zones.apache.org/hudson/job/CXF-2.2.x-JDK15/ws/2.2.x-fixes/rt/transports/http-jetty/src/test/java/org/apache/cxf/transport/http_jetty/JettyHTTPServerEngineTest.java>:[214,22]
[unchecked] unchecked conversion
found   : java.util.Set
required: java.util.Set<javax.management.ObjectName>

[WARNING] <http://hudson.zones.apache.org/hudson/job/CXF-2.2.x-JDK15/ws/2.2.x-fixes/rt/transports/http-jetty/src/test/java/org/apache/cxf/transport/http_jetty/JettyHTTPServerEngineTest.java>:[220,22]
[unchecked] unchecked conversion
found   : java.util.Set
required: java.util.Set<javax.management.ObjectName>

[WARNING] <http://hudson.zones.apache.org/hudson/job/CXF-2.2.x-JDK15/ws/2.2.x-fixes/rt/transports/http-jetty/src/test/java/org/apache/cxf/transport/http_jetty/JettyHTTPServerEngineTest.java>:[230,22]
[unchecked] unchecked conversion
found   : java.util.Set
required: java.util.Set<javax.management.ObjectName>

[WARNING] <http://hudson.zones.apache.org/hudson/job/CXF-2.2.x-JDK15/ws/2.2.x-fixes/rt/transports/http-jetty/src/test/java/org/apache/cxf/transport/http_jetty/JettyHTTPServerEngineTest.java>:[236,22]
[unchecked] unchecked conversion
found   : java.util.Set
required: java.util.Set<javax.management.ObjectName>

[INFO] [surefire:test {execution: default-test}]
[INFO] Surefire report directory: <http://hudson.zones.apache.org/hudson/job/CXF-2.2.x-JDK15/ws/2.2.x-fixes/rt/transports/http-jetty/target/surefire-reports>

-------------------------------------------------------
 T E S T S
-------------------------------------------------------
Running org.apache.cxf.transport.http_jetty.continuations.JettyContinuationProviderTest
Tests run: 2, Failures: 0, Errors: 0, Skipped: 0, Time elapsed: 0.126 sec
Running org.apache.cxf.transport.http_jetty.JettyHTTPServerEngineTest
Tests run: 8, Failures: 0, Errors: 0, Skipped: 0, Time elapsed: 1.299 sec
Running org.apache.cxf.transport.http_jetty.JettyHTTPDestinationTest
Tests run: 22, Failures: 0, Errors: 0, Skipped: 0, Time elapsed: 0.494 sec
Running org.apache.cxf.transport.http_jetty.JettyContextInspectorTest
Tests run: 1, Failures: 0, Errors: 0, Skipped: 0, Time elapsed: 0.089 sec
Running org.apache.cxf.transport.http_jetty.JettyHTTPServerEngineFactoryTest
Tests run: 3, Failures: 0, Errors: 0, Skipped: 0, Time elapsed: 1.384 sec
Running org.apache.cxf.transport.http_jetty.continuations.JettyContinuationWrapperTest
Tests run: 1, Failures: 0, Errors: 0, Skipped: 0, Time elapsed: 0.004 sec
Running org.apache.cxf.transport.http_jetty.spring.BeanDefinitionParsersTest
Tests run: 1, Failures: 0, Errors: 0, Skipped: 1, Time elapsed: 0.005 sec
Running org.apache.cxf.transport.http_jetty.spring.ApplicationContextTest
Tests run: 3, Failures: 0, Errors: 0, Skipped: 0, Time elapsed: 0.935 sec

Results :

Tests run: 41, Failures: 0, Errors: 0, Skipped: 1

[HUDSON] Recording test results
[INFO] [jar:jar {execution: default-jar}]
[INFO] Building jar: <http://hudson.zones.apache.org/hudson/job/CXF-2.2.x-JDK15/ws/2.2.x-fixes/rt/transports/http-jetty/target/cxf-rt-transports-http-jetty-2.2.9-SNAPSHOT.jar>
[INFO] [install:install {execution: default-install}]
[INFO] Installing <http://hudson.zones.apache.org/hudson/job/CXF-2.2.x-JDK15/ws/2.2.x-fixes/rt/transports/http-jetty/target/cxf-rt-transports-http-jetty-2.2.9-SNAPSHOT.jar>
to <http://hudson.zones.apache.org/hudson/job/CXF-2.2.x-JDK15/ws/.repository/org/apache/cxf/cxf-rt-transports-http-jetty/2.2.9-SNAPSHOT/cxf-rt-transports-http-jetty-2.2.9-SNAPSHOT.jar>
[HUDSON] Archiving <http://hudson.zones.apache.org/hudson/job/CXF-2.2.x-JDK15/ws/2.2.x-fixes/rt/transports/http-jetty/target/cxf-rt-transports-http-jetty-2.2.9-SNAPSHOT.jar>
to /export/home/hudson/hudson/jobs/CXF-2.2.x-JDK15/modules/org.apache.cxf$cxf-rt-transports-http-jetty/builds/2010-05-25_18-59-50/archive/org.apache.cxf/cxf-rt-transports-http-jetty/2.2.9-SNAPSHOT/cxf-rt-transports-http-jetty-2.2.9-SNAPSHOT.jar
[INFO] ------------------------------------------------------------------------
[INFO] Building Apache CXF Runtime WS Addressing
[INFO]    task-segment: [clean, install]
[INFO] ------------------------------------------------------------------------
[INFO] [clean:clean {execution: default-clean}]
[INFO] Deleting <http://hudson.zones.apache.org/hudson/job/CXF-2.2.x-JDK15/ws/2.2.x-fixes/rt/ws/addr/target>
[INFO] [checkstyle:checkstyle {execution: validate}]
[INFO] Starting audit...
Audit done.

[INFO] Preparing pmd:check
[HUDSON] Archiving <http://hudson.zones.apache.org/hudson/job/CXF-2.2.x-JDK15/ws/2.2.x-fixes/rt/ws/addr/pom.xml>
to /export/home/hudson/hudson/jobs/CXF-2.2.x-JDK15/modules/org.apache.cxf$cxf-rt-ws-addr/builds/2010-05-25_18-59-50/archive/org.apache.cxf/cxf-rt-ws-addr/2.2.9-SNAPSHOT/pom.xml
[INFO] [pmd:pmd {execution: pmd}]
[INFO] [pmd:check {execution: validate}]
[INFO] 
[INFO] [cxf-xml2fastinfoset:xml2fastinfoset {execution: xml2fastinfoset}]
[INFO] [remote-resources:process {execution: default}]
[INFO] [resources:resources {execution: default-resources}]
[INFO] Using 'UTF-8' encoding to copy filtered resources.
[INFO] Copying 3 resources
[INFO] Copying 7 resources
[INFO] skip non existing resourceDirectory <http://hudson.zones.apache.org/hudson/job/CXF-2.2.x-JDK15/ws/2.2.x-fixes/rt/ws/addr/src/main/resources-filtered>
[INFO] Copying 1 resource
[INFO] Copying 3 resources
[INFO] [compiler:compile {execution: default-compile}]
[INFO] Compiling 15 source files to <http://hudson.zones.apache.org/hudson/job/CXF-2.2.x-JDK15/ws/2.2.x-fixes/rt/ws/addr/target/classes>
[INFO] [resources:testResources {execution: default-testResources}]
[INFO] Using 'UTF-8' encoding to copy filtered resources.
[INFO] Copying 1 resource
[INFO] skip non existing resourceDirectory <http://hudson.zones.apache.org/hudson/job/CXF-2.2.x-JDK15/ws/2.2.x-fixes/rt/ws/addr/src/test/resources>
[INFO] skip non existing resourceDirectory <http://hudson.zones.apache.org/hudson/job/CXF-2.2.x-JDK15/ws/2.2.x-fixes/rt/ws/addr/target/generated/src/test/resources>
[INFO] Copying 3 resources
[INFO] [compiler:testCompile {execution: default-testCompile}]
[INFO] Compiling 6 source files to <http://hudson.zones.apache.org/hudson/job/CXF-2.2.x-JDK15/ws/2.2.x-fixes/rt/ws/addr/target/test-classes>
[INFO] [surefire:test {execution: default-test}]
[INFO] Surefire report directory: <http://hudson.zones.apache.org/hudson/job/CXF-2.2.x-JDK15/ws/2.2.x-fixes/rt/ws/addr/target/surefire-reports>

-------------------------------------------------------
 T E S T S
-------------------------------------------------------
Running org.apache.cxf.ws.addressing.AddressingBuilderImplTest
Tests run: 2, Failures: 0, Errors: 0, Skipped: 0, Time elapsed: 0.118 sec
Running org.apache.cxf.ws.addressing.soap.MAPCodecTest
Tests run: 17, Failures: 0, Errors: 0, Skipped: 0, Time elapsed: 0.475 sec
Running org.apache.cxf.ws.addressing.AddressingConstantsImplTest
Tests run: 31, Failures: 0, Errors: 0, Skipped: 0, Time elapsed: 0.044 sec
Running org.apache.cxf.ws.addressing.AddressingBuilderTest
Tests run: 1, Failures: 0, Errors: 0, Skipped: 0, Time elapsed: 0.006 sec
Running org.apache.cxf.ws.addressing.MAPAggregatorTest
Tests run: 24, Failures: 0, Errors: 0, Skipped: 0, Time elapsed: 0.371 sec
Running org.apache.cxf.ws.addressing.VersionTransformerTest
Tests run: 1, Failures: 0, Errors: 0, Skipped: 0, Time elapsed: 0.429 sec

Results :

Tests run: 76, Failures: 0, Errors: 0, Skipped: 0

[HUDSON] Recording test results
[INFO] [jar:jar {execution: default-jar}]
[INFO] Building jar: <http://hudson.zones.apache.org/hudson/job/CXF-2.2.x-JDK15/ws/2.2.x-fixes/rt/ws/addr/target/cxf-rt-ws-addr-2.2.9-SNAPSHOT.jar>
[INFO] [install:install {execution: default-install}]
[INFO] Installing <http://hudson.zones.apache.org/hudson/job/CXF-2.2.x-JDK15/ws/2.2.x-fixes/rt/ws/addr/target/cxf-rt-ws-addr-2.2.9-SNAPSHOT.jar>
to <http://hudson.zones.apache.org/hudson/job/CXF-2.2.x-JDK15/ws/.repository/org/apache/cxf/cxf-rt-ws-addr/2.2.9-SNAPSHOT/cxf-rt-ws-addr-2.2.9-SNAPSHOT.jar>
[HUDSON] Archiving <http://hudson.zones.apache.org/hudson/job/CXF-2.2.x-JDK15/ws/2.2.x-fixes/rt/ws/addr/target/cxf-rt-ws-addr-2.2.9-SNAPSHOT.jar>
to /export/home/hudson/hudson/jobs/CXF-2.2.x-JDK15/modules/org.apache.cxf$cxf-rt-ws-addr/builds/2010-05-25_18-59-50/archive/org.apache.cxf/cxf-rt-ws-addr/2.2.9-SNAPSHOT/cxf-rt-ws-addr-2.2.9-SNAPSHOT.jar
[INFO] ------------------------------------------------------------------------
[INFO] Building Apache CXF Runtime JAX-WS Frontend
[INFO]    task-segment: [clean, install]
[INFO] ------------------------------------------------------------------------
[INFO] [clean:clean {execution: default-clean}]
[INFO] Deleting <http://hudson.zones.apache.org/hudson/job/CXF-2.2.x-JDK15/ws/2.2.x-fixes/rt/frontend/jaxws/target>
[INFO] [checkstyle:checkstyle {execution: validate}]
[INFO] Starting audit...
Audit done.

[INFO] Preparing pmd:check
[HUDSON] Archiving <http://hudson.zones.apache.org/hudson/job/CXF-2.2.x-JDK15/ws/2.2.x-fixes/rt/frontend/jaxws/pom.xml>
to /export/home/hudson/hudson/jobs/CXF-2.2.x-JDK15/modules/org.apache.cxf$cxf-rt-frontend-jaxws/builds/2010-05-25_18-59-50/archive/org.apache.cxf/cxf-rt-frontend-jaxws/2.2.9-SNAPSHOT/pom.xml
[INFO] [pmd:pmd {execution: pmd}]
[INFO] [pmd:check {execution: validate}]
[INFO] 
[INFO] [cxf-xml2fastinfoset:xml2fastinfoset {execution: xml2fastinfoset}]
[INFO] [build-helper:add-source {execution: add-source}]
[INFO] Source directory: <http://hudson.zones.apache.org/hudson/job/CXF-2.2.x-JDK15/ws/2.2.x-fixes/rt/frontend/jaxws/src/main/generated>
added.
[INFO] [remote-resources:process {execution: default}]
[INFO] [resources:resources {execution: default-resources}]
[INFO] Using 'UTF-8' encoding to copy filtered resources.
[INFO] Copying 10 resources
[INFO] Copying 6 resources
[INFO] skip non existing resourceDirectory <http://hudson.zones.apache.org/hudson/job/CXF-2.2.x-JDK15/ws/2.2.x-fixes/rt/frontend/jaxws/src/main/resources-filtered>
[INFO] Copying 1 resource
[INFO] Copying 3 resources
[INFO] [compiler:compile {execution: default-compile}]
[INFO] Compiling 136 source files to <http://hudson.zones.apache.org/hudson/job/CXF-2.2.x-JDK15/ws/2.2.x-fixes/rt/frontend/jaxws/target/classes>
[INFO] [resources:testResources {execution: default-testResources}]
[INFO] Using 'UTF-8' encoding to copy filtered resources.
[INFO] Copying 28 resources
[INFO] Copying 1 resource
[INFO] skip non existing resourceDirectory <http://hudson.zones.apache.org/hudson/job/CXF-2.2.x-JDK15/ws/2.2.x-fixes/rt/frontend/jaxws/target/generated/src/test/resources>
[INFO] Copying 3 resources
[INFO] [compiler:testCompile {execution: default-testCompile}]
[INFO] Compiling 80 source files to <http://hudson.zones.apache.org/hudson/job/CXF-2.2.x-JDK15/ws/2.2.x-fixes/rt/frontend/jaxws/target/test-classes>
[INFO] -------------------------------------------------------------
[ERROR] COMPILATION ERROR : 
[INFO] -------------------------------------------------------------
[ERROR] <http://hudson.zones.apache.org/hudson/job/CXF-2.2.x-JDK15/ws/2.2.x-fixes/rt/frontend/jaxws/src/test/java/org/apache/cxf/jaxws/dispatch/DispatchTest.java>:[157,30]
incompatible types
found   : java.util.List<org.apache.cxf.interceptor.Interceptor>
required: java.util.List<org.apache.cxf.interceptor.Interceptor<? extends org.apache.cxf.message.Message>>

[INFO] 1error
[INFO] -------------------------------------------------------------
[INFO] ------------------------------------------------------------------------
[ERROR] BUILD FAILURE
[INFO] ------------------------------------------------------------------------
[INFO] Compilation failure
<http://hudson.zones.apache.org/hudson/job/CXF-2.2.x-JDK15/ws/2.2.x-fixes/rt/frontend/jaxws/src/test/java/org/apache/cxf/jaxws/dispatch/DispatchTest.java>:[157,30]
incompatible types
found   : java.util.List<org.apache.cxf.interceptor.Interceptor>
required: java.util.List<org.apache.cxf.interceptor.Interceptor<? extends org.apache.cxf.message.Message>>


[INFO] ------------------------------------------------------------------------
[INFO] Trace
org.apache.maven.BuildFailureException: Compilation failure
<http://hudson.zones.apache.org/hudson/job/CXF-2.2.x-JDK15/ws/2.2.x-fixes/rt/frontend/jaxws/src/test/java/org/apache/cxf/jaxws/dispatch/DispatchTest.java>:[157,30]
incompatible types
found   : java.util.List<org.apache.cxf.interceptor.Interceptor>
required: java.util.List<org.apache.cxf.interceptor.Interceptor<? extends org.apache.cxf.message.Message>>


	at org.apache.maven.lifecycle.DefaultLifecycleExecutor.executeGoals(DefaultLifecycleExecutor.java:715)
	at org.apache.maven.lifecycle.DefaultLifecycleExecutor.executeGoalWithLifecycle(DefaultLifecycleExecutor.java:556)
	at org.apache.maven.lifecycle.DefaultLifecycleExecutor.executeGoal(DefaultLifecycleExecutor.java:535)
	at org.apache.maven.lifecycle.DefaultLifecycleExecutor.executeGoalAndHandleFailures(DefaultLifecycleExecutor.java:387)
	at org.apache.maven.lifecycle.DefaultLifecycleExecutor.executeTaskSegments(DefaultLifecycleExecutor.java:348)
	at org.apache.maven.lifecycle.DefaultLifecycleExecutor.execute(DefaultLifecycleExecutor.java:180)
	at org.apache.maven.lifecycle.LifecycleExecutorInterceptor.execute(LifecycleExecutorInterceptor.java:65)
	at org.apache.maven.DefaultMaven.doExecute(DefaultMaven.java:328)
	at org.apache.maven.DefaultMaven.execute(DefaultMaven.java:138)
	at org.apache.maven.cli.MavenCli.main(MavenCli.java:362)
	at sun.reflect.NativeMethodAccessorImpl.invoke0(Native Method)
	at sun.reflect.NativeMethodAccessorImpl.invoke(NativeMethodAccessorImpl.java:39)
	at sun.reflect.DelegatingMethodAccessorImpl.invoke(DelegatingMethodAccessorImpl.java:25)
	at java.lang.reflect.Method.invoke(Method.java:592)
	at org.codehaus.classworlds.Launcher.launchEnhanced(Launcher.java:315)
	at org.codehaus.classworlds.Launcher.launch(Launcher.java:255)
	at hudson.maven.agent.Main.launch(Main.java:165)
	at hudson.maven.MavenBuilder.call(MavenBuilder.java:159)
	at hudson.maven.MavenModuleSetBuild$Builder.call(MavenModuleSetBuild.java:688)
	at hudson.maven.MavenModuleSetBuild$Builder.call(MavenModuleSetBuild.java:632)
	at hudson.remoting.UserRequest.perform(UserRequest.java:114)
	at hudson.remoting.UserRequest.perform(UserRequest.java:48)
	at hudson.remoting.Request$2.run(Request.java:270)
	at java.util.concurrent.Executors$RunnableAdapter.call(Executors.java:417)
	at java.util.concurrent.FutureTask$Sync.innerRun(FutureTask.java:269)
	at java.util.concurrent.FutureTask.run(FutureTask.java:123)
	at java.util.concurrent.ThreadPoolExecutor$Worker.runTask(ThreadPoolExecutor.java:651)
	at java.util.concurrent.ThreadPoolExecutor$Worker.run(ThreadPoolExecutor.java:676)
	at java.lang.Thread.run(Thread.java:595)
Caused by: org.apache.maven.plugin.CompilationFailureException: Compilation failure
<http://hudson.zones.apache.org/hudson/job/CXF-2.2.x-JDK15/ws/2.2.x-fixes/rt/frontend/jaxws/src/test/java/org/apache/cxf/jaxws/dispatch/DispatchTest.java>:[157,30]
incompatible types
found   : java.util.List<org.apache.cxf.interceptor.Interceptor>
required: java.util.List<org.apache.cxf.interceptor.Interceptor<? extends org.apache.cxf.message.Message>>


	at org.apache.maven.plugin.AbstractCompilerMojo.execute(AbstractCompilerMojo.java:656)
	at org.apache.maven.plugin.TestCompilerMojo.execute(TestCompilerMojo.java:160)
	at org.apache.maven.plugin.DefaultPluginManager.executeMojo(DefaultPluginManager.java:490)
	at hudson.maven.agent.PluginManagerInterceptor.executeMojo(PluginManagerInterceptor.java:182)
	at org.apache.maven.lifecycle.DefaultLifecycleExecutor.executeGoals(DefaultLifecycleExecutor.java:694)
	... 28 more
[INFO] ------------------------------------------------------------------------
[INFO] Total time: 8 minutes 39 seconds
[INFO] Finished at: Tue May 25 19:08:40 UTC 2010
[INFO] Final Memory: 106M/196M
[INFO] ------------------------------------------------------------------------
Sending e-mails to: notifications@cxf.apache.org dkulp@apache.org
channel stopped


Mime
View raw message