cxf-notifications mailing list archives

Site index · List index
Message view « Date » · « Thread »
Top « Date » · « Thread »
From Apache Hudson Server <hud...@hudson.zones.apache.org>
Subject Build failed in Hudson: CXF-2.2.x-JDK15 #431
Date Tue, 25 May 2010 20:50:11 GMT
See <http://hudson.zones.apache.org/hudson/job/CXF-2.2.x-JDK15/431/changes>

Changes:

[dkulp] Merged revisions 948193 via svnmerge from 
https://svn.apache.org/repos/asf/cxf/trunk

........
  r948193 | dkulp | 2010-05-25 16:10:06 -0400 (Tue, 25 May 2010) | 1 line
  
  [CXF-2809] Update jaxen/abdera/activemq
........

[dkulp] Fix compile failure

------------------------------------------
[...truncated 2071 lines...]
Running org.apache.cxf.transport.servlet.ServletControllerTest
Tests run: 10, Failures: 0, Errors: 0, Skipped: 0, Time elapsed: 0.256 sec
Running org.apache.cxf.transport.http.HTTPConduitTest
Tests run: 5, Failures: 0, Errors: 0, Skipped: 0, Time elapsed: 0.047 sec
Running org.apache.cxf.transport.http.HTTPConduitURLEasyMockTest
Tests run: 14, Failures: 0, Errors: 0, Skipped: 0, Time elapsed: 0.251 sec
Running org.apache.cxf.transport.http.HTTPConduitURLConnectionTest
Tests run: 4, Failures: 0, Errors: 0, Skipped: 0, Time elapsed: 0.495 sec
Running org.apache.cxf.transport.servlet.AbstractCXFServletTest
Tests run: 7, Failures: 0, Errors: 0, Skipped: 0, Time elapsed: 0.014 sec
Running org.apache.cxf.transport.https.CertConstraintsTest
Tests run: 1, Failures: 0, Errors: 0, Skipped: 0, Time elapsed: 0.519 sec
Running org.apache.cxf.transport.http.policy.HTTPServerAssertionBuilderTest
Tests run: 3, Failures: 0, Errors: 0, Skipped: 0, Time elapsed: 0.016 sec

Results :

Tests run: 67, Failures: 0, Errors: 0, Skipped: 0

[HUDSON] Recording test results
[INFO] [jar:jar {execution: default-jar}]
[INFO] Building jar: <http://hudson.zones.apache.org/hudson/job/CXF-2.2.x-JDK15/ws/2.2.x-fixes/rt/transports/http/target/cxf-rt-transports-http-2.2.9-SNAPSHOT.jar>
[INFO] [install:install {execution: default-install}]
[INFO] Installing <http://hudson.zones.apache.org/hudson/job/CXF-2.2.x-JDK15/ws/2.2.x-fixes/rt/transports/http/target/cxf-rt-transports-http-2.2.9-SNAPSHOT.jar>
to <http://hudson.zones.apache.org/hudson/job/CXF-2.2.x-JDK15/ws/.repository/org/apache/cxf/cxf-rt-transports-http/2.2.9-SNAPSHOT/cxf-rt-transports-http-2.2.9-SNAPSHOT.jar>
[HUDSON] Archiving <http://hudson.zones.apache.org/hudson/job/CXF-2.2.x-JDK15/ws/2.2.x-fixes/rt/transports/http/target/cxf-rt-transports-http-2.2.9-SNAPSHOT.jar>
to /export/home/hudson/hudson/jobs/CXF-2.2.x-JDK15/modules/org.apache.cxf$cxf-rt-transports-http/builds/2010-05-25_20-41-45/archive/org.apache.cxf/cxf-rt-transports-http/2.2.9-SNAPSHOT/cxf-rt-transports-http-2.2.9-SNAPSHOT.jar
[INFO] ------------------------------------------------------------------------
[INFO] Building Apache CXF Runtime HTTP Jetty Transport
[INFO]    task-segment: [clean, install]
[INFO] ------------------------------------------------------------------------
[INFO] [clean:clean {execution: default-clean}]
[INFO] Deleting <http://hudson.zones.apache.org/hudson/job/CXF-2.2.x-JDK15/ws/2.2.x-fixes/rt/transports/http-jetty/target>
[INFO] [checkstyle:checkstyle {execution: validate}]
[INFO] Starting audit...
Audit done.

[INFO] Preparing pmd:check
[HUDSON] Archiving <http://hudson.zones.apache.org/hudson/job/CXF-2.2.x-JDK15/ws/2.2.x-fixes/rt/transports/http-jetty/pom.xml>
to /export/home/hudson/hudson/jobs/CXF-2.2.x-JDK15/modules/org.apache.cxf$cxf-rt-transports-http-jetty/builds/2010-05-25_20-41-45/archive/org.apache.cxf/cxf-rt-transports-http-jetty/2.2.9-SNAPSHOT/pom.xml
[INFO] [pmd:pmd {execution: pmd}]
[INFO] [pmd:check {execution: validate}]
[INFO] 
[INFO] [cxf-xml2fastinfoset:xml2fastinfoset {execution: xml2fastinfoset}]
[INFO] [cxf-common-xsd:xsdtojava {execution: generate-sources}]
[INFO] [remote-resources:process {execution: default}]
[INFO] [resources:resources {execution: default-resources}]
[INFO] Using 'UTF-8' encoding to copy filtered resources.
[INFO] Copying 2 resources
[INFO] Copying 6 resources
[INFO] skip non existing resourceDirectory <http://hudson.zones.apache.org/hudson/job/CXF-2.2.x-JDK15/ws/2.2.x-fixes/rt/transports/http-jetty/src/main/resources-filtered>
[INFO] Copying 1 resource
[INFO] Copying 3 resources
[INFO] [compiler:compile {execution: default-compile}]
[INFO] Compiling 25 source files to <http://hudson.zones.apache.org/hudson/job/CXF-2.2.x-JDK15/ws/2.2.x-fixes/rt/transports/http-jetty/target/classes>
[INFO] [resources:testResources {execution: default-testResources}]
[INFO] Using 'UTF-8' encoding to copy filtered resources.
[INFO] Copying 9 resources
[INFO] skip non existing resourceDirectory <http://hudson.zones.apache.org/hudson/job/CXF-2.2.x-JDK15/ws/2.2.x-fixes/rt/transports/http-jetty/src/test/resources>
[INFO] skip non existing resourceDirectory <http://hudson.zones.apache.org/hudson/job/CXF-2.2.x-JDK15/ws/2.2.x-fixes/rt/transports/http-jetty/target/generated/src/test/resources>
[INFO] Copying 3 resources
[INFO] [compiler:testCompile {execution: default-testCompile}]
[INFO] Compiling 9 source files to <http://hudson.zones.apache.org/hudson/job/CXF-2.2.x-JDK15/ws/2.2.x-fixes/rt/transports/http-jetty/target/test-classes>
[WARNING] <http://hudson.zones.apache.org/hudson/job/CXF-2.2.x-JDK15/ws/2.2.x-fixes/rt/transports/http-jetty/src/test/java/org/apache/cxf/transport/http_jetty/JettyHTTPServerEngineTest.java>:[184,22]
[unchecked] unchecked conversion
found   : java.util.Set
required: java.util.Set<javax.management.ObjectName>

[WARNING] <http://hudson.zones.apache.org/hudson/job/CXF-2.2.x-JDK15/ws/2.2.x-fixes/rt/transports/http-jetty/src/test/java/org/apache/cxf/transport/http_jetty/JettyHTTPServerEngineTest.java>:[214,22]
[unchecked] unchecked conversion
found   : java.util.Set
required: java.util.Set<javax.management.ObjectName>

[WARNING] <http://hudson.zones.apache.org/hudson/job/CXF-2.2.x-JDK15/ws/2.2.x-fixes/rt/transports/http-jetty/src/test/java/org/apache/cxf/transport/http_jetty/JettyHTTPServerEngineTest.java>:[220,22]
[unchecked] unchecked conversion
found   : java.util.Set
required: java.util.Set<javax.management.ObjectName>

[WARNING] <http://hudson.zones.apache.org/hudson/job/CXF-2.2.x-JDK15/ws/2.2.x-fixes/rt/transports/http-jetty/src/test/java/org/apache/cxf/transport/http_jetty/JettyHTTPServerEngineTest.java>:[230,22]
[unchecked] unchecked conversion
found   : java.util.Set
required: java.util.Set<javax.management.ObjectName>

[WARNING] <http://hudson.zones.apache.org/hudson/job/CXF-2.2.x-JDK15/ws/2.2.x-fixes/rt/transports/http-jetty/src/test/java/org/apache/cxf/transport/http_jetty/JettyHTTPServerEngineTest.java>:[236,22]
[unchecked] unchecked conversion
found   : java.util.Set
required: java.util.Set<javax.management.ObjectName>

[INFO] [surefire:test {execution: default-test}]
[INFO] Surefire report directory: <http://hudson.zones.apache.org/hudson/job/CXF-2.2.x-JDK15/ws/2.2.x-fixes/rt/transports/http-jetty/target/surefire-reports>

-------------------------------------------------------
 T E S T S
-------------------------------------------------------
Running org.apache.cxf.transport.http_jetty.continuations.JettyContinuationProviderTest
Tests run: 2, Failures: 0, Errors: 0, Skipped: 0, Time elapsed: 0.151 sec
Running org.apache.cxf.transport.http_jetty.JettyHTTPServerEngineTest
Tests run: 8, Failures: 0, Errors: 0, Skipped: 0, Time elapsed: 1.206 sec
Running org.apache.cxf.transport.http_jetty.JettyHTTPDestinationTest
Tests run: 22, Failures: 0, Errors: 0, Skipped: 0, Time elapsed: 0.499 sec
Running org.apache.cxf.transport.http_jetty.JettyContextInspectorTest
Tests run: 1, Failures: 0, Errors: 0, Skipped: 0, Time elapsed: 0.087 sec
Running org.apache.cxf.transport.http_jetty.JettyHTTPServerEngineFactoryTest
Tests run: 3, Failures: 0, Errors: 0, Skipped: 0, Time elapsed: 1.37 sec
Running org.apache.cxf.transport.http_jetty.continuations.JettyContinuationWrapperTest
Tests run: 1, Failures: 0, Errors: 0, Skipped: 0, Time elapsed: 0.005 sec
Running org.apache.cxf.transport.http_jetty.spring.BeanDefinitionParsersTest
Tests run: 1, Failures: 0, Errors: 0, Skipped: 1, Time elapsed: 0.004 sec
Running org.apache.cxf.transport.http_jetty.spring.ApplicationContextTest
Tests run: 3, Failures: 0, Errors: 0, Skipped: 0, Time elapsed: 0.895 sec

Results :

Tests run: 41, Failures: 0, Errors: 0, Skipped: 1

[HUDSON] Recording test results
[INFO] [jar:jar {execution: default-jar}]
[INFO] Building jar: <http://hudson.zones.apache.org/hudson/job/CXF-2.2.x-JDK15/ws/2.2.x-fixes/rt/transports/http-jetty/target/cxf-rt-transports-http-jetty-2.2.9-SNAPSHOT.jar>
[INFO] [install:install {execution: default-install}]
[INFO] Installing <http://hudson.zones.apache.org/hudson/job/CXF-2.2.x-JDK15/ws/2.2.x-fixes/rt/transports/http-jetty/target/cxf-rt-transports-http-jetty-2.2.9-SNAPSHOT.jar>
to <http://hudson.zones.apache.org/hudson/job/CXF-2.2.x-JDK15/ws/.repository/org/apache/cxf/cxf-rt-transports-http-jetty/2.2.9-SNAPSHOT/cxf-rt-transports-http-jetty-2.2.9-SNAPSHOT.jar>
[HUDSON] Archiving <http://hudson.zones.apache.org/hudson/job/CXF-2.2.x-JDK15/ws/2.2.x-fixes/rt/transports/http-jetty/target/cxf-rt-transports-http-jetty-2.2.9-SNAPSHOT.jar>
to /export/home/hudson/hudson/jobs/CXF-2.2.x-JDK15/modules/org.apache.cxf$cxf-rt-transports-http-jetty/builds/2010-05-25_20-41-45/archive/org.apache.cxf/cxf-rt-transports-http-jetty/2.2.9-SNAPSHOT/cxf-rt-transports-http-jetty-2.2.9-SNAPSHOT.jar
[INFO] ------------------------------------------------------------------------
[INFO] Building Apache CXF Runtime WS Addressing
[INFO]    task-segment: [clean, install]
[INFO] ------------------------------------------------------------------------
[INFO] [clean:clean {execution: default-clean}]
[INFO] Deleting <http://hudson.zones.apache.org/hudson/job/CXF-2.2.x-JDK15/ws/2.2.x-fixes/rt/ws/addr/target>
[INFO] [checkstyle:checkstyle {execution: validate}]
[INFO] Starting audit...
Audit done.

[INFO] Preparing pmd:check
[HUDSON] Archiving <http://hudson.zones.apache.org/hudson/job/CXF-2.2.x-JDK15/ws/2.2.x-fixes/rt/ws/addr/pom.xml>
to /export/home/hudson/hudson/jobs/CXF-2.2.x-JDK15/modules/org.apache.cxf$cxf-rt-ws-addr/builds/2010-05-25_20-41-45/archive/org.apache.cxf/cxf-rt-ws-addr/2.2.9-SNAPSHOT/pom.xml
[INFO] [pmd:pmd {execution: pmd}]
[INFO] [pmd:check {execution: validate}]
[INFO] 
[INFO] [cxf-xml2fastinfoset:xml2fastinfoset {execution: xml2fastinfoset}]
[INFO] [remote-resources:process {execution: default}]
[INFO] [resources:resources {execution: default-resources}]
[INFO] Using 'UTF-8' encoding to copy filtered resources.
[INFO] Copying 3 resources
[INFO] Copying 7 resources
[INFO] skip non existing resourceDirectory <http://hudson.zones.apache.org/hudson/job/CXF-2.2.x-JDK15/ws/2.2.x-fixes/rt/ws/addr/src/main/resources-filtered>
[INFO] Copying 1 resource
[INFO] Copying 3 resources
[INFO] [compiler:compile {execution: default-compile}]
[INFO] Compiling 15 source files to <http://hudson.zones.apache.org/hudson/job/CXF-2.2.x-JDK15/ws/2.2.x-fixes/rt/ws/addr/target/classes>
[INFO] [resources:testResources {execution: default-testResources}]
[INFO] Using 'UTF-8' encoding to copy filtered resources.
[INFO] Copying 1 resource
[INFO] skip non existing resourceDirectory <http://hudson.zones.apache.org/hudson/job/CXF-2.2.x-JDK15/ws/2.2.x-fixes/rt/ws/addr/src/test/resources>
[INFO] skip non existing resourceDirectory <http://hudson.zones.apache.org/hudson/job/CXF-2.2.x-JDK15/ws/2.2.x-fixes/rt/ws/addr/target/generated/src/test/resources>
[INFO] Copying 3 resources
[INFO] [compiler:testCompile {execution: default-testCompile}]
[INFO] Compiling 6 source files to <http://hudson.zones.apache.org/hudson/job/CXF-2.2.x-JDK15/ws/2.2.x-fixes/rt/ws/addr/target/test-classes>
[INFO] [surefire:test {execution: default-test}]
[INFO] Surefire report directory: <http://hudson.zones.apache.org/hudson/job/CXF-2.2.x-JDK15/ws/2.2.x-fixes/rt/ws/addr/target/surefire-reports>

-------------------------------------------------------
 T E S T S
-------------------------------------------------------
Running org.apache.cxf.ws.addressing.AddressingBuilderImplTest
Tests run: 2, Failures: 0, Errors: 0, Skipped: 0, Time elapsed: 0.089 sec
Running org.apache.cxf.ws.addressing.soap.MAPCodecTest
Tests run: 17, Failures: 0, Errors: 0, Skipped: 0, Time elapsed: 0.339 sec
Running org.apache.cxf.ws.addressing.AddressingConstantsImplTest
Tests run: 31, Failures: 0, Errors: 0, Skipped: 0, Time elapsed: 0.043 sec
Running org.apache.cxf.ws.addressing.AddressingBuilderTest
Tests run: 1, Failures: 0, Errors: 0, Skipped: 0, Time elapsed: 0.005 sec
Running org.apache.cxf.ws.addressing.MAPAggregatorTest
Tests run: 24, Failures: 0, Errors: 0, Skipped: 0, Time elapsed: 0.359 sec
Running org.apache.cxf.ws.addressing.VersionTransformerTest
Tests run: 1, Failures: 0, Errors: 0, Skipped: 0, Time elapsed: 0.428 sec

Results :

Tests run: 76, Failures: 0, Errors: 0, Skipped: 0

[HUDSON] Recording test results
[INFO] [jar:jar {execution: default-jar}]
[INFO] Building jar: <http://hudson.zones.apache.org/hudson/job/CXF-2.2.x-JDK15/ws/2.2.x-fixes/rt/ws/addr/target/cxf-rt-ws-addr-2.2.9-SNAPSHOT.jar>
[INFO] [install:install {execution: default-install}]
[INFO] Installing <http://hudson.zones.apache.org/hudson/job/CXF-2.2.x-JDK15/ws/2.2.x-fixes/rt/ws/addr/target/cxf-rt-ws-addr-2.2.9-SNAPSHOT.jar>
to <http://hudson.zones.apache.org/hudson/job/CXF-2.2.x-JDK15/ws/.repository/org/apache/cxf/cxf-rt-ws-addr/2.2.9-SNAPSHOT/cxf-rt-ws-addr-2.2.9-SNAPSHOT.jar>
[HUDSON] Archiving <http://hudson.zones.apache.org/hudson/job/CXF-2.2.x-JDK15/ws/2.2.x-fixes/rt/ws/addr/target/cxf-rt-ws-addr-2.2.9-SNAPSHOT.jar>
to /export/home/hudson/hudson/jobs/CXF-2.2.x-JDK15/modules/org.apache.cxf$cxf-rt-ws-addr/builds/2010-05-25_20-41-45/archive/org.apache.cxf/cxf-rt-ws-addr/2.2.9-SNAPSHOT/cxf-rt-ws-addr-2.2.9-SNAPSHOT.jar
[INFO] ------------------------------------------------------------------------
[INFO] Building Apache CXF Runtime JAX-WS Frontend
[INFO]    task-segment: [clean, install]
[INFO] ------------------------------------------------------------------------
[INFO] [clean:clean {execution: default-clean}]
[INFO] Deleting <http://hudson.zones.apache.org/hudson/job/CXF-2.2.x-JDK15/ws/2.2.x-fixes/rt/frontend/jaxws/target>
[INFO] [checkstyle:checkstyle {execution: validate}]
[INFO] Starting audit...
<http://hudson.zones.apache.org/hudson/job/CXF-2.2.x-JDK15/ws/2.2.x-fixes/rt/frontend/jaxws/src/test/java/org/apache/cxf/jaxws/dispatch/DispatchTest.java>:45:8:
Unused import - org.apache.cxf.message.Message.
Audit done.

[HUDSON] Archiving <http://hudson.zones.apache.org/hudson/job/CXF-2.2.x-JDK15/ws/2.2.x-fixes/rt/frontend/jaxws/pom.xml>
to /export/home/hudson/hudson/jobs/CXF-2.2.x-JDK15/modules/org.apache.cxf$cxf-rt-frontend-jaxws/builds/2010-05-25_20-41-45/archive/org.apache.cxf/cxf-rt-frontend-jaxws/2.2.9-SNAPSHOT/pom.xml
[INFO] ------------------------------------------------------------------------
[ERROR] BUILD ERROR
[INFO] ------------------------------------------------------------------------
[INFO] An error has occurred in Checkstyle report generation.

Embedded error: Failed during checkstyle execution
There are 1 checkstyle errors.
[INFO] ------------------------------------------------------------------------
[INFO] Trace
org.apache.maven.lifecycle.LifecycleExecutionException: An error has occurred in Checkstyle
report generation.
	at org.apache.maven.lifecycle.DefaultLifecycleExecutor.executeGoals(DefaultLifecycleExecutor.java:719)
	at org.apache.maven.lifecycle.DefaultLifecycleExecutor.executeGoalWithLifecycle(DefaultLifecycleExecutor.java:556)
	at org.apache.maven.lifecycle.DefaultLifecycleExecutor.executeGoal(DefaultLifecycleExecutor.java:535)
	at org.apache.maven.lifecycle.DefaultLifecycleExecutor.executeGoalAndHandleFailures(DefaultLifecycleExecutor.java:387)
	at org.apache.maven.lifecycle.DefaultLifecycleExecutor.executeTaskSegments(DefaultLifecycleExecutor.java:348)
	at org.apache.maven.lifecycle.DefaultLifecycleExecutor.execute(DefaultLifecycleExecutor.java:180)
	at org.apache.maven.lifecycle.LifecycleExecutorInterceptor.execute(LifecycleExecutorInterceptor.java:65)
	at org.apache.maven.DefaultMaven.doExecute(DefaultMaven.java:328)
	at org.apache.maven.DefaultMaven.execute(DefaultMaven.java:138)
	at org.apache.maven.cli.MavenCli.main(MavenCli.java:362)
	at sun.reflect.NativeMethodAccessorImpl.invoke0(Native Method)
	at sun.reflect.NativeMethodAccessorImpl.invoke(NativeMethodAccessorImpl.java:39)
	at sun.reflect.DelegatingMethodAccessorImpl.invoke(DelegatingMethodAccessorImpl.java:25)
	at java.lang.reflect.Method.invoke(Method.java:592)
	at org.codehaus.classworlds.Launcher.launchEnhanced(Launcher.java:315)
	at org.codehaus.classworlds.Launcher.launch(Launcher.java:255)
	at hudson.maven.agent.Main.launch(Main.java:165)
	at hudson.maven.MavenBuilder.call(MavenBuilder.java:159)
	at hudson.maven.MavenModuleSetBuild$Builder.call(MavenModuleSetBuild.java:688)
	at hudson.maven.MavenModuleSetBuild$Builder.call(MavenModuleSetBuild.java:632)
	at hudson.remoting.UserRequest.perform(UserRequest.java:114)
	at hudson.remoting.UserRequest.perform(UserRequest.java:48)
	at hudson.remoting.Request$2.run(Request.java:270)
	at java.util.concurrent.Executors$RunnableAdapter.call(Executors.java:417)
	at java.util.concurrent.FutureTask$Sync.innerRun(FutureTask.java:269)
	at java.util.concurrent.FutureTask.run(FutureTask.java:123)
	at java.util.concurrent.ThreadPoolExecutor$Worker.runTask(ThreadPoolExecutor.java:651)
	at java.util.concurrent.ThreadPoolExecutor$Worker.run(ThreadPoolExecutor.java:676)
	at java.lang.Thread.run(Thread.java:595)
Caused by: org.apache.maven.plugin.MojoExecutionException: An error has occurred in Checkstyle
report generation.
	at org.apache.maven.reporting.AbstractMavenReport.execute(AbstractMavenReport.java:83)
	at org.apache.maven.plugin.DefaultPluginManager.executeMojo(DefaultPluginManager.java:490)
	at hudson.maven.agent.PluginManagerInterceptor.executeMojo(PluginManagerInterceptor.java:182)
	at org.apache.maven.lifecycle.DefaultLifecycleExecutor.executeGoals(DefaultLifecycleExecutor.java:694)
	... 28 more
Caused by: org.apache.maven.reporting.MavenReportException: Failed during checkstyle execution
	at org.apache.maven.plugin.checkstyle.CheckstyleReport.executeReport(CheckstyleReport.java:595)
	at org.apache.maven.reporting.AbstractMavenReport.generate(AbstractMavenReport.java:131)
	at org.apache.maven.reporting.AbstractMavenReport.execute(AbstractMavenReport.java:76)
	... 31 more
Caused by: org.apache.maven.plugin.checkstyle.CheckstyleExecutorException: There are 1 checkstyle
errors.
	at org.apache.maven.plugin.checkstyle.DefaultCheckstyleExecutor.executeCheckstyle(DefaultCheckstyleExecutor.java:218)
	at org.apache.maven.plugin.checkstyle.CheckstyleReport.executeReport(CheckstyleReport.java:576)
	... 33 more
[INFO] ------------------------------------------------------------------------
[INFO] Total time: 7 minutes 45 seconds
[INFO] Finished at: Tue May 25 20:49:47 UTC 2010
[INFO] Final Memory: 114M/188M
[INFO] ------------------------------------------------------------------------
Sending e-mails to: notifications@cxf.apache.org dkulp@apache.org
channel stopped


Mime
View raw message