cxf-notifications mailing list archives

Site index · List index
Message view « Date » · « Thread »
Top « Date » · « Thread »
From Apache Hudson Server <hud...@hudson.zones.apache.org>
Subject Build failed in Hudson: CXF-trunk-deploy #348
Date Fri, 18 Jun 2010 06:03:16 GMT
See <http://hudson.zones.apache.org/hudson/job/CXF-trunk-deploy/348/changes>

Changes:

[dkulp] Set version format and allow for "in jdk" versions of various things

[dkulp] Mark some more stuff optional

------------------------------------------
Started by an SCM change
Building remotely on minerva.apache.org (Ubuntu)
Updating http://svn.apache.org/repos/asf/cxf/trunk
U         distribution/bundle/minimal/pom.xml
U         distribution/bundle/jaxrs/pom.xml
U         distribution/bundle/all/pom.xml
U         rt/transports/jbi/pom.xml
U         rt/bindings/jbi/pom.xml
At revision 955842
Parsing POMs
ERROR: Failed to parse POMs
hudson.util.IOException2: remote file operation failed: <http://hudson.zones.apache.org/hudson/job/CXF-trunk-deploy/ws/trunk>
at hudson.remoting.Channel@3810c0:minerva.apache.org (Ubuntu)
	at hudson.FilePath.act(FilePath.java:743)
	at hudson.FilePath.act(FilePath.java:729)
	at hudson.maven.MavenModuleSetBuild$RunnerImpl.parsePoms(MavenModuleSetBuild.java:531)
	at hudson.maven.MavenModuleSetBuild$RunnerImpl.doRun(MavenModuleSetBuild.java:391)
	at hudson.model.AbstractBuild$AbstractRunner.run(AbstractBuild.java:416)
	at hudson.model.Run.run(Run.java:1243)
	at hudson.maven.MavenModuleSetBuild.run(MavenModuleSetBuild.java:304)
	at hudson.model.ResourceController.execute(ResourceController.java:88)
	at hudson.model.Executor.run(Executor.java:122)
Caused by: hudson.remoting.ProxyException: hudson.maven.MavenModuleSetBuild$MavenExecutionException:
hudson.maven.MavenEmbedder$1: Failed to validate POM for project org.apache.cxf:apache-cxf
at <http://hudson.zones.apache.org/hudson/job/CXF-trunk-deploy/ws/trunk/distribution/pom.xml>
- [0]  'dependencies.dependency.version' is missing for ant:ant

	at hudson.maven.MavenModuleSetBuild$PomParser.invoke(MavenModuleSetBuild.java:880)
	at hudson.maven.MavenModuleSetBuild$PomParser.invoke(MavenModuleSetBuild.java:786)
	at hudson.FilePath$FileCallableWrapper.call(FilePath.java:2018)
	at hudson.remoting.UserRequest.perform(UserRequest.java:114)
	at hudson.remoting.UserRequest.perform(UserRequest.java:48)
	at hudson.remoting.Request$2.run(Request.java:270)
	at java.util.concurrent.Executors$RunnableAdapter.call(Executors.java:441)
	at java.util.concurrent.FutureTask$Sync.innerRun(FutureTask.java:303)
	at java.util.concurrent.FutureTask.run(FutureTask.java:138)
	at java.util.concurrent.ThreadPoolExecutor$Worker.runTask(ThreadPoolExecutor.java:886)
	at java.util.concurrent.ThreadPoolExecutor$Worker.run(ThreadPoolExecutor.java:908)
	at java.lang.Thread.run(Thread.java:619)
Caused by: hudson.remoting.ProxyException: hudson.maven.MavenEmbedder$1: Failed to validate
POM for project org.apache.cxf:apache-cxf at <http://hudson.zones.apache.org/hudson/job/CXF-trunk-deploy/ws/trunk/distribution/pom.xml>
- [0]  'dependencies.dependency.version' is missing for ant:ant

	at hudson.maven.MavenEmbedder.readProject(MavenEmbedder.java:334)
	at hudson.maven.MavenUtil.resolveModules(MavenUtil.java:226)
	at hudson.maven.MavenModuleSetBuild$PomParser.invoke(MavenModuleSetBuild.java:862)
	... 11 more
Caused by: hudson.remoting.ProxyException: org.apache.maven.project.InvalidProjectModelException:
Failed to validate POM for project org.apache.cxf:apache-cxf at <http://hudson.zones.apache.org/hudson/job/CXF-trunk-deploy/ws/trunk/distribution/pom.xml>
	at org.apache.maven.project.DefaultMavenProjectBuilder.processProjectLogic(DefaultMavenProjectBuilder.java:1108)
	at org.apache.maven.project.DefaultMavenProjectBuilder.buildInternal(DefaultMavenProjectBuilder.java:878)
	at org.apache.maven.project.DefaultMavenProjectBuilder.buildFromSourceFileInternal(DefaultMavenProjectBuilder.java:506)
	at org.apache.maven.project.DefaultMavenProjectBuilder.build(DefaultMavenProjectBuilder.java:215)
	at hudson.maven.MavenEmbedder.readProject(MavenEmbedder.java:332)
	... 13 more


Mime
View raw message