cxf-notifications mailing list archives

Site index · List index
Message view « Date » · « Thread »
Top « Date » · « Thread »
From Apache Hudson Server <hud...@hudson.zones.apache.org>
Subject Build failed in Hudson: CXF-Trunk-JDK15 #1301
Date Thu, 22 Jul 2010 20:45:44 GMT
See <http://hudson.zones.apache.org/hudson/job/CXF-Trunk-JDK15/1301/changes>

Changes:

[dvaleri] [CXF-2906] Added cache abstraction and configuration options for WS-A MessageID
caching and uniqueness enforcement.

------------------------------------------
[...truncated 1313 lines...]
[INFO] Compiling 13 source files to <http://hudson.zones.apache.org/hudson/job/CXF-Trunk-JDK15/ws/trunk/rt/frontend/simple/target/test-classes>
[INFO] [surefire:test {execution: default-test}]
[INFO] Surefire report directory: <http://hudson.zones.apache.org/hudson/job/CXF-Trunk-JDK15/ws/trunk/rt/frontend/simple/target/surefire-reports>

-------------------------------------------------------
 T E S T S
-------------------------------------------------------
Running org.apache.cxf.frontend.spring.SpringBeansTest
Tests run: 2, Failures: 0, Errors: 0, Skipped: 0, Time elapsed: 1.887 sec
Running org.apache.cxf.frontend.soap.SoapBindingSelectionTest
Tests run: 1, Failures: 0, Errors: 0, Skipped: 0, Time elapsed: 0.21 sec
Running org.apache.cxf.service.factory.ClientFactoryBeanTest
Tests run: 2, Failures: 0, Errors: 0, Skipped: 0, Time elapsed: 0.428 sec
Running org.apache.cxf.frontend.spring.ClientServerTest
Tests run: 1, Failures: 0, Errors: 0, Skipped: 0, Time elapsed: 0.15 sec
Running org.apache.cxf.service.factory.ServerFactoryTest
Tests run: 3, Failures: 0, Errors: 0, Skipped: 0, Time elapsed: 0.253 sec
Running org.apache.cxf.service.factory.ReflectionServiceFactoryTest
Tests run: 4, Failures: 0, Errors: 0, Skipped: 0, Time elapsed: 0.166 sec
Running org.apache.cxf.service.stax.StaxDatabindingTest
Tests run: 2, Failures: 0, Errors: 0, Skipped: 0, Time elapsed: 0.107 sec
Running org.apache.cxf.service.factory.RountripTest
Tests run: 2, Failures: 0, Errors: 0, Skipped: 0, Time elapsed: 0.195 sec

Results :

Tests run: 17, Failures: 0, Errors: 0, Skipped: 0

[HUDSON] Recording test results
[INFO] [jar:jar {execution: default-jar}]
[INFO] Building jar: <http://hudson.zones.apache.org/hudson/job/CXF-Trunk-JDK15/ws/trunk/rt/frontend/simple/target/cxf-rt-frontend-simple-2.3.0-SNAPSHOT.jar>
[INFO] [install:install {execution: default-install}]
[INFO] Installing <http://hudson.zones.apache.org/hudson/job/CXF-Trunk-JDK15/ws/trunk/rt/frontend/simple/target/cxf-rt-frontend-simple-2.3.0-SNAPSHOT.jar>
to <http://hudson.zones.apache.org/hudson/job/CXF-Trunk-JDK15/ws/.repository/org/apache/cxf/cxf-rt-frontend-simple/2.3.0-SNAPSHOT/cxf-rt-frontend-simple-2.3.0-SNAPSHOT.jar>
[HUDSON] Archiving <http://hudson.zones.apache.org/hudson/job/CXF-Trunk-JDK15/ws/trunk/rt/frontend/simple/pom.xml>
to /export/home/hudson/hudson/jobs/CXF-Trunk-JDK15/modules/org.apache.cxf$cxf-rt-frontend-simple/builds/2010-07-22_20-35-10/archive/org.apache.cxf/cxf-rt-frontend-simple/2.3.0-SNAPSHOT/pom.xml
[HUDSON] Archiving <http://hudson.zones.apache.org/hudson/job/CXF-Trunk-JDK15/ws/trunk/rt/frontend/simple/target/cxf-rt-frontend-simple-2.3.0-SNAPSHOT.jar>
to /export/home/hudson/hudson/jobs/CXF-Trunk-JDK15/modules/org.apache.cxf$cxf-rt-frontend-simple/builds/2010-07-22_20-35-10/archive/org.apache.cxf/cxf-rt-frontend-simple/2.3.0-SNAPSHOT/cxf-rt-frontend-simple-2.3.0-SNAPSHOT.jar
[INFO] ------------------------------------------------------------------------
[INFO] Building Apache CXF Runtime HTTP Transport
[INFO]    task-segment: [clean, install]
[INFO] ------------------------------------------------------------------------
[INFO] [clean:clean {execution: default-clean}]
[INFO] Deleting <http://hudson.zones.apache.org/hudson/job/CXF-Trunk-JDK15/ws/trunk/rt/transports/http/target>
[INFO] [cxf-xml2fastinfoset:xml2fastinfoset {execution: xml2fastinfoset}]
[INFO] [cxf-xjc:xsdtojava {execution: generate-sources}]
[INFO] snapshot org.apache.cxf.xjcplugins:cxf-xjc-pl:2.3.0-SNAPSHOT: checking for updates
from apache.snapshots
[INFO] [remote-resources:process {execution: default}]
[INFO] [resources:resources {execution: default-resources}]
[INFO] Using 'UTF-8' encoding to copy filtered resources.
[INFO] Copying 6 resources
[INFO] Copying 10 resources
[INFO] skip non existing resourceDirectory <http://hudson.zones.apache.org/hudson/job/CXF-Trunk-JDK15/ws/trunk/rt/transports/http/src/main/resources-filtered>
[INFO] Copying 2 resources
[INFO] Copying 3 resources
[INFO] [compiler:compile {execution: default-compile}]
[INFO] Compiling 58 source files to <http://hudson.zones.apache.org/hudson/job/CXF-Trunk-JDK15/ws/trunk/rt/transports/http/target/classes>
[INFO] [resources:testResources {execution: default-testResources}]
[INFO] Using 'UTF-8' encoding to copy filtered resources.
[INFO] Copying 8 resources
[INFO] skip non existing resourceDirectory <http://hudson.zones.apache.org/hudson/job/CXF-Trunk-JDK15/ws/trunk/rt/transports/http/src/test/resources>
[INFO] skip non existing resourceDirectory <http://hudson.zones.apache.org/hudson/job/CXF-Trunk-JDK15/ws/trunk/rt/transports/http/target/generated/src/test/resources>
[INFO] Copying 3 resources
[INFO] [compiler:testCompile {execution: default-testCompile}]
[INFO] Compiling 10 source files to <http://hudson.zones.apache.org/hudson/job/CXF-Trunk-JDK15/ws/trunk/rt/transports/http/target/test-classes>
[INFO] [surefire:test {execution: default-test}]
[INFO] Surefire report directory: <http://hudson.zones.apache.org/hudson/job/CXF-Trunk-JDK15/ws/trunk/rt/transports/http/target/surefire-reports>

-------------------------------------------------------
 T E S T S
-------------------------------------------------------
Running org.apache.cxf.transport.http.gzip.GZIPAcceptEncodingTest
Tests run: 8, Failures: 0, Errors: 0, Skipped: 0, Time elapsed: 0.185 sec
Running org.apache.cxf.transport.http.policy.PolicyUtilsTest
Tests run: 12, Failures: 0, Errors: 0, Skipped: 0, Time elapsed: 0.118 sec
Running org.apache.cxf.transport.http.policy.HTTPClientAssertionBuilderTest
Tests run: 3, Failures: 0, Errors: 0, Skipped: 0, Time elapsed: 0.046 sec
Running org.apache.cxf.transport.servlet.ServletControllerTest
Tests run: 10, Failures: 0, Errors: 0, Skipped: 0, Time elapsed: 0.238 sec
Running org.apache.cxf.transport.http.HTTPConduitTest
Tests run: 5, Failures: 0, Errors: 0, Skipped: 0, Time elapsed: 0.049 sec
Running org.apache.cxf.transport.http.HTTPConduitURLEasyMockTest
Tests run: 5, Failures: 0, Errors: 0, Skipped: 0, Time elapsed: 0.164 sec
Running org.apache.cxf.transport.http.HTTPConduitURLConnectionTest
Tests run: 4, Failures: 0, Errors: 0, Skipped: 0, Time elapsed: 0.541 sec
Running org.apache.cxf.transport.servlet.AbstractCXFServletTest
Tests run: 7, Failures: 0, Errors: 0, Skipped: 0, Time elapsed: 0.014 sec
Running org.apache.cxf.transport.https.CertConstraintsTest
Tests run: 1, Failures: 0, Errors: 0, Skipped: 0, Time elapsed: 0.527 sec
Running org.apache.cxf.transport.http.policy.HTTPServerAssertionBuilderTest
Tests run: 3, Failures: 0, Errors: 0, Skipped: 0, Time elapsed: 0.005 sec

Results :

Tests run: 58, Failures: 0, Errors: 0, Skipped: 0

[HUDSON] Recording test results
[INFO] [jar:jar {execution: default-jar}]
[INFO] Building jar: <http://hudson.zones.apache.org/hudson/job/CXF-Trunk-JDK15/ws/trunk/rt/transports/http/target/cxf-rt-transports-http-2.3.0-SNAPSHOT.jar>
[INFO] [install:install {execution: default-install}]
[INFO] Installing <http://hudson.zones.apache.org/hudson/job/CXF-Trunk-JDK15/ws/trunk/rt/transports/http/target/cxf-rt-transports-http-2.3.0-SNAPSHOT.jar>
to <http://hudson.zones.apache.org/hudson/job/CXF-Trunk-JDK15/ws/.repository/org/apache/cxf/cxf-rt-transports-http/2.3.0-SNAPSHOT/cxf-rt-transports-http-2.3.0-SNAPSHOT.jar>
[HUDSON] Archiving <http://hudson.zones.apache.org/hudson/job/CXF-Trunk-JDK15/ws/trunk/rt/transports/http/pom.xml>
to /export/home/hudson/hudson/jobs/CXF-Trunk-JDK15/modules/org.apache.cxf$cxf-rt-transports-http/builds/2010-07-22_20-35-10/archive/org.apache.cxf/cxf-rt-transports-http/2.3.0-SNAPSHOT/pom.xml
[HUDSON] Archiving <http://hudson.zones.apache.org/hudson/job/CXF-Trunk-JDK15/ws/trunk/rt/transports/http/target/cxf-rt-transports-http-2.3.0-SNAPSHOT.jar>
to /export/home/hudson/hudson/jobs/CXF-Trunk-JDK15/modules/org.apache.cxf$cxf-rt-transports-http/builds/2010-07-22_20-35-10/archive/org.apache.cxf/cxf-rt-transports-http/2.3.0-SNAPSHOT/cxf-rt-transports-http-2.3.0-SNAPSHOT.jar
[INFO] ------------------------------------------------------------------------
[INFO] Building Apache CXF Runtime HTTP Jetty Transport
[INFO]    task-segment: [clean, install]
[INFO] ------------------------------------------------------------------------
[INFO] [clean:clean {execution: default-clean}]
[INFO] Deleting <http://hudson.zones.apache.org/hudson/job/CXF-Trunk-JDK15/ws/trunk/rt/transports/http-jetty/target>
[INFO] [cxf-xml2fastinfoset:xml2fastinfoset {execution: xml2fastinfoset}]
[INFO] [cxf-xjc:xsdtojava {execution: generate-sources}]
[INFO] [remote-resources:process {execution: default}]
[INFO] [resources:resources {execution: default-resources}]
[INFO] Using 'UTF-8' encoding to copy filtered resources.
[INFO] Copying 2 resources
[INFO] Copying 6 resources
[INFO] skip non existing resourceDirectory <http://hudson.zones.apache.org/hudson/job/CXF-Trunk-JDK15/ws/trunk/rt/transports/http-jetty/src/main/resources-filtered>
[INFO] Copying 1 resource
[INFO] Copying 3 resources
[INFO] [compiler:compile {execution: default-compile}]
[INFO] Compiling 25 source files to <http://hudson.zones.apache.org/hudson/job/CXF-Trunk-JDK15/ws/trunk/rt/transports/http-jetty/target/classes>
[INFO] [resources:testResources {execution: default-testResources}]
[INFO] Using 'UTF-8' encoding to copy filtered resources.
[INFO] Copying 9 resources
[INFO] skip non existing resourceDirectory <http://hudson.zones.apache.org/hudson/job/CXF-Trunk-JDK15/ws/trunk/rt/transports/http-jetty/src/test/resources>
[INFO] skip non existing resourceDirectory <http://hudson.zones.apache.org/hudson/job/CXF-Trunk-JDK15/ws/trunk/rt/transports/http-jetty/target/generated/src/test/resources>
[INFO] Copying 3 resources
[INFO] [compiler:testCompile {execution: default-testCompile}]
[INFO] Compiling 9 source files to <http://hudson.zones.apache.org/hudson/job/CXF-Trunk-JDK15/ws/trunk/rt/transports/http-jetty/target/test-classes>
[INFO] [surefire:test {execution: default-test}]
[INFO] Surefire report directory: <http://hudson.zones.apache.org/hudson/job/CXF-Trunk-JDK15/ws/trunk/rt/transports/http-jetty/target/surefire-reports>

-------------------------------------------------------
 T E S T S
-------------------------------------------------------
Running org.apache.cxf.transport.http_jetty.continuations.JettyContinuationProviderTest
Tests run: 2, Failures: 0, Errors: 0, Skipped: 0, Time elapsed: 0.129 sec
Running org.apache.cxf.transport.http_jetty.JettyHTTPServerEngineTest
Tests run: 8, Failures: 0, Errors: 0, Skipped: 0, Time elapsed: 1.101 sec
Running org.apache.cxf.transport.http_jetty.JettyHTTPDestinationTest
Tests run: 22, Failures: 0, Errors: 0, Skipped: 0, Time elapsed: 0.493 sec
Running org.apache.cxf.transport.http_jetty.JettyContextInspectorTest
Tests run: 1, Failures: 0, Errors: 0, Skipped: 0, Time elapsed: 0.084 sec
Running org.apache.cxf.transport.http_jetty.continuations.JettyContinuationWrapperTest
Tests run: 1, Failures: 0, Errors: 0, Skipped: 0, Time elapsed: 0.005 sec
Running org.apache.cxf.transport.http_jetty.JettyHTTPServerEngineFactoryTest
Tests run: 3, Failures: 0, Errors: 0, Skipped: 0, Time elapsed: 1.164 sec
Running org.apache.cxf.transport.http_jetty.spring.ApplicationContextTest
Tests run: 3, Failures: 0, Errors: 0, Skipped: 0, Time elapsed: 1.039 sec
Running org.apache.cxf.transport.http_jetty.spring.BeanDefinitionParsersTest
Tests run: 1, Failures: 0, Errors: 0, Skipped: 1, Time elapsed: 0.005 sec

Results :

Tests run: 41, Failures: 0, Errors: 0, Skipped: 1

[HUDSON] Recording test results
[INFO] [jar:jar {execution: default-jar}]
[INFO] Building jar: <http://hudson.zones.apache.org/hudson/job/CXF-Trunk-JDK15/ws/trunk/rt/transports/http-jetty/target/cxf-rt-transports-http-jetty-2.3.0-SNAPSHOT.jar>
[INFO] [install:install {execution: default-install}]
[INFO] Installing <http://hudson.zones.apache.org/hudson/job/CXF-Trunk-JDK15/ws/trunk/rt/transports/http-jetty/target/cxf-rt-transports-http-jetty-2.3.0-SNAPSHOT.jar>
to <http://hudson.zones.apache.org/hudson/job/CXF-Trunk-JDK15/ws/.repository/org/apache/cxf/cxf-rt-transports-http-jetty/2.3.0-SNAPSHOT/cxf-rt-transports-http-jetty-2.3.0-SNAPSHOT.jar>
[HUDSON] Archiving <http://hudson.zones.apache.org/hudson/job/CXF-Trunk-JDK15/ws/trunk/rt/transports/http-jetty/pom.xml>
to /export/home/hudson/hudson/jobs/CXF-Trunk-JDK15/modules/org.apache.cxf$cxf-rt-transports-http-jetty/builds/2010-07-22_20-35-10/archive/org.apache.cxf/cxf-rt-transports-http-jetty/2.3.0-SNAPSHOT/pom.xml
[HUDSON] Archiving <http://hudson.zones.apache.org/hudson/job/CXF-Trunk-JDK15/ws/trunk/rt/transports/http-jetty/target/cxf-rt-transports-http-jetty-2.3.0-SNAPSHOT.jar>
to /export/home/hudson/hudson/jobs/CXF-Trunk-JDK15/modules/org.apache.cxf$cxf-rt-transports-http-jetty/builds/2010-07-22_20-35-10/archive/org.apache.cxf/cxf-rt-transports-http-jetty/2.3.0-SNAPSHOT/cxf-rt-transports-http-jetty-2.3.0-SNAPSHOT.jar
[INFO] ------------------------------------------------------------------------
[INFO] Building Apache CXF Runtime WS Addressing
[INFO]    task-segment: [clean, install]
[INFO] ------------------------------------------------------------------------
[INFO] [clean:clean {execution: default-clean}]
[INFO] Deleting <http://hudson.zones.apache.org/hudson/job/CXF-Trunk-JDK15/ws/trunk/rt/ws/addr/target>
[INFO] [cxf-xml2fastinfoset:xml2fastinfoset {execution: xml2fastinfoset}]
[INFO] [remote-resources:process {execution: default}]
[INFO] [resources:resources {execution: default-resources}]
[INFO] Using 'UTF-8' encoding to copy filtered resources.
[INFO] Copying 3 resources
[INFO] Copying 7 resources
[INFO] skip non existing resourceDirectory <http://hudson.zones.apache.org/hudson/job/CXF-Trunk-JDK15/ws/trunk/rt/ws/addr/src/main/resources-filtered>
[INFO] Copying 1 resource
[INFO] Copying 3 resources
[INFO] [compiler:compile {execution: default-compile}]
[INFO] Compiling 17 source files to <http://hudson.zones.apache.org/hudson/job/CXF-Trunk-JDK15/ws/trunk/rt/ws/addr/target/classes>
[INFO] -------------------------------------------------------------
[ERROR] COMPILATION ERROR : 
[INFO] -------------------------------------------------------------
[ERROR] <http://hudson.zones.apache.org/hudson/job/CXF-Trunk-JDK15/ws/trunk/rt/ws/addr/src/main/java/org/apache/cxf/ws/addressing/DefaultMessageIdCache.java>:[23,28]
package org.apache.mina.util does not exist

[ERROR] <http://hudson.zones.apache.org/hudson/job/CXF-Trunk-JDK15/ws/trunk/rt/ws/addr/src/main/java/org/apache/cxf/ws/addressing/DefaultMessageIdCache.java>:[35,49]
cannot find symbol
symbol  : class ConcurrentHashSet
location: class org.apache.cxf.ws.addressing.DefaultMessageIdCache

[INFO] 2 errors 
[INFO] -------------------------------------------------------------
[HUDSON] Archiving <http://hudson.zones.apache.org/hudson/job/CXF-Trunk-JDK15/ws/trunk/rt/ws/addr/pom.xml>
to /export/home/hudson/hudson/jobs/CXF-Trunk-JDK15/modules/org.apache.cxf$cxf-rt-ws-addr/builds/2010-07-22_20-35-10/archive/org.apache.cxf/cxf-rt-ws-addr/2.3.0-SNAPSHOT/pom.xml
[INFO] ------------------------------------------------------------------------
[ERROR] BUILD FAILURE
[INFO] ------------------------------------------------------------------------
[INFO] Compilation failure

<http://hudson.zones.apache.org/hudson/job/CXF-Trunk-JDK15/ws/trunk/rt/ws/addr/src/main/java/org/apache/cxf/ws/addressing/DefaultMessageIdCache.java>:[23,28]
package org.apache.mina.util does not exist

<http://hudson.zones.apache.org/hudson/job/CXF-Trunk-JDK15/ws/trunk/rt/ws/addr/src/main/java/org/apache/cxf/ws/addressing/DefaultMessageIdCache.java>:[35,49]
cannot find symbol
symbol  : class ConcurrentHashSet
location: class org.apache.cxf.ws.addressing.DefaultMessageIdCache


[INFO] ------------------------------------------------------------------------
[INFO] Trace
org.apache.maven.BuildFailureException: Compilation failure
	at org.apache.maven.lifecycle.DefaultLifecycleExecutor.executeGoals(DefaultLifecycleExecutor.java:715)
	at org.apache.maven.lifecycle.DefaultLifecycleExecutor.executeGoalWithLifecycle(DefaultLifecycleExecutor.java:556)
	at org.apache.maven.lifecycle.DefaultLifecycleExecutor.executeGoal(DefaultLifecycleExecutor.java:535)
	at org.apache.maven.lifecycle.DefaultLifecycleExecutor.executeGoalAndHandleFailures(DefaultLifecycleExecutor.java:387)
	at org.apache.maven.lifecycle.DefaultLifecycleExecutor.executeTaskSegments(DefaultLifecycleExecutor.java:348)
	at org.apache.maven.lifecycle.DefaultLifecycleExecutor.execute(DefaultLifecycleExecutor.java:180)
	at org.apache.maven.lifecycle.LifecycleExecutorInterceptor.execute(LifecycleExecutorInterceptor.java:65)
	at org.apache.maven.DefaultMaven.doExecute(DefaultMaven.java:328)
	at org.apache.maven.DefaultMaven.execute(DefaultMaven.java:138)
	at org.apache.maven.cli.MavenCli.main(MavenCli.java:362)
	at sun.reflect.NativeMethodAccessorImpl.invoke0(Native Method)
	at sun.reflect.NativeMethodAccessorImpl.invoke(NativeMethodAccessorImpl.java:39)
	at sun.reflect.DelegatingMethodAccessorImpl.invoke(DelegatingMethodAccessorImpl.java:25)
	at java.lang.reflect.Method.invoke(Method.java:592)
	at org.codehaus.classworlds.Launcher.launchEnhanced(Launcher.java:315)
	at org.codehaus.classworlds.Launcher.launch(Launcher.java:255)
	at hudson.maven.agent.Main.launch(Main.java:165)
	at hudson.maven.MavenBuilder.call(MavenBuilder.java:165)
	at hudson.maven.MavenModuleSetBuild$Builder.call(MavenModuleSetBuild.java:696)
	at hudson.maven.MavenModuleSetBuild$Builder.call(MavenModuleSetBuild.java:640)
	at hudson.remoting.UserRequest.perform(UserRequest.java:114)
	at hudson.remoting.UserRequest.perform(UserRequest.java:48)
	at hudson.remoting.Request$2.run(Request.java:270)
	at java.util.concurrent.Executors$RunnableAdapter.call(Executors.java:417)
	at java.util.concurrent.FutureTask$Sync.innerRun(FutureTask.java:269)
	at java.util.concurrent.FutureTask.run(FutureTask.java:123)
	at java.util.concurrent.ThreadPoolExecutor$Worker.runTask(ThreadPoolExecutor.java:651)
	at java.util.concurrent.ThreadPoolExecutor$Worker.run(ThreadPoolExecutor.java:676)
	at java.lang.Thread.run(Thread.java:595)
Caused by: org.apache.maven.plugin.CompilationFailureException: Compilation failure
	at org.apache.maven.plugin.AbstractCompilerMojo.execute(AbstractCompilerMojo.java:656)
	at org.apache.maven.plugin.CompilerMojo.execute(CompilerMojo.java:128)
	at org.apache.maven.plugin.DefaultPluginManager.executeMojo(DefaultPluginManager.java:490)
	at hudson.maven.agent.PluginManagerInterceptor.executeMojo(PluginManagerInterceptor.java:182)
	at org.apache.maven.lifecycle.DefaultLifecycleExecutor.executeGoals(DefaultLifecycleExecutor.java:694)
	... 28 more
[INFO] ------------------------------------------------------------------------
[INFO] Total time: 8 minutes 32 seconds
[INFO] Finished at: Thu Jul 22 20:44:11 UTC 2010
[INFO] Final Memory: 78M/162M
[INFO] ------------------------------------------------------------------------
Sending e-mails to: notifications@cxf.apache.org dvaleri@apache.org
channel stopped
[locks-and-latches] Releasing all the locks
[locks-and-latches] All the locks released


Mime
View raw message