cxf-notifications mailing list archives

Site index · List index
Message view « Date » · « Thread »
Top « Date » · « Thread »
From Apache Hudson Server <hud...@hudson.zones.apache.org>
Subject Build failed in Hudson: CXF-2.2.x-JDK15 » Apache CXF Runtime Core #492
Date Thu, 05 Aug 2010 08:16:01 GMT
See <http://hudson.zones.apache.org/hudson/job/CXF-2.2.x-JDK15/org.apache.cxf$cxf-rt-core/492/changes>

Changes:

[ningjiang] Merged revisions 982491 via svnmerge from 
https://svn.apache.org/repos/asf/cxf/trunk

........
  r982491 | ningjiang | 2010-08-05 15:42:57 +0800 (Thu, 05 Aug 2010) | 1 line
  
  CXF-2931 Add configurable pretty printing to the CXF logging in/out interceptors
........

------------------------------------------
[INFO] ------------------------------------------------------------------------
[INFO] Building Apache CXF Runtime Core
[INFO]    task-segment: [clean, install]
[INFO] ------------------------------------------------------------------------
[INFO] [clean:clean {execution: default-clean}]
[INFO] Deleting <http://hudson.zones.apache.org/hudson/job/CXF-2.2.x-JDK15/org.apache.cxf$cxf-rt-core/ws/target>
[INFO] [checkstyle:checkstyle {execution: validate}]
[INFO] Starting audit...
Audit done.

[INFO] Preparing pmd:check
[HUDSON] Archiving <http://hudson.zones.apache.org/hudson/job/CXF-2.2.x-JDK15/org.apache.cxf$cxf-rt-core/ws/pom.xml>
to /export/home/hudson/hudson/jobs/CXF-2.2.x-JDK15/modules/org.apache.cxf$cxf-rt-core/builds/2010-08-05_08-12-18/archive/org.apache.cxf/cxf-rt-core/2.2.10-SNAPSHOT/pom.xml
[INFO] [pmd:pmd {execution: pmd}]
[INFO] [pmd:check {execution: validate}]
[INFO] 
[INFO] [cxf-xml2fastinfoset:xml2fastinfoset {execution: xml2fastinfoset}]
[INFO] [remote-resources:process {execution: default}]
[INFO] [resources:resources {execution: default-resources}]
[INFO] Using 'UTF-8' encoding to copy filtered resources.
[INFO] Copying 14 resources
[INFO] Copying 8 resources
[INFO] skip non existing resourceDirectory <http://hudson.zones.apache.org/hudson/job/CXF-2.2.x-JDK15/org.apache.cxf$cxf-rt-core/ws/src/main/resources-filtered>
[INFO] Copying 1 resource
[INFO] Copying 3 resources
[INFO] [compiler:compile {execution: default-compile}]
[INFO] Compiling 172 source files to <http://hudson.zones.apache.org/hudson/job/CXF-2.2.x-JDK15/org.apache.cxf$cxf-rt-core/ws/target/classes>
[INFO] -------------------------------------------------------------
[WARNING] COMPILATION WARNING : 
[INFO] -------------------------------------------------------------
[WARNING] <http://hudson.zones.apache.org/hudson/job/CXF-2.2.x-JDK15/org.apache.cxf$cxf-rt-core/ws/src/main/java/org/apache/cxf/bus/spring/ControlledValidationXmlBeanDefinitionReader.java>:[62,7]
[deprecation] getBeanFactory() in org.springframework.beans.factory.support.BeanDefinitionReader
has been deprecated

[INFO] 1warning
[INFO] -------------------------------------------------------------
[INFO] -------------------------------------------------------------
[ERROR] COMPILATION ERROR : 
[INFO] -------------------------------------------------------------
[ERROR] <http://hudson.zones.apache.org/hudson/job/CXF-2.2.x-JDK15/org.apache.cxf$cxf-rt-core/ws/src/main/java/org/apache/cxf/interceptor/LoggingOutInterceptor.java>:[162,16]
cannot find symbol
symbol  : method writePayload(java.lang.StringBuilder,org.apache.cxf.io.CachedOutputStream,java.lang.String)
location: class org.apache.cxf.interceptor.LoggingOutInterceptor.LoggingCallback

[ERROR] <http://hudson.zones.apache.org/hudson/job/CXF-2.2.x-JDK15/org.apache.cxf$cxf-rt-core/ws/src/main/java/org/apache/cxf/interceptor/LoggingInInterceptor.java>:[152,16]
cannot find symbol
symbol  : method writePayload(java.lang.StringBuilder,org.apache.cxf.io.CachedOutputStream,java.lang.String)
location: class org.apache.cxf.interceptor.LoggingInInterceptor

[INFO] 2 errors 
[INFO] -------------------------------------------------------------
[INFO] ------------------------------------------------------------------------
[ERROR] BUILD FAILURE
[INFO] ------------------------------------------------------------------------
[INFO] Compilation failure

<http://hudson.zones.apache.org/hudson/job/CXF-2.2.x-JDK15/org.apache.cxf$cxf-rt-core/ws/src/main/java/org/apache/cxf/interceptor/LoggingOutInterceptor.java>:[162,16]
cannot find symbol
symbol  : method writePayload(java.lang.StringBuilder,org.apache.cxf.io.CachedOutputStream,java.lang.String)
location: class org.apache.cxf.interceptor.LoggingOutInterceptor.LoggingCallback

<http://hudson.zones.apache.org/hudson/job/CXF-2.2.x-JDK15/org.apache.cxf$cxf-rt-core/ws/src/main/java/org/apache/cxf/interceptor/LoggingInInterceptor.java>:[152,16]
cannot find symbol
symbol  : method writePayload(java.lang.StringBuilder,org.apache.cxf.io.CachedOutputStream,java.lang.String)
location: class org.apache.cxf.interceptor.LoggingInInterceptor


[INFO] ------------------------------------------------------------------------
[INFO] Trace
org.apache.maven.BuildFailureException: Compilation failure
	at org.apache.maven.lifecycle.DefaultLifecycleExecutor.executeGoals(DefaultLifecycleExecutor.java:715)
	at org.apache.maven.lifecycle.DefaultLifecycleExecutor.executeGoalWithLifecycle(DefaultLifecycleExecutor.java:556)
	at org.apache.maven.lifecycle.DefaultLifecycleExecutor.executeGoal(DefaultLifecycleExecutor.java:535)
	at org.apache.maven.lifecycle.DefaultLifecycleExecutor.executeGoalAndHandleFailures(DefaultLifecycleExecutor.java:387)
	at org.apache.maven.lifecycle.DefaultLifecycleExecutor.executeTaskSegments(DefaultLifecycleExecutor.java:348)
	at org.apache.maven.lifecycle.DefaultLifecycleExecutor.execute(DefaultLifecycleExecutor.java:180)
	at org.apache.maven.lifecycle.LifecycleExecutorInterceptor.execute(LifecycleExecutorInterceptor.java:65)
	at org.apache.maven.DefaultMaven.doExecute(DefaultMaven.java:328)
	at org.apache.maven.DefaultMaven.execute(DefaultMaven.java:138)
	at org.apache.maven.cli.MavenCli.main(MavenCli.java:362)
	at sun.reflect.NativeMethodAccessorImpl.invoke0(Native Method)
	at sun.reflect.NativeMethodAccessorImpl.invoke(NativeMethodAccessorImpl.java:39)
	at sun.reflect.DelegatingMethodAccessorImpl.invoke(DelegatingMethodAccessorImpl.java:25)
	at java.lang.reflect.Method.invoke(Method.java:592)
	at org.codehaus.classworlds.Launcher.launchEnhanced(Launcher.java:315)
	at org.codehaus.classworlds.Launcher.launch(Launcher.java:255)
	at hudson.maven.agent.Main.launch(Main.java:165)
	at hudson.maven.MavenBuilder.call(MavenBuilder.java:165)
	at hudson.maven.MavenModuleSetBuild$Builder.call(MavenModuleSetBuild.java:696)
	at hudson.maven.MavenModuleSetBuild$Builder.call(MavenModuleSetBuild.java:640)
	at hudson.remoting.UserRequest.perform(UserRequest.java:114)
	at hudson.remoting.UserRequest.perform(UserRequest.java:48)
	at hudson.remoting.Request$2.run(Request.java:270)
	at java.util.concurrent.Executors$RunnableAdapter.call(Executors.java:417)
	at java.util.concurrent.FutureTask$Sync.innerRun(FutureTask.java:269)
	at java.util.concurrent.FutureTask.run(FutureTask.java:123)
	at java.util.concurrent.ThreadPoolExecutor$Worker.runTask(ThreadPoolExecutor.java:651)
	at java.util.concurrent.ThreadPoolExecutor$Worker.run(ThreadPoolExecutor.java:676)
	at java.lang.Thread.run(Thread.java:595)
Caused by: org.apache.maven.plugin.CompilationFailureException: Compilation failure
	at org.apache.maven.plugin.AbstractCompilerMojo.execute(AbstractCompilerMojo.java:656)
	at org.apache.maven.plugin.CompilerMojo.execute(CompilerMojo.java:128)
	at org.apache.maven.plugin.DefaultPluginManager.executeMojo(DefaultPluginManager.java:490)
	at hudson.maven.agent.PluginManagerInterceptor.executeMojo(PluginManagerInterceptor.java:182)
	at org.apache.maven.lifecycle.DefaultLifecycleExecutor.executeGoals(DefaultLifecycleExecutor.java:694)
	... 28 more
[INFO] ------------------------------------------------------------------------
[INFO] Total time: 3 minutes 29 seconds
[INFO] Finished at: Thu Aug 05 08:15:56 UTC 2010
[INFO] Final Memory: 88M/159M
[INFO] ------------------------------------------------------------------------


Mime
View raw message