cxf-notifications mailing list archives

Site index · List index
Message view « Date » · « Thread »
Top « Date » · « Thread »
From Apache Hudson Server <hud...@hudson.apache.org>
Subject Build failed in Hudson: CXF-trunk-deploy #377
Date Tue, 17 Aug 2010 09:04:07 GMT
See <https://hudson.apache.org/hudson/job/CXF-trunk-deploy/377/changes>

Changes:

[ema] [CXF-2941]:Get the namespace value from reference element in @XmlElement of response
wrapper bean

[ema] [CXF-2944]:Get the targetNamespace value from reference element namespace in @WebResult

------------------------------------------
[...truncated 18752 lines...]
[INFO] No sources to compile
[INFO] [surefire:test {execution: default-test}]
[INFO] Tests are skipped.
[INFO] [jar:jar {execution: default-jar}]
[INFO] Building jar: <https://hudson.apache.org/hudson/job/CXF-trunk-deploy/ws/trunk/distribution/src/main/release/samples/jms_pubsub/target/jms_pubsub-2.3.0-SNAPSHOT.jar>
[INFO] [install:install {execution: default-install}]
[INFO] Installing <https://hudson.apache.org/hudson/job/CXF-trunk-deploy/ws/trunk/distribution/src/main/release/samples/jms_pubsub/target/jms_pubsub-2.3.0-SNAPSHOT.jar>
to <https://hudson.apache.org/hudson/job/CXF-trunk-deploy/ws/.repository/org/apache/cxf/samples/jms_pubsub/2.3.0-SNAPSHOT/jms_pubsub-2.3.0-SNAPSHOT.jar>
[INFO] [deploy:deploy {execution: default-deploy}]
[INFO]  skipping artifact deployement 
[HUDSON] Archiving <https://hudson.apache.org/hudson/job/CXF-trunk-deploy/ws/trunk/distribution/src/main/release/samples/jms_pubsub/pom.xml>
to /home/hudson/hudson/jobs/CXF-trunk-deploy/modules/org.apache.cxf.samples$jms_pubsub/builds/2010-08-17_06-35-16/archive/org.apache.cxf.samples/jms_pubsub/2.3.0-SNAPSHOT/pom.xml
[HUDSON] Archiving <https://hudson.apache.org/hudson/job/CXF-trunk-deploy/ws/trunk/distribution/src/main/release/samples/jms_pubsub/target/jms_pubsub-2.3.0-SNAPSHOT.jar>
to /home/hudson/hudson/jobs/CXF-trunk-deploy/modules/org.apache.cxf.samples$jms_pubsub/builds/2010-08-17_06-35-16/archive/org.apache.cxf.samples/jms_pubsub/2.3.0-SNAPSHOT/jms_pubsub-2.3.0-SNAPSHOT.jar
[INFO] ------------------------------------------------------------------------
[INFO] Building Unnamed - org.apache.cxf.samples:jax_rs_spring_security:jar:2.3.0-SNAPSHOT
[INFO]    task-segment: [clean, deploy]
[INFO] ------------------------------------------------------------------------
[INFO] [clean:clean {execution: default-clean}]
[INFO] Deleting directory <https://hudson.apache.org/hudson/job/CXF-trunk-deploy/ws/trunk/distribution/src/main/release/samples/jax_rs/spring_security/target>
[INFO] [antrun:run {execution: copyxmlfiles}]
project.artifactId
[INFO] Executing tasks
     [copy] Copying 1 file to <https://hudson.apache.org/hudson/job/CXF-trunk-deploy/ws/trunk/distribution/src/main/release/samples/jax_rs/spring_security/target/classes/demo/jaxrs/client>
     [copy] Copying 1 file to <https://hudson.apache.org/hudson/job/CXF-trunk-deploy/ws/trunk/distribution/src/main/release/samples/jax_rs/spring_security/target/classes/demo/jaxrs/client>
[INFO] Executed tasks
[INFO] [resources:resources {execution: default-resources}]
[WARNING] Using platform encoding (UTF-8 actually) to copy filtered resources, i.e. build
is platform dependent!
[INFO] skip non existing resourceDirectory <https://hudson.apache.org/hudson/job/CXF-trunk-deploy/ws/trunk/distribution/src/main/release/samples/jax_rs/spring_security/src/main/resources>
[INFO] [compiler:compile {execution: default-compile}]
[WARNING] File encoding has not been set, using platform encoding UTF-8, i.e. build is platform
dependent!
[INFO] Compiling 11 source files to <https://hudson.apache.org/hudson/job/CXF-trunk-deploy/ws/trunk/distribution/src/main/release/samples/jax_rs/spring_security/target/classes>
[INFO] [resources:testResources {execution: default-testResources}]
[WARNING] Using platform encoding (UTF-8 actually) to copy filtered resources, i.e. build
is platform dependent!
[INFO] skip non existing resourceDirectory <https://hudson.apache.org/hudson/job/CXF-trunk-deploy/ws/trunk/distribution/src/main/release/samples/jax_rs/spring_security/src/test/resources>
[INFO] [compiler:testCompile {execution: default-testCompile}]
[INFO] No sources to compile
[INFO] [surefire:test {execution: default-test}]
[INFO] Tests are skipped.
[INFO] [jar:jar {execution: default-jar}]
[INFO] Building jar: <https://hudson.apache.org/hudson/job/CXF-trunk-deploy/ws/trunk/distribution/src/main/release/samples/jax_rs/spring_security/target/jax_rs_spring_security-2.3.0-SNAPSHOT.jar>
[INFO] [install:install {execution: default-install}]
[INFO] Installing <https://hudson.apache.org/hudson/job/CXF-trunk-deploy/ws/trunk/distribution/src/main/release/samples/jax_rs/spring_security/target/jax_rs_spring_security-2.3.0-SNAPSHOT.jar>
to <https://hudson.apache.org/hudson/job/CXF-trunk-deploy/ws/.repository/org/apache/cxf/samples/jax_rs_spring_security/2.3.0-SNAPSHOT/jax_rs_spring_security-2.3.0-SNAPSHOT.jar>
[INFO] [deploy:deploy {execution: default-deploy}]
[INFO]  skipping artifact deployement 
[HUDSON] Archiving <https://hudson.apache.org/hudson/job/CXF-trunk-deploy/ws/trunk/distribution/src/main/release/samples/jax_rs/spring_security/pom.xml>
to /home/hudson/hudson/jobs/CXF-trunk-deploy/modules/org.apache.cxf.samples$jax_rs_spring_security/builds/2010-08-17_06-35-16/archive/org.apache.cxf.samples/jax_rs_spring_security/2.3.0-SNAPSHOT/pom.xml
[HUDSON] Archiving <https://hudson.apache.org/hudson/job/CXF-trunk-deploy/ws/trunk/distribution/src/main/release/samples/jax_rs/spring_security/target/jax_rs_spring_security-2.3.0-SNAPSHOT.jar>
to /home/hudson/hudson/jobs/CXF-trunk-deploy/modules/org.apache.cxf.samples$jax_rs_spring_security/builds/2010-08-17_06-35-16/archive/org.apache.cxf.samples/jax_rs_spring_security/2.3.0-SNAPSHOT/jax_rs_spring_security-2.3.0-SNAPSHOT.jar
[INFO] ------------------------------------------------------------------------
[INFO] Building Apache CXF Distribution
[INFO]    task-segment: [clean, deploy]
[INFO] ------------------------------------------------------------------------
[INFO] [clean:clean {execution: default-clean}]
[INFO] Deleting <https://hudson.apache.org/hudson/job/CXF-trunk-deploy/ws/trunk/distribution/target>
Downloading: http://repository.apache.org/snapshots/org/apache/cxf/cxf-rt-transports-http-osgi/2.3.0-SNAPSHOT/cxf-rt-transports-http-osgi-2.3.0-SNAPSHOT.jar
Downloading: http://repository.apache.org/snapshots/org/apache/cxf/xjcplugins/cxf-xjc-bug671/2.3.0-SNAPSHOT/cxf-xjc-bug671-2.3.0-SNAPSHOT.jar
Downloading: http://repository.apache.org/snapshots/org/apache/cxf/xjcplugins/cxf-xjc-boolean/2.3.0-SNAPSHOT/cxf-xjc-boolean-2.3.0-SNAPSHOT.jar
Downloading: http://repository.apache.org/snapshots/org/apache/cxf/cxf-bundle/2.3.0-SNAPSHOT/cxf-bundle-2.3.0-SNAPSHOT.jar
[INFO] [checkstyle:checkstyle {execution: validate}]
[INFO] [cxf-xml2fastinfoset:xml2fastinfoset {execution: xml2fastinfoset}]
[INFO] [antrun:run {execution: process-sources-xsl}]
project.artifactId
[INFO] Executing tasks
     [copy] Copying 1 file to <https://hudson.apache.org/hudson/job/CXF-trunk-deploy/ws/trunk/distribution/target>
[INFO] Executed tasks
[INFO] [remote-resources:process {execution: default}]
[INFO] [site:attach-descriptor {execution: default-attach-descriptor}]
[INFO] Preparing source:jar
[WARNING] Removing: jar from forked lifecycle, to prevent recursive invocation.
[HUDSON] Archiving <https://hudson.apache.org/hudson/job/CXF-trunk-deploy/ws/trunk/distribution/pom.xml>
to /home/hudson/hudson/jobs/CXF-trunk-deploy/modules/org.apache.cxf$apache-cxf/builds/2010-08-17_06-35-16/archive/org.apache.cxf/apache-cxf/2.3.0-SNAPSHOT/pom.xml
[INFO] [checkstyle:checkstyle {execution: validate}]
[INFO] [cxf-xml2fastinfoset:xml2fastinfoset {execution: xml2fastinfoset}]
[INFO] [source:jar {execution: attach-sources}]
[INFO] [javadoc:jar {execution: attach-javadocs}]
[INFO] Not executing Javadoc as the project is not a Java classpath-capable package
[INFO] [dependency:unpack {execution: unpack-javadoc}]
[INFO] Configured Artifact: org.apache.cxf:cxf-api:javadoc:2.3.0-SNAPSHOT:jar
Downloading: http://repository.apache.org/snapshots/org/apache/cxf/cxf-api/2.3.0-SNAPSHOT/cxf-api-2.3.0-SNAPSHOT-javadoc.jar
1693K downloaded  (cxf-api-2.3.0-SNAPSHOT-javadoc.jar)
[INFO] Unpacking <https://hudson.apache.org/hudson/job/CXF-trunk-deploy/ws/.repository/org/apache/cxf/cxf-api/2.3.0-SNAPSHOT/cxf-api-2.3.0-SNAPSHOT-javadoc.jar>
to
  <https://hudson.apache.org/hudson/job/CXF-trunk-deploy/ws/trunk/distribution/target/javadoc>
   with includes null and excludes:null
[INFO] [dependency:copy {execution: add-jars}]
[INFO] Configured Artifact: org.apache.cxf:cxf-integration-jbi:2.3.0-SNAPSHOT:jar
[INFO] snapshot org.apache.cxf:cxf-integration-jbi:2.3.0-SNAPSHOT: checking for updates from
apache.snapshots
Downloading: http://repository.apache.org/snapshots/org/apache/cxf/cxf-integration-jbi/2.3.0-SNAPSHOT/cxf-integration-jbi-2.3.0-SNAPSHOT.jar
[INFO] Configured Artifact: org.apache.cxf:cxf-integration-jca:2.3.0-SNAPSHOT:jar
[INFO] snapshot org.apache.cxf:cxf-integration-jca:2.3.0-SNAPSHOT: checking for updates from
apache.snapshots
[INFO] Configured Artifact: org.apache.cxf:cxf-rt-bindings-jbi:2.3.0-SNAPSHOT:jar
[INFO] snapshot org.apache.cxf:cxf-rt-bindings-jbi:2.3.0-SNAPSHOT: checking for updates from
apache.snapshots
Downloading: http://repository.apache.org/snapshots/org/apache/cxf/cxf-rt-bindings-jbi/2.3.0-SNAPSHOT/cxf-rt-bindings-jbi-2.3.0-SNAPSHOT.jar
[INFO] Configured Artifact: org.apache.cxf:cxf-rt-transports-jbi:2.3.0-SNAPSHOT:jar
[INFO] snapshot org.apache.cxf:cxf-rt-transports-jbi:2.3.0-SNAPSHOT: checking for updates
from apache.snapshots
[INFO] Configured Artifact: junit:junit:4.4:jar
[INFO] Configured Artifact: commons-httpclient:commons-httpclient:3.1:jar
[INFO] Configured Artifact: org.apache.geronimo.specs:geronimo-ejb_3.0_spec:1.0.1:jar
[INFO] Copying cxf-integration-jbi-2.3.0-SNAPSHOT.jar to <https://hudson.apache.org/hudson/job/CXF-trunk-deploy/ws/trunk/distribution/target/additional-libs/cxf-integration-jbi-2.3.0-SNAPSHOT.jar>
[INFO] Copying cxf-integration-jca-2.3.0-SNAPSHOT.jar to <https://hudson.apache.org/hudson/job/CXF-trunk-deploy/ws/trunk/distribution/target/additional-libs/cxf-integration-jca-2.3.0-SNAPSHOT.jar>
[INFO] Copying cxf-rt-bindings-jbi-2.3.0-SNAPSHOT.jar to <https://hudson.apache.org/hudson/job/CXF-trunk-deploy/ws/trunk/distribution/target/additional-libs/cxf-rt-bindings-jbi-2.3.0-SNAPSHOT.jar>
[INFO] Copying cxf-rt-transports-jbi-2.3.0-SNAPSHOT.jar to <https://hudson.apache.org/hudson/job/CXF-trunk-deploy/ws/trunk/distribution/target/additional-libs/cxf-rt-transports-jbi-2.3.0-SNAPSHOT.jar>
[INFO] Copying junit-4.4.jar to <https://hudson.apache.org/hudson/job/CXF-trunk-deploy/ws/trunk/distribution/target/sample-libs/junit-4.4.jar>
[INFO] Copying commons-httpclient-3.1.jar to <https://hudson.apache.org/hudson/job/CXF-trunk-deploy/ws/trunk/distribution/target/sample-libs/commons-httpclient-3.1.jar>
[INFO] Copying geronimo-ejb_3.0_spec-1.0.1.jar to <https://hudson.apache.org/hudson/job/CXF-trunk-deploy/ws/trunk/distribution/target/sample-libs/geronimo-ejb_3.0_spec-1.0.1.jar>
[INFO] [assembly:single {execution: distribution-package}]
[INFO] Reading assembly descriptor: src/main/assembly/bin.xml
[INFO] Reading assembly descriptor: src/main/assembly/src.xml
Downloading: http://repository.apache.org/snapshots/org/apache/cxf/xjcplugins/cxf-xjc-bug671/2.3.0-SNAPSHOT/cxf-xjc-bug671-2.3.0-SNAPSHOT.jar
Downloading: http://repository.apache.org/snapshots/org/apache/cxf/cxf-rt-transports-http-osgi/2.3.0-SNAPSHOT/cxf-rt-transports-http-osgi-2.3.0-SNAPSHOT.jar
Downloading: http://repository.apache.org/snapshots/org/apache/cxf/xjcplugins/cxf-xjc-boolean/2.3.0-SNAPSHOT/cxf-xjc-boolean-2.3.0-SNAPSHOT.jar
Downloading: http://repository.apache.org/snapshots/org/apache/cxf/cxf-bundle/2.3.0-SNAPSHOT/cxf-bundle-2.3.0-SNAPSHOT.jar
[WARNING] Cannot include project artifact: org.apache.cxf:apache-cxf:pom:2.3.0-SNAPSHOT; it
doesn't have an associated file or directory.
Downloading: http://repository.apache.org/snapshots/org/apache/cxf/cxf-rt-transports-http-osgi/2.3.0-SNAPSHOT/cxf-rt-transports-http-osgi-2.3.0-SNAPSHOT.jar
Downloading: http://repository.apache.org/snapshots/org/apache/cxf/xjcplugins/cxf-xjc-bug671/2.3.0-SNAPSHOT/cxf-xjc-bug671-2.3.0-SNAPSHOT.jar
Downloading: http://repository.apache.org/snapshots/org/apache/cxf/xjcplugins/cxf-xjc-boolean/2.3.0-SNAPSHOT/cxf-xjc-boolean-2.3.0-SNAPSHOT.jar
Downloading: http://repository.apache.org/snapshots/org/apache/cxf/cxf-bundle/2.3.0-SNAPSHOT/cxf-bundle-2.3.0-SNAPSHOT.jar
[WARNING] Cannot include project artifact: org.apache.cxf:apache-cxf:pom:2.3.0-SNAPSHOT; it
doesn't have an associated file or directory.
Downloading: http://repository.apache.org/snapshots/org/apache/cxf/xjcplugins/cxf-xjc-bug671/2.3.0-SNAPSHOT/cxf-xjc-bug671-2.3.0-SNAPSHOT.jar
Downloading: http://repository.apache.org/snapshots/org/apache/cxf/cxf-rt-transports-http-osgi/2.3.0-SNAPSHOT/cxf-rt-transports-http-osgi-2.3.0-SNAPSHOT.jar
Downloading: http://repository.apache.org/snapshots/org/apache/cxf/xjcplugins/cxf-xjc-boolean/2.3.0-SNAPSHOT/cxf-xjc-boolean-2.3.0-SNAPSHOT.jar
Downloading: http://repository.apache.org/snapshots/org/apache/cxf/cxf-bundle/2.3.0-SNAPSHOT/cxf-bundle-2.3.0-SNAPSHOT.jar
[WARNING] Cannot include project artifact: org.apache.cxf:apache-cxf:pom:2.3.0-SNAPSHOT; it
doesn't have an associated file or directory.
[INFO] Copying files to <https://hudson.apache.org/hudson/job/CXF-trunk-deploy/ws/trunk/distribution/target/apache-cxf-2.3.0-SNAPSHOT>
[WARNING] Assembly file: <https://hudson.apache.org/hudson/job/CXF-trunk-deploy/ws/trunk/distribution/target/apache-cxf-2.3.0-SNAPSHOT>
is not a regular file (it may be a directory). It cannot be attached to the project build
for installation or deployment.
Downloading: http://repository.apache.org/snapshots/org/apache/cxf/cxf-rt-transports-http-osgi/2.3.0-SNAPSHOT/cxf-rt-transports-http-osgi-2.3.0-SNAPSHOT.jar
Downloading: http://repository.apache.org/snapshots/org/apache/cxf/xjcplugins/cxf-xjc-bug671/2.3.0-SNAPSHOT/cxf-xjc-bug671-2.3.0-SNAPSHOT.jar
Downloading: http://repository.apache.org/snapshots/org/apache/cxf/xjcplugins/cxf-xjc-boolean/2.3.0-SNAPSHOT/cxf-xjc-boolean-2.3.0-SNAPSHOT.jar
Downloading: http://repository.apache.org/snapshots/org/apache/cxf/cxf-bundle/2.3.0-SNAPSHOT/cxf-bundle-2.3.0-SNAPSHOT.jar
[WARNING] Cannot include project artifact: org.apache.cxf:apache-cxf:pom:2.3.0-SNAPSHOT; it
doesn't have an associated file or directory.
Downloading: http://repository.apache.org/snapshots/org/apache/cxf/cxf-rt-transports-http-osgi/2.3.0-SNAPSHOT/cxf-rt-transports-http-osgi-2.3.0-SNAPSHOT.jar
Downloading: http://repository.apache.org/snapshots/org/apache/cxf/xjcplugins/cxf-xjc-bug671/2.3.0-SNAPSHOT/cxf-xjc-bug671-2.3.0-SNAPSHOT.jar
Downloading: http://repository.apache.org/snapshots/org/apache/cxf/cxf-bundle/2.3.0-SNAPSHOT/cxf-bundle-2.3.0-SNAPSHOT.jar
Downloading: http://repository.apache.org/snapshots/org/apache/cxf/xjcplugins/cxf-xjc-boolean/2.3.0-SNAPSHOT/cxf-xjc-boolean-2.3.0-SNAPSHOT.jar
[WARNING] Cannot include project artifact: org.apache.cxf:apache-cxf:pom:2.3.0-SNAPSHOT; it
doesn't have an associated file or directory.
Downloading: http://repository.apache.org/snapshots/org/apache/cxf/xjcplugins/cxf-xjc-bug671/2.3.0-SNAPSHOT/cxf-xjc-bug671-2.3.0-SNAPSHOT.jar
Downloading: http://repository.apache.org/snapshots/org/apache/cxf/cxf-rt-transports-http-osgi/2.3.0-SNAPSHOT/cxf-rt-transports-http-osgi-2.3.0-SNAPSHOT.jar
Downloading: http://repository.apache.org/snapshots/org/apache/cxf/xjcplugins/cxf-xjc-boolean/2.3.0-SNAPSHOT/cxf-xjc-boolean-2.3.0-SNAPSHOT.jar
Downloading: http://repository.apache.org/snapshots/org/apache/cxf/cxf-bundle/2.3.0-SNAPSHOT/cxf-bundle-2.3.0-SNAPSHOT.jar
[WARNING] Cannot include project artifact: org.apache.cxf:apache-cxf:pom:2.3.0-SNAPSHOT; it
doesn't have an associated file or directory.
[INFO] Building tar : <https://hudson.apache.org/hudson/job/CXF-trunk-deploy/ws/trunk/distribution/target/apache-cxf-2.3.0-SNAPSHOT.tar.gz>
Downloading: http://repository.apache.org/snapshots/org/apache/cxf/xjcplugins/cxf-xjc-bug671/2.3.0-SNAPSHOT/cxf-xjc-bug671-2.3.0-SNAPSHOT.jar
Downloading: http://repository.apache.org/snapshots/org/apache/cxf/cxf-rt-transports-http-osgi/2.3.0-SNAPSHOT/cxf-rt-transports-http-osgi-2.3.0-SNAPSHOT.jar
Downloading: http://repository.apache.org/snapshots/org/apache/cxf/xjcplugins/cxf-xjc-boolean/2.3.0-SNAPSHOT/cxf-xjc-boolean-2.3.0-SNAPSHOT.jar
Downloading: http://repository.apache.org/snapshots/org/apache/cxf/cxf-bundle/2.3.0-SNAPSHOT/cxf-bundle-2.3.0-SNAPSHOT.jar
[WARNING] Cannot include project artifact: org.apache.cxf:apache-cxf:pom:2.3.0-SNAPSHOT; it
doesn't have an associated file or directory.
Downloading: http://repository.apache.org/snapshots/org/apache/cxf/xjcplugins/cxf-xjc-bug671/2.3.0-SNAPSHOT/cxf-xjc-bug671-2.3.0-SNAPSHOT.jar
Downloading: http://repository.apache.org/snapshots/org/apache/cxf/cxf-rt-transports-http-osgi/2.3.0-SNAPSHOT/cxf-rt-transports-http-osgi-2.3.0-SNAPSHOT.jar
Downloading: http://repository.apache.org/snapshots/org/apache/cxf/xjcplugins/cxf-xjc-boolean/2.3.0-SNAPSHOT/cxf-xjc-boolean-2.3.0-SNAPSHOT.jar
Downloading: http://repository.apache.org/snapshots/org/apache/cxf/cxf-bundle/2.3.0-SNAPSHOT/cxf-bundle-2.3.0-SNAPSHOT.jar
[WARNING] Cannot include project artifact: org.apache.cxf:apache-cxf:pom:2.3.0-SNAPSHOT; it
doesn't have an associated file or directory.
Downloading: http://repository.apache.org/snapshots/org/apache/cxf/cxf-rt-transports-http-osgi/2.3.0-SNAPSHOT/cxf-rt-transports-http-osgi-2.3.0-SNAPSHOT.jar
Downloading: http://repository.apache.org/snapshots/org/apache/cxf/xjcplugins/cxf-xjc-bug671/2.3.0-SNAPSHOT/cxf-xjc-bug671-2.3.0-SNAPSHOT.jar
Downloading: http://repository.apache.org/snapshots/org/apache/cxf/xjcplugins/cxf-xjc-boolean/2.3.0-SNAPSHOT/cxf-xjc-boolean-2.3.0-SNAPSHOT.jar
Downloading: http://repository.apache.org/snapshots/org/apache/cxf/cxf-bundle/2.3.0-SNAPSHOT/cxf-bundle-2.3.0-SNAPSHOT.jar
[WARNING] Cannot include project artifact: org.apache.cxf:apache-cxf:pom:2.3.0-SNAPSHOT; it
doesn't have an associated file or directory.
[INFO] Building zip: <https://hudson.apache.org/hudson/job/CXF-trunk-deploy/ws/trunk/distribution/target/apache-cxf-2.3.0-SNAPSHOT.zip>
[INFO] Building tar : <https://hudson.apache.org/hudson/job/CXF-trunk-deploy/ws/trunk/distribution/target/apache-cxf-2.3.0-SNAPSHOT-src.tar.gz>
[INFO] Building zip: <https://hudson.apache.org/hudson/job/CXF-trunk-deploy/ws/trunk/distribution/target/apache-cxf-2.3.0-SNAPSHOT-src.zip>
[INFO] [install:install {execution: default-install}]
[INFO] Installing <https://hudson.apache.org/hudson/job/CXF-trunk-deploy/ws/trunk/distribution/pom.xml>
to <https://hudson.apache.org/hudson/job/CXF-trunk-deploy/ws/.repository/org/apache/cxf/apache-cxf/2.3.0-SNAPSHOT/apache-cxf-2.3.0-SNAPSHOT.pom>
[INFO] Installing <https://hudson.apache.org/hudson/job/CXF-trunk-deploy/ws/trunk/distribution/target/apache-cxf-2.3.0-SNAPSHOT.tar.gz>
to <https://hudson.apache.org/hudson/job/CXF-trunk-deploy/ws/.repository/org/apache/cxf/apache-cxf/2.3.0-SNAPSHOT/apache-cxf-2.3.0-SNAPSHOT.tar.gz>
[INFO] Installing <https://hudson.apache.org/hudson/job/CXF-trunk-deploy/ws/trunk/distribution/target/apache-cxf-2.3.0-SNAPSHOT.zip>
to <https://hudson.apache.org/hudson/job/CXF-trunk-deploy/ws/.repository/org/apache/cxf/apache-cxf/2.3.0-SNAPSHOT/apache-cxf-2.3.0-SNAPSHOT.zip>
[INFO] Installing <https://hudson.apache.org/hudson/job/CXF-trunk-deploy/ws/trunk/distribution/target/apache-cxf-2.3.0-SNAPSHOT-src.tar.gz>
to <https://hudson.apache.org/hudson/job/CXF-trunk-deploy/ws/.repository/org/apache/cxf/apache-cxf/2.3.0-SNAPSHOT/apache-cxf-2.3.0-SNAPSHOT-src.tar.gz>
[INFO] Installing <https://hudson.apache.org/hudson/job/CXF-trunk-deploy/ws/trunk/distribution/target/apache-cxf-2.3.0-SNAPSHOT-src.zip>
to <https://hudson.apache.org/hudson/job/CXF-trunk-deploy/ws/.repository/org/apache/cxf/apache-cxf/2.3.0-SNAPSHOT/apache-cxf-2.3.0-SNAPSHOT-src.zip>
[INFO] [deploy:deploy {execution: default-deploy}]
[INFO] Retrieving previous build number from apache.snapshots.https
Uploading: https://repository.apache.org/content/repositories/snapshots/org/apache/cxf/apache-cxf/2.3.0-SNAPSHOT/apache-cxf-2.3.0-SNAPSHOT.pom
19K uploaded  (apache-cxf-2.3.0-SNAPSHOT.pom)
[INFO] Retrieving previous metadata from apache.snapshots.https
[INFO] Uploading repository metadata for: 'snapshot org.apache.cxf:apache-cxf:2.3.0-SNAPSHOT'
[INFO] Retrieving previous metadata from apache.snapshots.https
[INFO] Uploading repository metadata for: 'artifact org.apache.cxf:apache-cxf'
[INFO] Retrieving previous build number from apache.snapshots.https
Uploading: https://repository.apache.org/content/repositories/snapshots/org/apache/cxf/apache-cxf/2.3.0-SNAPSHOT/apache-cxf-2.3.0-SNAPSHOT.tar.gz
49856K uploaded  (apache-cxf-2.3.0-SNAPSHOT.tar.gz)
[INFO] Retrieving previous build number from apache.snapshots.https
Uploading: https://repository.apache.org/content/repositories/snapshots/org/apache/cxf/apache-cxf/2.3.0-SNAPSHOT/apache-cxf-2.3.0-SNAPSHOT.zip
52643K uploaded  (apache-cxf-2.3.0-SNAPSHOT.zip)
[INFO] Retrieving previous build number from apache.snapshots.https
Uploading: https://repository.apache.org/content/repositories/snapshots/org/apache/cxf/apache-cxf/2.3.0-SNAPSHOT/apache-cxf-2.3.0-SNAPSHOT-src.tar.gz
4684K uploaded  (apache-cxf-2.3.0-SNAPSHOT-src.tar.gz)
[INFO] Retrieving previous build number from apache.snapshots.https
Uploading: https://repository.apache.org/content/repositories/snapshots/org/apache/cxf/apache-cxf/2.3.0-SNAPSHOT/apache-cxf-2.3.0-SNAPSHOT-src.zip
[HUDSON] Archiving <https://hudson.apache.org/hudson/job/CXF-trunk-deploy/ws/.repository/org/apache/cxf/apache-cxf/2.3.0-SNAPSHOT/apache-cxf-2.3.0-SNAPSHOT.pom>
to /home/hudson/hudson/jobs/CXF-trunk-deploy/modules/org.apache.cxf$apache-cxf/builds/2010-08-17_06-35-16/archive/org.apache.cxf/apache-cxf/2.3.0-SNAPSHOT/apache-cxf-2.3.0-SNAPSHOT.pom
[HUDSON] Archiving <https://hudson.apache.org/hudson/job/CXF-trunk-deploy/ws/trunk/distribution/target/apache-cxf-2.3.0-SNAPSHOT.tar.gz>
to /home/hudson/hudson/jobs/CXF-trunk-deploy/modules/org.apache.cxf$apache-cxf/builds/2010-08-17_06-35-16/archive/org.apache.cxf/apache-cxf/2.3.0-SNAPSHOT/apache-cxf-2.3.0-SNAPSHOT.tar.gz
[HUDSON] Archiving <https://hudson.apache.org/hudson/job/CXF-trunk-deploy/ws/trunk/distribution/target/apache-cxf-2.3.0-SNAPSHOT.zip>
to /home/hudson/hudson/jobs/CXF-trunk-deploy/modules/org.apache.cxf$apache-cxf/builds/2010-08-17_06-35-16/archive/org.apache.cxf/apache-cxf/2.3.0-SNAPSHOT/apache-cxf-2.3.0-SNAPSHOT.zip
[HUDSON] Archiving <https://hudson.apache.org/hudson/job/CXF-trunk-deploy/ws/trunk/distribution/target/apache-cxf-2.3.0-SNAPSHOT-src.tar.gz>
to /home/hudson/hudson/jobs/CXF-trunk-deploy/modules/org.apache.cxf$apache-cxf/builds/2010-08-17_06-35-16/archive/org.apache.cxf/apache-cxf/2.3.0-SNAPSHOT/apache-cxf-2.3.0-SNAPSHOT-src.tar.gz
[HUDSON] Archiving <https://hudson.apache.org/hudson/job/CXF-trunk-deploy/ws/trunk/distribution/target/apache-cxf-2.3.0-SNAPSHOT-src.zip>
to /home/hudson/hudson/jobs/CXF-trunk-deploy/modules/org.apache.cxf$apache-cxf/builds/2010-08-17_06-35-16/archive/org.apache.cxf/apache-cxf/2.3.0-SNAPSHOT/apache-cxf-2.3.0-SNAPSHOT-src.zip
[INFO] ------------------------------------------------------------------------
[ERROR] BUILD ERROR
[INFO] ------------------------------------------------------------------------
[INFO] Error deploying artifact: Failed to transfer file: https://repository.apache.org/content/repositories/snapshots/org/apache/cxf/apache-cxf/2.3.0-SNAPSHOT/apache-cxf-2.3.0-SNAPSHOT-src.zip.
Return code is: 502

[INFO] ------------------------------------------------------------------------
[INFO] Trace
org.apache.maven.lifecycle.LifecycleExecutionException: Error deploying artifact: Failed to
transfer file: https://repository.apache.org/content/repositories/snapshots/org/apache/cxf/apache-cxf/2.3.0-SNAPSHOT/apache-cxf-2.3.0-SNAPSHOT-src.zip.
Return code is: 502
	at org.apache.maven.lifecycle.DefaultLifecycleExecutor.executeGoals(DefaultLifecycleExecutor.java:719)
	at org.apache.maven.lifecycle.DefaultLifecycleExecutor.executeGoalWithLifecycle(DefaultLifecycleExecutor.java:556)
	at org.apache.maven.lifecycle.DefaultLifecycleExecutor.executeGoal(DefaultLifecycleExecutor.java:535)
	at org.apache.maven.lifecycle.DefaultLifecycleExecutor.executeGoalAndHandleFailures(DefaultLifecycleExecutor.java:387)
	at org.apache.maven.lifecycle.DefaultLifecycleExecutor.executeTaskSegments(DefaultLifecycleExecutor.java:348)
	at org.apache.maven.lifecycle.DefaultLifecycleExecutor.execute(DefaultLifecycleExecutor.java:180)
	at org.apache.maven.lifecycle.LifecycleExecutorInterceptor.execute(LifecycleExecutorInterceptor.java:65)
	at org.apache.maven.DefaultMaven.doExecute(DefaultMaven.java:328)
	at org.apache.maven.DefaultMaven.execute(DefaultMaven.java:138)
	at org.apache.maven.cli.MavenCli.main(MavenCli.java:362)
	at sun.reflect.NativeMethodAccessorImpl.invoke0(Native Method)
	at sun.reflect.NativeMethodAccessorImpl.invoke(NativeMethodAccessorImpl.java:39)
	at sun.reflect.DelegatingMethodAccessorImpl.invoke(DelegatingMethodAccessorImpl.java:25)
	at java.lang.reflect.Method.invoke(Method.java:592)
	at org.codehaus.classworlds.Launcher.launchEnhanced(Launcher.java:315)
	at org.codehaus.classworlds.Launcher.launch(Launcher.java:255)
	at hudson.maven.agent.Main.launch(Main.java:165)
	at hudson.maven.MavenBuilder.call(MavenBuilder.java:165)
	at hudson.maven.MavenModuleSetBuild$Builder.call(MavenModuleSetBuild.java:708)
	at hudson.maven.MavenModuleSetBuild$Builder.call(MavenModuleSetBuild.java:652)
	at hudson.remoting.UserRequest.perform(UserRequest.java:114)
	at hudson.remoting.UserRequest.perform(UserRequest.java:48)
	at hudson.remoting.Request$2.run(Request.java:270)
	at java.util.concurrent.Executors$RunnableAdapter.call(Executors.java:417)
	at java.util.concurrent.FutureTask$Sync.innerRun(FutureTask.java:269)
	at java.util.concurrent.FutureTask.run(FutureTask.java:123)
	at java.util.concurrent.ThreadPoolExecutor$Worker.runTask(ThreadPoolExecutor.java:651)
	at java.util.concurrent.ThreadPoolExecutor$Worker.run(ThreadPoolExecutor.java:676)
	at java.lang.Thread.run(Thread.java:595)
Caused by: org.apache.maven.plugin.MojoExecutionException: Error deploying artifact: Failed
to transfer file: https://repository.apache.org/content/repositories/snapshots/org/apache/cxf/apache-cxf/2.3.0-SNAPSHOT/apache-cxf-2.3.0-SNAPSHOT-src.zip.
Return code is: 502
	at org.apache.maven.plugin.deploy.DeployMojo.execute(DeployMojo.java:189)
	at org.apache.maven.plugin.DefaultPluginManager.executeMojo(DefaultPluginManager.java:490)
	at hudson.maven.agent.PluginManagerInterceptor.executeMojo(PluginManagerInterceptor.java:182)
	at org.apache.maven.lifecycle.DefaultLifecycleExecutor.executeGoals(DefaultLifecycleExecutor.java:694)
	... 28 more
Caused by: org.apache.maven.artifact.deployer.ArtifactDeploymentException: Error deploying
artifact: Failed to transfer file: https://repository.apache.org/content/repositories/snapshots/org/apache/cxf/apache-cxf/2.3.0-SNAPSHOT/apache-cxf-2.3.0-SNAPSHOT-src.zip.
Return code is: 502
	at org.apache.maven.artifact.deployer.DefaultArtifactDeployer.deploy(DefaultArtifactDeployer.java:121)
	at org.apache.maven.plugin.deploy.DeployMojo.execute(DeployMojo.java:184)
	... 31 more
Caused by: org.apache.maven.wagon.TransferFailedException: Failed to transfer file: https://repository.apache.org/content/repositories/snapshots/org/apache/cxf/apache-cxf/2.3.0-SNAPSHOT/apache-cxf-2.3.0-SNAPSHOT-src.zip.
Return code is: 502
	at org.apache.maven.wagon.providers.http.LightweightHttpWagon.finishPutTransfer(LightweightHttpWagon.java:205)
	at org.apache.maven.wagon.AbstractWagon.putTransfer(AbstractWagon.java:413)
	at org.apache.maven.wagon.AbstractWagon.transfer(AbstractWagon.java:392)
	at org.apache.maven.wagon.AbstractWagon.putTransfer(AbstractWagon.java:365)
	at org.apache.maven.wagon.StreamWagon.put(StreamWagon.java:163)
	at org.apache.maven.artifact.manager.DefaultWagonManager.putRemoteFile(DefaultWagonManager.java:317)
	at org.apache.maven.artifact.manager.DefaultWagonManager.putArtifact(DefaultWagonManager.java:227)
	at org.apache.maven.artifact.deployer.DefaultArtifactDeployer.deploy(DefaultArtifactDeployer.java:107)
	... 32 more
[INFO] ------------------------------------------------------------------------
[INFO] Total time: 148 minutes 39 seconds
[INFO] Finished at: Tue Aug 17 09:04:04 UTC 2010
[INFO] Final Memory: 198M/418M
[INFO] ------------------------------------------------------------------------
Sending e-mails to: notifications@cxf.apache.org
channel stopped
[locks-and-latches] Releasing all the locks
[locks-and-latches] All the locks released


Mime
View raw message