cxf-notifications mailing list archives

Site index · List index
Message view « Date » · « Thread »
Top « Date » · « Thread »
From Apache Hudson Server <hud...@hudson.apache.org>
Subject Build failed in Hudson: CXF-trunk-deploy #390
Date Tue, 14 Sep 2010 06:52:33 GMT
See <https://hudson.apache.org/hudson/job/CXF-trunk-deploy/390/changes>

Changes:

[ffang] [CXF-2990]Response Context should not be empty even with a SOAP fault message when
use async invoke

------------------------------------------
[...truncated 9582 lines...]
[INFO] Retrieving previous build number from apache.snapshots.https
Uploading: https://repository.apache.org/content/repositories/snapshots/org/apache/cxf/systests/cxf-systests-ci-webapp/2.3.0-SNAPSHOT/cxf-systests-ci-webapp-2.3.0-SNAPSHOT-javadoc.jar
29K uploaded  (cxf-systests-ci-webapp-2.3.0-SNAPSHOT-javadoc.jar)
[HUDSON] Archiving <https://hudson.apache.org/hudson/job/CXF-trunk-deploy/ws/trunk/systests/container-integration/webapp/target/cxf-systests-ci-webapp-2.3.0-SNAPSHOT-sources.jar>
to /home/hudson/hudson/jobs/CXF-trunk-deploy/modules/org.apache.cxf.systests$cxf-systests-ci-webapp/builds/2010-09-14_06-04-02/archive/org.apache.cxf.systests/cxf-systests-ci-webapp/2.3.0-SNAPSHOT/cxf-systests-ci-webapp-2.3.0-SNAPSHOT-sources.jar
[HUDSON] Archiving <https://hudson.apache.org/hudson/job/CXF-trunk-deploy/ws/trunk/systests/container-integration/webapp/target/cxf-systests-ci-webapp-2.3.0-SNAPSHOT-javadoc.jar>
to /home/hudson/hudson/jobs/CXF-trunk-deploy/modules/org.apache.cxf.systests$cxf-systests-ci-webapp/builds/2010-09-14_06-04-02/archive/org.apache.cxf.systests/cxf-systests-ci-webapp/2.3.0-SNAPSHOT/cxf-systests-ci-webapp-2.3.0-SNAPSHOT-javadoc.jar
[INFO] ------------------------------------------------------------------------
[INFO] Building Apache CXF Container Integration Test Grizzly
[INFO]    task-segment: [clean, deploy]
[INFO] ------------------------------------------------------------------------
[INFO] [clean:clean {execution: default-clean}]
[INFO] Deleting <https://hudson.apache.org/hudson/job/CXF-trunk-deploy/ws/trunk/systests/container-integration/grizzly/target>
[INFO] [dependency:copy {execution: create-endorsed-dir}]
[INFO] Configured Artifact: org.apache.geronimo.specs:geronimo-jaxws_2.2_spec:?:jar
[INFO] Copying geronimo-jaxws_2.2_spec-1.0.jar to <https://hudson.apache.org/hudson/job/CXF-trunk-deploy/ws/trunk/systests/container-integration/grizzly/target/endorsed/geronimo-jaxws_2.2_spec-1.0.jar>
[INFO] [cxf-xml2fastinfoset:xml2fastinfoset {execution: xml2fastinfoset}]
[INFO] [remote-resources:process {execution: default}]
Downloading: http://repo1.maven.org/maven2/com/sun/grizzly/grizzly-http/1.9.18/grizzly-http-1.9.18.pom
[INFO] Unable to find resource 'com.sun.grizzly:grizzly-http:pom:1.9.18' in repository central
(http://repo1.maven.org/maven2)
Downloading: http://repo1.maven.org/maven2/org/jvnet/jax-ws-commons/jaxws-grizzly-httpspi/1.1/jaxws-grizzly-httpspi-1.1.pom
[INFO] Unable to find resource 'org.jvnet.jax-ws-commons:jaxws-grizzly-httpspi:pom:1.1' in
repository central (http://repo1.maven.org/maven2)
Downloading: http://repo1.maven.org/maven2/com/sun/grizzly/grizzly-http/1.9.18/grizzly-http-1.9.18.jar
Downloading: http://repo1.maven.org/maven2/org/jvnet/jax-ws-commons/jaxws-grizzly-httpspi/1.1/jaxws-grizzly-httpspi-1.1.jar
[INFO] Unable to find resource 'com.sun.grizzly:grizzly-http:jar:1.9.18' in repository central
(http://repo1.maven.org/maven2)
[INFO] Unable to find resource 'org.jvnet.jax-ws-commons:jaxws-grizzly-httpspi:jar:1.1' in
repository central (http://repo1.maven.org/maven2)
[HUDSON] Archiving <https://hudson.apache.org/hudson/job/CXF-trunk-deploy/ws/trunk/systests/container-integration/grizzly/pom.xml>
to /home/hudson/hudson/jobs/CXF-trunk-deploy/modules/org.apache.cxf.systests$cxf-systests-ci-grizzly/builds/2010-09-14_06-04-02/archive/org.apache.cxf.systests/cxf-systests-ci-grizzly/2.3.0-SNAPSHOT/pom.xml
[INFO] ------------------------------------------------------------------------
[ERROR] BUILD ERROR
[INFO] ------------------------------------------------------------------------
[INFO] Failed to resolve artifact.

Missing:
----------
1) com.sun.grizzly:grizzly-http:jar:1.9.18

  Try downloading the file manually from the project website.

  Then, install it using the command: 
      mvn install:install-file -DgroupId=com.sun.grizzly -DartifactId=grizzly-http -Dversion=1.9.18
-Dpackaging=jar -Dfile=/path/to/file

  Alternatively, if you host your own repository you can deploy the file there: 
      mvn deploy:deploy-file -DgroupId=com.sun.grizzly -DartifactId=grizzly-http -Dversion=1.9.18
-Dpackaging=jar -Dfile=/path/to/file -Durl=[url] -DrepositoryId=[id]

  Path to dependency: 
  	1) org.apache.cxf.systests:cxf-systests-ci-grizzly:jar:2.3.0-SNAPSHOT
  	2) com.sun.grizzly:grizzly-http:jar:1.9.18

2) org.jvnet.jax-ws-commons:jaxws-grizzly-httpspi:jar:1.1

  Try downloading the file manually from the project website.

  Then, install it using the command: 
      mvn install:install-file -DgroupId=org.jvnet.jax-ws-commons -DartifactId=jaxws-grizzly-httpspi
-Dversion=1.1 -Dpackaging=jar -Dfile=/path/to/file

  Alternatively, if you host your own repository you can deploy the file there: 
      mvn deploy:deploy-file -DgroupId=org.jvnet.jax-ws-commons -DartifactId=jaxws-grizzly-httpspi
-Dversion=1.1 -Dpackaging=jar -Dfile=/path/to/file -Durl=[url] -DrepositoryId=[id]

  Path to dependency: 
  	1) org.apache.cxf.systests:cxf-systests-ci-grizzly:jar:2.3.0-SNAPSHOT
  	2) org.jvnet.jax-ws-commons:jaxws-grizzly-httpspi:jar:1.1

----------
2 required artifacts are missing.

for artifact: 
  org.apache.cxf.systests:cxf-systests-ci-grizzly:jar:2.3.0-SNAPSHOT

from the specified remote repositories:
  central (http://repo1.maven.org/maven2),
  Nexus (http://repository.apache.org/snapshots)



[INFO] ------------------------------------------------------------------------
[INFO] Trace
org.apache.maven.lifecycle.LifecycleExecutionException: Failed to resolve dependencies for
one or more projects in the reactor. Reason: Missing:
----------
1) com.sun.grizzly:grizzly-http:jar:1.9.18

  Try downloading the file manually from the project website.

  Then, install it using the command: 
      mvn install:install-file -DgroupId=com.sun.grizzly -DartifactId=grizzly-http -Dversion=1.9.18
-Dpackaging=jar -Dfile=/path/to/file

  Alternatively, if you host your own repository you can deploy the file there: 
      mvn deploy:deploy-file -DgroupId=com.sun.grizzly -DartifactId=grizzly-http -Dversion=1.9.18
-Dpackaging=jar -Dfile=/path/to/file -Durl=[url] -DrepositoryId=[id]

  Path to dependency: 
  	1) org.apache.cxf.systests:cxf-systests-ci-grizzly:jar:2.3.0-SNAPSHOT
  	2) com.sun.grizzly:grizzly-http:jar:1.9.18

2) org.jvnet.jax-ws-commons:jaxws-grizzly-httpspi:jar:1.1

  Try downloading the file manually from the project website.

  Then, install it using the command: 
      mvn install:install-file -DgroupId=org.jvnet.jax-ws-commons -DartifactId=jaxws-grizzly-httpspi
-Dversion=1.1 -Dpackaging=jar -Dfile=/path/to/file

  Alternatively, if you host your own repository you can deploy the file there: 
      mvn deploy:deploy-file -DgroupId=org.jvnet.jax-ws-commons -DartifactId=jaxws-grizzly-httpspi
-Dversion=1.1 -Dpackaging=jar -Dfile=/path/to/file -Durl=[url] -DrepositoryId=[id]

  Path to dependency: 
  	1) org.apache.cxf.systests:cxf-systests-ci-grizzly:jar:2.3.0-SNAPSHOT
  	2) org.jvnet.jax-ws-commons:jaxws-grizzly-httpspi:jar:1.1

----------
2 required artifacts are missing.

for artifact: 
  org.apache.cxf.systests:cxf-systests-ci-grizzly:jar:2.3.0-SNAPSHOT

from the specified remote repositories:
  central (http://repo1.maven.org/maven2),
  Nexus (http://repository.apache.org/snapshots)


	at org.apache.maven.lifecycle.DefaultLifecycleExecutor.executeGoals(DefaultLifecycleExecutor.java:719)
	at org.apache.maven.lifecycle.DefaultLifecycleExecutor.executeGoalWithLifecycle(DefaultLifecycleExecutor.java:556)
	at org.apache.maven.lifecycle.DefaultLifecycleExecutor.executeGoal(DefaultLifecycleExecutor.java:535)
	at org.apache.maven.lifecycle.DefaultLifecycleExecutor.executeGoalAndHandleFailures(DefaultLifecycleExecutor.java:387)
	at org.apache.maven.lifecycle.DefaultLifecycleExecutor.executeTaskSegments(DefaultLifecycleExecutor.java:348)
	at org.apache.maven.lifecycle.DefaultLifecycleExecutor.execute(DefaultLifecycleExecutor.java:180)
	at org.apache.maven.lifecycle.LifecycleExecutorInterceptor.execute(LifecycleExecutorInterceptor.java:65)
	at org.apache.maven.DefaultMaven.doExecute(DefaultMaven.java:328)
	at org.apache.maven.DefaultMaven.execute(DefaultMaven.java:138)
	at org.apache.maven.cli.MavenCli.main(MavenCli.java:362)
	at sun.reflect.NativeMethodAccessorImpl.invoke0(Native Method)
	at sun.reflect.NativeMethodAccessorImpl.invoke(NativeMethodAccessorImpl.java:39)
	at sun.reflect.DelegatingMethodAccessorImpl.invoke(DelegatingMethodAccessorImpl.java:25)
	at java.lang.reflect.Method.invoke(Method.java:592)
	at org.codehaus.classworlds.Launcher.launchEnhanced(Launcher.java:315)
	at org.codehaus.classworlds.Launcher.launch(Launcher.java:255)
	at hudson.maven.agent.Main.launch(Main.java:165)
	at hudson.maven.MavenBuilder.call(MavenBuilder.java:165)
	at hudson.maven.MavenModuleSetBuild$Builder.call(MavenModuleSetBuild.java:681)
	at hudson.maven.MavenModuleSetBuild$Builder.call(MavenModuleSetBuild.java:625)
	at hudson.remoting.UserRequest.perform(UserRequest.java:114)
	at hudson.remoting.UserRequest.perform(UserRequest.java:48)
	at hudson.remoting.Request$2.run(Request.java:270)
	at java.util.concurrent.Executors$RunnableAdapter.call(Executors.java:417)
	at java.util.concurrent.FutureTask$Sync.innerRun(FutureTask.java:269)
	at java.util.concurrent.FutureTask.run(FutureTask.java:123)
	at java.util.concurrent.ThreadPoolExecutor$Worker.runTask(ThreadPoolExecutor.java:651)
	at java.util.concurrent.ThreadPoolExecutor$Worker.run(ThreadPoolExecutor.java:676)
	at java.lang.Thread.run(Thread.java:595)
Caused by: org.apache.maven.plugin.MojoExecutionException: Failed to resolve dependencies
for one or more projects in the reactor. Reason: Missing:
----------
1) com.sun.grizzly:grizzly-http:jar:1.9.18

  Try downloading the file manually from the project website.

  Then, install it using the command: 
      mvn install:install-file -DgroupId=com.sun.grizzly -DartifactId=grizzly-http -Dversion=1.9.18
-Dpackaging=jar -Dfile=/path/to/file

  Alternatively, if you host your own repository you can deploy the file there: 
      mvn deploy:deploy-file -DgroupId=com.sun.grizzly -DartifactId=grizzly-http -Dversion=1.9.18
-Dpackaging=jar -Dfile=/path/to/file -Durl=[url] -DrepositoryId=[id]

  Path to dependency: 
  	1) org.apache.cxf.systests:cxf-systests-ci-grizzly:jar:2.3.0-SNAPSHOT
  	2) com.sun.grizzly:grizzly-http:jar:1.9.18

2) org.jvnet.jax-ws-commons:jaxws-grizzly-httpspi:jar:1.1

  Try downloading the file manually from the project website.

  Then, install it using the command: 
      mvn install:install-file -DgroupId=org.jvnet.jax-ws-commons -DartifactId=jaxws-grizzly-httpspi
-Dversion=1.1 -Dpackaging=jar -Dfile=/path/to/file

  Alternatively, if you host your own repository you can deploy the file there: 
      mvn deploy:deploy-file -DgroupId=org.jvnet.jax-ws-commons -DartifactId=jaxws-grizzly-httpspi
-Dversion=1.1 -Dpackaging=jar -Dfile=/path/to/file -Durl=[url] -DrepositoryId=[id]

  Path to dependency: 
  	1) org.apache.cxf.systests:cxf-systests-ci-grizzly:jar:2.3.0-SNAPSHOT
  	2) org.jvnet.jax-ws-commons:jaxws-grizzly-httpspi:jar:1.1

----------
2 required artifacts are missing.

for artifact: 
  org.apache.cxf.systests:cxf-systests-ci-grizzly:jar:2.3.0-SNAPSHOT

from the specified remote repositories:
  central (http://repo1.maven.org/maven2),
  Nexus (http://repository.apache.org/snapshots)


	at org.apache.maven.plugin.resources.remote.ProcessRemoteResourcesMojo.resolveProjectArtifacts(ProcessRemoteResourcesMojo.java:702)
	at org.apache.maven.plugin.resources.remote.ProcessRemoteResourcesMojo.getProjects(ProcessRemoteResourcesMojo.java:602)
	at org.apache.maven.plugin.resources.remote.ProcessRemoteResourcesMojo.configureVelocityContext(ProcessRemoteResourcesMojo.java:969)
	at org.apache.maven.plugin.resources.remote.ProcessRemoteResourcesMojo.execute(ProcessRemoteResourcesMojo.java:492)
	at org.apache.maven.plugin.DefaultPluginManager.executeMojo(DefaultPluginManager.java:490)
	at hudson.maven.agent.PluginManagerInterceptor.executeMojo(PluginManagerInterceptor.java:182)
	at org.apache.maven.lifecycle.DefaultLifecycleExecutor.executeGoals(DefaultLifecycleExecutor.java:694)
	... 28 more
Caused by: org.apache.maven.artifact.resolver.MultipleArtifactsNotFoundException: Missing:
----------
1) com.sun.grizzly:grizzly-http:jar:1.9.18

  Try downloading the file manually from the project website.

  Then, install it using the command: 
      mvn install:install-file -DgroupId=com.sun.grizzly -DartifactId=grizzly-http -Dversion=1.9.18
-Dpackaging=jar -Dfile=/path/to/file

  Alternatively, if you host your own repository you can deploy the file there: 
      mvn deploy:deploy-file -DgroupId=com.sun.grizzly -DartifactId=grizzly-http -Dversion=1.9.18
-Dpackaging=jar -Dfile=/path/to/file -Durl=[url] -DrepositoryId=[id]

  Path to dependency: 
  	1) org.apache.cxf.systests:cxf-systests-ci-grizzly:jar:2.3.0-SNAPSHOT
  	2) com.sun.grizzly:grizzly-http:jar:1.9.18

2) org.jvnet.jax-ws-commons:jaxws-grizzly-httpspi:jar:1.1

  Try downloading the file manually from the project website.

  Then, install it using the command: 
      mvn install:install-file -DgroupId=org.jvnet.jax-ws-commons -DartifactId=jaxws-grizzly-httpspi
-Dversion=1.1 -Dpackaging=jar -Dfile=/path/to/file

  Alternatively, if you host your own repository you can deploy the file there: 
      mvn deploy:deploy-file -DgroupId=org.jvnet.jax-ws-commons -DartifactId=jaxws-grizzly-httpspi
-Dversion=1.1 -Dpackaging=jar -Dfile=/path/to/file -Durl=[url] -DrepositoryId=[id]

  Path to dependency: 
  	1) org.apache.cxf.systests:cxf-systests-ci-grizzly:jar:2.3.0-SNAPSHOT
  	2) org.jvnet.jax-ws-commons:jaxws-grizzly-httpspi:jar:1.1

----------
2 required artifacts are missing.

for artifact: 
  org.apache.cxf.systests:cxf-systests-ci-grizzly:jar:2.3.0-SNAPSHOT

from the specified remote repositories:
  central (http://repo1.maven.org/maven2),
  Nexus (http://repository.apache.org/snapshots)


	at org.apache.maven.artifact.resolver.DefaultArtifactResolver.resolveTransitively(DefaultArtifactResolver.java:360)
	at org.apache.maven.artifact.resolver.DefaultArtifactResolver.resolveTransitively(DefaultArtifactResolver.java:304)
	at org.apache.maven.shared.artifact.resolver.DefaultProjectDependenciesResolver.resolve(DefaultProjectDependenciesResolver.java:140)
	at org.apache.maven.shared.artifact.resolver.DefaultProjectDependenciesResolver.resolve(DefaultProjectDependenciesResolver.java:187)
	at org.apache.maven.plugin.resources.remote.ProcessRemoteResourcesMojo.resolveProjectArtifacts(ProcessRemoteResourcesMojo.java:697)
	... 34 more
[INFO] ------------------------------------------------------------------------
[INFO] Total time: 48 minutes 21 seconds
[INFO] Finished at: Tue Sep 14 06:52:31 UTC 2010
[INFO] Final Memory: 126M/240M
[INFO] ------------------------------------------------------------------------
Sending e-mails to: notifications@cxf.apache.org
channel stopped
[locks-and-latches] Releasing all the locks
[locks-and-latches] All the locks released


Mime
View raw message