cxf-notifications mailing list archives

Site index · List index
Message view « Date » · « Thread »
Top « Date » · « Thread »
From Apache Hudson Server <hud...@hudson.apache.org>
Subject Build failed in Hudson: cxf-wss4j-1.6-port #47
Date Tue, 11 Jan 2011 15:07:57 GMT
See <https://hudson.apache.org/hudson/job/cxf-wss4j-1.6-port/47/>

------------------------------------------
[...truncated 3898 lines...]
Tests run: 1, Failures: 0, Errors: 0, Skipped: 0, Time elapsed: 0.003 sec
Running org.apache.cxf.ws.policy.attachment.reference.ReferenceResolverTest
Tests run: 3, Failures: 0, Errors: 0, Skipped: 0, Time elapsed: 0.048 sec
Running org.apache.cxf.ws.policy.attachment.external.PolicyAttachmentTest
Tests run: 6, Failures: 0, Errors: 0, Skipped: 0, Time elapsed: 0.027 sec
Running org.apache.cxf.ws.policy.attachment.external.DomainExpressionBuilderRegistryTest
Tests run: 2, Failures: 0, Errors: 0, Skipped: 0, Time elapsed: 0.005 sec
Running org.apache.cxf.ws.policy.spring.PolicyBeansTest
Tests run: 1, Failures: 0, Errors: 0, Skipped: 0, Time elapsed: 0.166 sec
Running org.apache.cxf.ws.policy.builder.primitive.NestedPrimitiveAssertionTest
Tests run: 3, Failures: 0, Errors: 0, Skipped: 0, Time elapsed: 0.023 sec
Running org.apache.cxf.ws.policy.PolicyAnnotationTest
Tests run: 1, Failures: 0, Errors: 0, Skipped: 0, Time elapsed: 0.731 sec
Running org.apache.cxf.ws.policy.PolicyBuilderTest
Tests run: 3, Failures: 0, Errors: 0, Skipped: 0, Time elapsed: 0.009 sec
Running org.apache.cxf.ws.policy.EffectivePolicyImplTest
Tests run: 9, Failures: 0, Errors: 0, Skipped: 0, Time elapsed: 0.016 sec
Running org.apache.cxf.ws.policy.attachment.wsdl11.Wsdl11AttachmentPolicyProviderTest
Tests run: 7, Failures: 0, Errors: 0, Skipped: 0, Time elapsed: 0.245 sec
Running org.apache.cxf.ws.policy.attachment.external.ExternalAttachmentProviderTest
Tests run: 11, Failures: 0, Errors: 0, Skipped: 0, Time elapsed: 0.04 sec
Running org.apache.cxf.ws.policy.selector.MinimalMaximalAlternativeSelectorTest
Tests run: 2, Failures: 0, Errors: 0, Skipped: 0, Time elapsed: 0.004 sec
Running org.apache.cxf.ws.policy.PolicyVerificationInInterceptorTest
Tests run: 2, Failures: 0, Errors: 0, Skipped: 0, Time elapsed: 0.018 sec
Running org.apache.cxf.ws.policy.PolicyRegistryImplTest
Tests run: 1, Failures: 0, Errors: 0, Skipped: 0, Time elapsed: 0.002 sec
Running org.apache.cxf.ws.policy.attachment.external.EndpointReferenceDomainExpressionTest
Tests run: 1, Failures: 0, Errors: 0, Skipped: 0, Time elapsed: 0.02 sec
Running org.apache.cxf.ws.policy.PolicyEngineTest
Tests run: 26, Failures: 0, Errors: 0, Skipped: 0, Time elapsed: 0.03 sec
Running org.apache.cxf.ws.policy.PolicyVerificationOutInterceptorTest
Tests run: 1, Failures: 0, Errors: 0, Skipped: 0, Time elapsed: 0.015 sec

Results :

Tests run: 104, Failures: 0, Errors: 0, Skipped: 1

[HUDSON] Recording test results
[INFO] [jar:jar {execution: default-jar}]
[INFO] Building jar: <https://hudson.apache.org/hudson/job/cxf-wss4j-1.6-port/ws/wss4j-1.6-port/rt/ws/policy/target/cxf-rt-ws-policy-2.4.0-SNAPSHOT.jar>
[INFO] [install:install {execution: default-install}]
[INFO] Installing <https://hudson.apache.org/hudson/job/cxf-wss4j-1.6-port/ws/wss4j-1.6-port/rt/ws/policy/target/cxf-rt-ws-policy-2.4.0-SNAPSHOT.jar>
to /home/hudson/.m2/repository/org/apache/cxf/cxf-rt-ws-policy/2.4.0-SNAPSHOT/cxf-rt-ws-policy-2.4.0-SNAPSHOT.jar
[HUDSON] Archiving <https://hudson.apache.org/hudson/job/cxf-wss4j-1.6-port/ws/wss4j-1.6-port/rt/ws/policy/target/cxf-rt-ws-policy-2.4.0-SNAPSHOT.jar>
to /home/hudson/hudson/jobs/cxf-wss4j-1.6-port/modules/org.apache.cxf$cxf-rt-ws-policy/builds/2011-01-11_14-51-33/archive/org.apache.cxf/cxf-rt-ws-policy/2.4.0-SNAPSHOT/cxf-rt-ws-policy-2.4.0-SNAPSHOT.jar
[INFO] ------------------------------------------------------------------------
[INFO] Building Apache CXF Runtime WS Reliable Messaging
[INFO]    task-segment: [clean, install]
[INFO] ------------------------------------------------------------------------
[INFO] [clean:clean {execution: default-clean}]
[INFO] Deleting <https://hudson.apache.org/hudson/job/cxf-wss4j-1.6-port/ws/wss4j-1.6-port/rt/ws/rm/target>
[INFO] [checkstyle:checkstyle {execution: validate}]
[INFO] Starting audit...
Audit done.

[INFO] Preparing pmd:check
[HUDSON] Archiving <https://hudson.apache.org/hudson/job/cxf-wss4j-1.6-port/ws/wss4j-1.6-port/rt/ws/rm/pom.xml>
to /home/hudson/hudson/jobs/cxf-wss4j-1.6-port/modules/org.apache.cxf$cxf-rt-ws-rm/builds/2011-01-11_14-51-33/archive/org.apache.cxf/cxf-rt-ws-rm/2.4.0-SNAPSHOT/pom.xml
[INFO] [pmd:pmd {execution: pmd}]
[INFO] [pmd:check {execution: validate}]
[INFO] 
[INFO] [cxf-xml2fastinfoset:xml2fastinfoset {execution: xml2fastinfoset}]
[INFO] [cxf-xjc:xsdtojava {execution: generate-sources}]
[INFO] [remote-resources:process {execution: default}]
[INFO] [resources:resources {execution: default-resources}]
[INFO] Using 'UTF-8' encoding to copy filtered resources.
[INFO] Copying 3 resources
[INFO] Copying 10 resources
[INFO] skip non existing resourceDirectory <https://hudson.apache.org/hudson/job/cxf-wss4j-1.6-port/ws/wss4j-1.6-port/rt/ws/rm/src/main/resources-filtered>
[INFO] Copying 1 resource
[INFO] Copying 3 resources
[INFO] [compiler:compile {execution: default-compile}]
[INFO] Compiling 68 source files to <https://hudson.apache.org/hudson/job/cxf-wss4j-1.6-port/ws/wss4j-1.6-port/rt/ws/rm/target/classes>
[INFO] [resources:testResources {execution: default-testResources}]
[INFO] Using 'UTF-8' encoding to copy filtered resources.
[INFO] Copying 9 resources
[INFO] skip non existing resourceDirectory <https://hudson.apache.org/hudson/job/cxf-wss4j-1.6-port/ws/wss4j-1.6-port/rt/ws/rm/src/test/resources>
[INFO] skip non existing resourceDirectory <https://hudson.apache.org/hudson/job/cxf-wss4j-1.6-port/ws/wss4j-1.6-port/rt/ws/rm/target/generated/src/test/resources>
[INFO] Copying 3 resources
[INFO] [compiler:testCompile {execution: default-testCompile}]
[INFO] Compiling 21 source files to <https://hudson.apache.org/hudson/job/cxf-wss4j-1.6-port/ws/wss4j-1.6-port/rt/ws/rm/target/test-classes>
[INFO] [surefire:test {execution: default-test}]
[INFO] Surefire report directory: <https://hudson.apache.org/hudson/job/cxf-wss4j-1.6-port/ws/wss4j-1.6-port/rt/ws/rm/target/surefire-reports>

-------------------------------------------------------
 T E S T S
-------------------------------------------------------
Running org.apache.cxf.ws.rm.soap.RMSoapInterceptorTest
Tests run: 8, Failures: 0, Errors: 0, Skipped: 0, Time elapsed: 1.128 sec
Running org.apache.cxf.ws.rm.persistence.jdbc.RMTxStoreConfigurationTest
Tests run: 1, Failures: 0, Errors: 0, Skipped: 0, Time elapsed: 0.21 sec
Running org.apache.cxf.ws.rm.RMManagerConfigurationTest
Tests run: 3, Failures: 0, Errors: 0, Skipped: 0, Time elapsed: 0.314 sec
Running org.apache.cxf.ws.rm.persistence.PersistenceUtilsTest
Tests run: 1, Failures: 0, Errors: 0, Skipped: 0, Time elapsed: 0.049 sec
Running org.apache.cxf.ws.rm.soap.RetransmissionQueueImplTest
Tests run: 11, Failures: 0, Errors: 0, Skipped: 0, Time elapsed: 0.181 sec
Running org.apache.cxf.ws.rm.RMContextUtilsTest
Tests run: 10, Failures: 0, Errors: 0, Skipped: 0, Time elapsed: 0.042 sec
Running org.apache.cxf.ws.rm.AbstractSequenceTest
Tests run: 1, Failures: 0, Errors: 0, Skipped: 0, Time elapsed: 0.002 sec
Running org.apache.cxf.ws.rm.DestinationTest
Tests run: 7, Failures: 0, Errors: 0, Skipped: 0, Time elapsed: 0.154 sec
Running org.apache.cxf.ws.rm.RMUtilsTest
Tests run: 1, Failures: 0, Errors: 0, Skipped: 0, Time elapsed: 0.081 sec
Running org.apache.cxf.ws.rm.AbstractRMInterceptorTest
Tests run: 5, Failures: 0, Errors: 0, Skipped: 0, Time elapsed: 0.08 sec
Running org.apache.cxf.ws.rm.SourceSequenceTest
Tests run: 8, Failures: 0, Errors: 0, Skipped: 0, Time elapsed: 1.029 sec
Running org.apache.cxf.ws.rm.RMEndpointTest
Tests run: 18, Failures: 0, Errors: 0, Skipped: 0, Time elapsed: 0.22 sec
Running org.apache.cxf.ws.rm.persistence.jdbc.RMTxStoreTest
Tests run: 9, Failures: 0, Errors: 0, Skipped: 0, Time elapsed: 1.252 sec
Running org.apache.cxf.ws.rm.AbstractEndpointTest
Tests run: 2, Failures: 0, Errors: 0, Skipped: 0, Time elapsed: 0.004 sec
Running org.apache.cxf.ws.rm.policy.PolicyUtilsTest
Tests run: 3, Failures: 0, Errors: 0, Skipped: 0, Time elapsed: 0.005 sec
Running org.apache.cxf.ws.rm.DestinationSequenceTest
Tests run: 25, Failures: 0, Errors: 0, Skipped: 0, Time elapsed: 2.238 sec
Running org.apache.cxf.ws.rm.soap.SoapFaultFactoryTest
Tests run: 6, Failures: 0, Errors: 0, Skipped: 0, Time elapsed: 0.12 sec
Running org.apache.cxf.ws.rm.RMInInterceptorTest
Tests run: 14, Failures: 0, Errors: 0, Skipped: 0, Time elapsed: 0.076 sec
Running org.apache.cxf.ws.rm.RMOutInterceptorTest
Tests run: 5, Failures: 0, Errors: 0, Skipped: 0, Time elapsed: 0.02 sec
Running org.apache.cxf.ws.rm.RMManagerTest
Tests run: 19, Failures: 0, Errors: 0, Skipped: 0, Time elapsed: 0.079 sec
Running org.apache.cxf.ws.rm.ProxyTest
Tests run: 12, Failures: 0, Errors: 0, Skipped: 0, Time elapsed: 0.067 sec

Results :

Tests run: 169, Failures: 0, Errors: 0, Skipped: 0

[HUDSON] Recording test results
[INFO] [jar:jar {execution: default-jar}]
[INFO] Building jar: <https://hudson.apache.org/hudson/job/cxf-wss4j-1.6-port/ws/wss4j-1.6-port/rt/ws/rm/target/cxf-rt-ws-rm-2.4.0-SNAPSHOT.jar>
[INFO] [install:install {execution: default-install}]
[INFO] Installing <https://hudson.apache.org/hudson/job/cxf-wss4j-1.6-port/ws/wss4j-1.6-port/rt/ws/rm/target/cxf-rt-ws-rm-2.4.0-SNAPSHOT.jar>
to /home/hudson/.m2/repository/org/apache/cxf/cxf-rt-ws-rm/2.4.0-SNAPSHOT/cxf-rt-ws-rm-2.4.0-SNAPSHOT.jar
[HUDSON] Archiving <https://hudson.apache.org/hudson/job/cxf-wss4j-1.6-port/ws/wss4j-1.6-port/rt/ws/rm/target/cxf-rt-ws-rm-2.4.0-SNAPSHOT.jar>
to /home/hudson/hudson/jobs/cxf-wss4j-1.6-port/modules/org.apache.cxf$cxf-rt-ws-rm/builds/2011-01-11_14-51-33/archive/org.apache.cxf/cxf-rt-ws-rm/2.4.0-SNAPSHOT/cxf-rt-ws-rm-2.4.0-SNAPSHOT.jar
[INFO] ------------------------------------------------------------------------
[INFO] Building Apache CXF Runtime WS Security
[INFO]    task-segment: [clean, install]
[INFO] ------------------------------------------------------------------------
[INFO] [clean:clean {execution: default-clean}]
[INFO] Deleting <https://hudson.apache.org/hudson/job/cxf-wss4j-1.6-port/ws/wss4j-1.6-port/rt/ws/security/target>
[INFO] snapshot org.apache.ws.security:wss4j:1.6-SNAPSHOT: checking for updates from apache.snapshots
Downloading: http://repository.apache.org/snapshots/org/apache/ws/security/wss4j/1.6-SNAPSHOT/wss4j-1.6-SNAPSHOT.pom
Downloading: http://repository.apache.org/snapshots/org/apache/ws/security/wss4j/1.6-SNAPSHOT/wss4j-1.6-SNAPSHOT.jar
310K downloaded  (wss4j-1.6-SNAPSHOT.jar)
[INFO] [checkstyle:checkstyle {execution: validate}]
[INFO] Starting audit...
Audit done.

[INFO] Preparing pmd:check
[HUDSON] Archiving <https://hudson.apache.org/hudson/job/cxf-wss4j-1.6-port/ws/wss4j-1.6-port/rt/ws/security/pom.xml>
to /home/hudson/hudson/jobs/cxf-wss4j-1.6-port/modules/org.apache.cxf$cxf-rt-ws-security/builds/2011-01-11_14-51-33/archive/org.apache.cxf/cxf-rt-ws-security/2.4.0-SNAPSHOT/pom.xml
[INFO] [pmd:pmd {execution: pmd}]
[INFO] [pmd:check {execution: validate}]
[INFO] 
[INFO] [cxf-xml2fastinfoset:xml2fastinfoset {execution: xml2fastinfoset}]
[INFO] [remote-resources:process {execution: default}]
[INFO] [resources:resources {execution: default-resources}]
[INFO] Using 'UTF-8' encoding to copy filtered resources.
[INFO] Copying 4 resources
[INFO] Copying 2 resources
[INFO] skip non existing resourceDirectory <https://hudson.apache.org/hudson/job/cxf-wss4j-1.6-port/ws/wss4j-1.6-port/rt/ws/security/src/main/resources-filtered>
[INFO] Copying 1 resource
[INFO] Copying 3 resources
[INFO] [compiler:compile {execution: default-compile}]
[INFO] Compiling 101 source files to <https://hudson.apache.org/hudson/job/cxf-wss4j-1.6-port/ws/wss4j-1.6-port/rt/ws/security/target/classes>
[INFO] -------------------------------------------------------------
[ERROR] COMPILATION ERROR : 
[INFO] -------------------------------------------------------------
[ERROR] <https://hudson.apache.org/hudson/job/cxf-wss4j-1.6-port/ws/wss4j-1.6-port/rt/ws/security/src/main/java/org/apache/cxf/ws/security/wss4j/policyhandlers/AsymmetricBindingHandler.java>:[492,77]
cannot find symbol
symbol  : variable TAG_DECRYPTED_KEY
location: class org.apache.ws.security.WSSecurityEngineResult

[ERROR] <https://hudson.apache.org/hudson/job/cxf-wss4j-1.6-port/ws/wss4j-1.6-port/rt/ws/security/src/main/java/org/apache/cxf/ws/security/trust/STSClient.java>:[892,50]
cannot find symbol
symbol  : variable TAG_DECRYPTED_KEY
location: class org.apache.ws.security.WSSecurityEngineResult

[ERROR] <https://hudson.apache.org/hudson/job/cxf-wss4j-1.6-port/ws/wss4j-1.6-port/rt/ws/security/src/main/java/org/apache/cxf/ws/security/wss4j/policyhandlers/SymmetricBindingHandler.java>:[773,77]
cannot find symbol
symbol  : variable TAG_DECRYPTED_KEY
location: class org.apache.ws.security.WSSecurityEngineResult

[INFO] 3 errors 
[INFO] -------------------------------------------------------------
[INFO] ------------------------------------------------------------------------
[ERROR] BUILD FAILURE
[INFO] ------------------------------------------------------------------------
[INFO] Compilation failure

<https://hudson.apache.org/hudson/job/cxf-wss4j-1.6-port/ws/wss4j-1.6-port/rt/ws/security/src/main/java/org/apache/cxf/ws/security/wss4j/policyhandlers/AsymmetricBindingHandler.java>:[492,77]
cannot find symbol
symbol  : variable TAG_DECRYPTED_KEY
location: class org.apache.ws.security.WSSecurityEngineResult

<https://hudson.apache.org/hudson/job/cxf-wss4j-1.6-port/ws/wss4j-1.6-port/rt/ws/security/src/main/java/org/apache/cxf/ws/security/trust/STSClient.java>:[892,50]
cannot find symbol
symbol  : variable TAG_DECRYPTED_KEY
location: class org.apache.ws.security.WSSecurityEngineResult

<https://hudson.apache.org/hudson/job/cxf-wss4j-1.6-port/ws/wss4j-1.6-port/rt/ws/security/src/main/java/org/apache/cxf/ws/security/wss4j/policyhandlers/SymmetricBindingHandler.java>:[773,77]
cannot find symbol
symbol  : variable TAG_DECRYPTED_KEY
location: class org.apache.ws.security.WSSecurityEngineResult


[INFO] ------------------------------------------------------------------------
[INFO] Trace
org.apache.maven.BuildFailureException: Compilation failure
	at org.apache.maven.lifecycle.DefaultLifecycleExecutor.executeGoals(DefaultLifecycleExecutor.java:715)
	at org.apache.maven.lifecycle.DefaultLifecycleExecutor.executeGoalWithLifecycle(DefaultLifecycleExecutor.java:556)
	at org.apache.maven.lifecycle.DefaultLifecycleExecutor.executeGoal(DefaultLifecycleExecutor.java:535)
	at org.apache.maven.lifecycle.DefaultLifecycleExecutor.executeGoalAndHandleFailures(DefaultLifecycleExecutor.java:387)
	at org.apache.maven.lifecycle.DefaultLifecycleExecutor.executeTaskSegments(DefaultLifecycleExecutor.java:348)
	at org.apache.maven.lifecycle.DefaultLifecycleExecutor.execute(DefaultLifecycleExecutor.java:180)
	at org.apache.maven.lifecycle.LifecycleExecutorInterceptor.execute(LifecycleExecutorInterceptor.java:65)
	at org.apache.maven.DefaultMaven.doExecute(DefaultMaven.java:328)
	at org.apache.maven.DefaultMaven.execute(DefaultMaven.java:138)
	at org.apache.maven.cli.MavenCli.main(MavenCli.java:362)
	at sun.reflect.NativeMethodAccessorImpl.invoke0(Native Method)
	at sun.reflect.NativeMethodAccessorImpl.invoke(NativeMethodAccessorImpl.java:39)
	at sun.reflect.DelegatingMethodAccessorImpl.invoke(DelegatingMethodAccessorImpl.java:25)
	at java.lang.reflect.Method.invoke(Method.java:597)
	at org.codehaus.classworlds.Launcher.launchEnhanced(Launcher.java:315)
	at org.codehaus.classworlds.Launcher.launch(Launcher.java:255)
	at hudson.maven.agent.Main.launch(Main.java:165)
	at hudson.maven.MavenBuilder.call(MavenBuilder.java:165)
	at hudson.maven.MavenModuleSetBuild$Builder.call(MavenModuleSetBuild.java:750)
	at hudson.maven.MavenModuleSetBuild$Builder.call(MavenModuleSetBuild.java:694)
	at hudson.remoting.UserRequest.perform(UserRequest.java:114)
	at hudson.remoting.UserRequest.perform(UserRequest.java:48)
	at hudson.remoting.Request$2.run(Request.java:270)
	at java.util.concurrent.Executors$RunnableAdapter.call(Executors.java:441)
	at java.util.concurrent.FutureTask$Sync.innerRun(FutureTask.java:303)
	at java.util.concurrent.FutureTask.run(FutureTask.java:138)
	at java.util.concurrent.ThreadPoolExecutor$Worker.runTask(ThreadPoolExecutor.java:886)
	at java.util.concurrent.ThreadPoolExecutor$Worker.run(ThreadPoolExecutor.java:908)
	at java.lang.Thread.run(Thread.java:619)
Caused by: org.apache.maven.plugin.CompilationFailureException: Compilation failure
	at org.apache.maven.plugin.AbstractCompilerMojo.execute(AbstractCompilerMojo.java:656)
	at org.apache.maven.plugin.CompilerMojo.execute(CompilerMojo.java:128)
	at org.apache.maven.plugin.DefaultPluginManager.executeMojo(DefaultPluginManager.java:490)
	at hudson.maven.agent.PluginManagerInterceptor.executeMojo(PluginManagerInterceptor.java:182)
	at org.apache.maven.lifecycle.DefaultLifecycleExecutor.executeGoals(DefaultLifecycleExecutor.java:694)
	... 28 more
[INFO] ------------------------------------------------------------------------
[INFO] Total time: 16 minutes 12 seconds
[INFO] Finished at: Tue Jan 11 07:07:54 PST 2011
[INFO] Final Memory: 138M/657M
[INFO] ------------------------------------------------------------------------
Sending e-mails to: notifications@cxf.apache.org
channel stopped


Mime
View raw message