cxf-notifications mailing list archives

Site index · List index
Message view « Date » · « Thread »
Top « Date » · « Thread »
From Apache Hudson Server <hud...@hudson.apache.org>
Subject Build failed in Hudson: CXF-trunk-deploy #483
Date Fri, 28 Jan 2011 07:01:20 GMT
See <https://hudson.apache.org/hudson/job/CXF-trunk-deploy/483/changes>

Changes:

[sergeyb] [CXF-3292] Fixing MultipartProvider to read maps

[ffang] [CXF-3289]idl2wsdl fails if reference to interface is used inside the interface itself.

------------------------------------------
[...truncated 18242 lines...]
Downloading: http://repo1.maven.org/maven2/org/apache/maven/maven-artifact/2.0.10/maven-artifact-2.0.10.pom
Downloaded: http://repo1.maven.org/maven2/org/apache/maven/maven-artifact/2.0.10/maven-artifact-2.0.10.pom
(2 KB at 1.8 KB/sec)
Downloading: http://repo1.maven.org/maven2/org/apache/maven/maven-plugin-registry/2.0.10/maven-plugin-registry-2.0.10.pom
Downloaded: http://repo1.maven.org/maven2/org/apache/maven/maven-plugin-registry/2.0.10/maven-plugin-registry-2.0.10.pom
(2 KB at 2.3 KB/sec)
Downloading: http://repo1.maven.org/maven2/commons-lang/commons-lang/1.0/commons-lang-1.0.pom
Downloaded: http://repo1.maven.org/maven2/commons-lang/commons-lang/1.0/commons-lang-1.0.pom
(3 KB at 3.0 KB/sec)
Downloading: http://repo1.maven.org/maven2/junit/junit/3.7/junit-3.7.pom
Downloaded: http://repo1.maven.org/maven2/junit/junit/3.7/junit-3.7.pom (745 B at 0.8 KB/sec)
mojoFailed org.apache.maven.plugins:maven-checkstyle-plugin:2.6(validate)
ignoring exception during new ExecutedMojo null
projectFailed org.apache.cxf:apache-cxf:2.4.0-SNAPSHOT
[HUDSON] Archiving <https://hudson.apache.org/hudson/job/CXF-trunk-deploy/ws/trunk/distribution/pom.xml>
to /home/hudson/hudson/jobs/CXF-trunk-deploy/modules/org.apache.cxf$apache-cxf/builds/2011-01-28_06-04-17/archive/org.apache.cxf/apache-cxf/2.4.0-SNAPSHOT/pom.xml
sessionEnded
[INFO] ------------------------------------------------------------------------
[INFO] Reactor Summary:
[INFO] 
[INFO] Apache CXF ........................................ SUCCESS [40.126s]
[INFO] Apache CXF Parent ................................. SUCCESS [35.253s]
[INFO] Apache CXF Common Utilities ....................... SUCCESS [2:50.009s]
[INFO] Apache CXF Common Schemas ......................... SUCCESS [18.129s]
[INFO] Apache CXF API .................................... SUCCESS [1:00.449s]
[INFO] Apache CXF Woodstox/MSV Schema Validation ......... SUCCESS [27.905s]
[INFO] Apache CXF XML Schema Validation with Xerces ...... SUCCESS [24.364s]
[INFO] Apache CXF Common ................................. SUCCESS [6.801s]
[INFO] Apache CXF Runtime Core ........................... SUCCESS [51.478s]
[INFO] Apache CXF Command Line Tools Common .............. SUCCESS [1:24.119s]
[INFO] Apache CXF Command Line Tools Validator ........... SUCCESS [26.091s]
[INFO] Apache CXF Command Line Tools WSDLTo Core ......... SUCCESS [28.666s]
[INFO] Apache CXF Command Line Tools WSDLTo JAXWS Frontend  SUCCESS [29.657s]
[INFO] Apache CXF WSDL Validator Maven2 Plugin ........... SUCCESS [24.458s]
[INFO] Apache CXF Command Line Tools WSDLTo JAXB Databinding  SUCCESS [25.746s]
[INFO] Apache CXF Code Generation Maven2 Plugins ......... SUCCESS [24.944s]
[INFO] Apache CXF Test Utilities ......................... SUCCESS [1:50.147s]
[INFO] Apache CXF Runtime JAXB DataBinding ............... SUCCESS [19.540s]
[INFO] Apache CXF Runtime XML Binding .................... SUCCESS [20.017s]
[INFO] Apache CXF Runtime SOAP Binding ................... SUCCESS [23.494s]
[INFO] Apache CXF Runtime Local Transport ................ SUCCESS [17.497s]
[INFO] Apache CXF Runtime Simple Frontend ................ SUCCESS [21.508s]
[INFO] Apache CXF Runtime Transport Common Used Classes .. SUCCESS [17.377s]
[INFO] Apache CXF Runtime HTTP Transport ................. SUCCESS [27.171s]
[INFO] Apache CXF Runtime HTTP Jetty Transport ........... SUCCESS [31.916s]
[INFO] Apache CXF Runtime WS Addressing .................. SUCCESS [23.985s]
[INFO] Apache CXF Runtime JAX-WS Frontend ................ SUCCESS [36.806s]
[INFO] Apache CXF Test Case Support ...................... SUCCESS [23.080s]
[INFO] Apache CXF Runtime Aegis Databinding .............. SUCCESS [32.941s]
[INFO] Apache CXF Runtime JavaScript Client Generator .... SUCCESS [22.778s]
[INFO] Apache CXF Command Line Tools WSDL to JavaScript Front End  SUCCESS [16.823s]
[INFO] Apache CXF Runtime Management ..................... SUCCESS [17.813s]
[INFO] Apache CXF Runtime JMS Transport .................. SUCCESS [23.877s]
[INFO] Apache CXF Runtime XmlBeans DataBinding ........... SUCCESS [22.143s]
[INFO] Apache CXF Command Line Tools WSDLTo Test ......... SUCCESS [15.140s]
[INFO] Apache CXF Command Line Tools WSDLTo Misctools .... SUCCESS [17.102s]
[INFO] Apache CXF Command Line Tools ..................... SUCCESS [3.990s]
[INFO] Apache CXF Command Line Tools WSDLTo .............. SUCCESS [6.466s]
[INFO] Apache CXF Command Line Tools JavaTo WS ........... SUCCESS [22.747s]
[INFO] Apache CXF Command Line Tools JavaTo .............. SUCCESS [4.538s]
[INFO] Apache CXF Runtime CORBA Binding .................. SUCCESS [26.518s]
[INFO] Apache CXF Command Line Tools CORBA ............... SUCCESS [26.153s]
[INFO] Apache CXF Runtime SDO DataBinding ................ SUCCESS [21.733s]
[INFO] Apache CXF Runtime HTTP Binding ................... SUCCESS [16.969s]
[INFO] Apache CXF Runtime Object Binding ................. SUCCESS [14.470s]
[INFO] Apache CXF Runtime Colocated Binding .............. SUCCESS [19.770s]
[INFO] Apache CXF Runtime JBI Binding .................... SUCCESS [20.645s]
[INFO] Apache CXF Runtime ................................ SUCCESS [5.337s]
[INFO] Apache CXF Runtime Bindings ....................... SUCCESS [4.741s]
[INFO] Apache CXF Runtime JAX-RS Frontend ................ SUCCESS [36.050s]
[INFO] Apache CXF Runtime JavaScript Frontend ............ SUCCESS [15.828s]
[INFO] Apache CXF HTTP Transport for OSGi ................ SUCCESS [16.672s]
[INFO] Apache CXF Runtime JBI Transport .................. SUCCESS [16.357s]
[INFO] Apache CXF Runtime WS Policy ...................... SUCCESS [25.902s]
[INFO] Apache CXF Runtime WS Reliable Messaging .......... SUCCESS [23.080s]
[INFO] Apache CXF Runtime WS Security .................... SUCCESS [27.230s]
[INFO] Apache CXF Runtime Web Management ................. SUCCESS [17.706s]
[INFO] Apache CXF JBI Integration ........................ SUCCESS [15.912s]
[INFO] Apache CXF JCA Connection ......................... SUCCESS [21.765s]
[INFO] Apache CXF Integration ............................ SUCCESS [4.711s]
[INFO] Apache CXF Java2WS Maven2 Plugin .................. SUCCESS [18.953s]
[INFO] Apache CXF CORBA Tools Maven2 Plugins ............. SUCCESS [21.432s]
[INFO] Apache CXF Archetype - Simple JAX-WS Java First ... SUCCESS [14.946s]
[INFO] Apache CXF Maven Archetypes ....................... SUCCESS [13.490s]
[INFO] Apache CXF Maven Plugins .......................... SUCCESS [5.164s]
[INFO] Apache CXF Container Integration System Tests ..... SUCCESS [5.368s]
[INFO] Apache CXF Container Integration Test Webapp ...... SUCCESS [1:23.780s]
[INFO] Apache CXF Container Integration Test Grizzly ..... SUCCESS [21.703s]
[INFO] Apache CXF Uncategorized System Tests ............. SUCCESS [26.774s]
[INFO] Apache CXF Transport System Tests ................. SUCCESS [24.819s]
[INFO] Apache CXF JAX-WS System Tests .................... SUCCESS [19.134s]
[INFO] Apache CXF Databinding System Tests ............... SUCCESS [22.832s]
[INFO] Apache CXF JAX-RS System Tests .................... SUCCESS [18.191s]
[INFO] Apache CXF WS-* Specifications System Tests ....... SUCCESS [21.133s]
[INFO] Test for writing wsdl to repo ..................... SUCCESS [20.799s]
[INFO] Test for generating code from wsdl in repo ........ SUCCESS [18.366s]
[INFO] Apache CXF System Tests ........................... SUCCESS [3.755s]
[INFO] Apache CXF System Tests for Maven Plugins ......... SUCCESS [4.039s]
[INFO] Apache CXF Bundle Parent .......................... SUCCESS [6.591s]
[INFO] Apache CXF Bundle Jar ............................. SUCCESS [2:45.083s]
[INFO] Apache CXF Minimal Bundle Jar ..................... SUCCESS [2:13.883s]
[INFO] Apache CXF JAX-RS Bundle Jar ...................... SUCCESS [1:17.190s]
[INFO] Apache CXF Manifest Jar ........................... SUCCESS [12.529s]
[INFO] Apache CXF Samples ................................ SUCCESS [0.732s]
[INFO] Colocated Demo using Document/Literal Style ....... SUCCESS [8.845s]
[INFO] JavaScript Client Demo using Document/Literal Style  SUCCESS [4.121s]
[INFO] Generated JavaScript Sample using JAX-WS and JSR-181  SUCCESS [2.526s]
[INFO] Java First demo service using the JAXWSFactoryBeans  SUCCESS [2.427s]
[INFO] Java First demo using JAX-WS and JMS .............. SUCCESS [2.507s]
[INFO] JAX-RS Content Negotiation Demo ................... SUCCESS [2.502s]
[INFO] JAX-RS Basic Demo With HTTPS communications ....... SUCCESS [2.892s]
[INFO] JAX-RS Basic Demo ................................. SUCCESS [2.513s]
[INFO] CXF sample using a callbak object ................. SUCCESS [5.205s]
[INFO] WSDL first demo using BARE Style in XML Binding (pure XML over HTTP)  SUCCESS [7.589s]
[INFO] JAX-WS Dispatch/Provider Demo ..................... SUCCESS [6.344s]
[INFO] WSDL first demo using Document/Literal Style and XMLBeans DataBinding  SUCCESS [6.036s]
[INFO] WSDL first demo using SOAP12 in Document/Literal Style  SUCCESS [3.750s]
[INFO] CXF Dynamic Client Sample ......................... SUCCESS [3.984s]
[INFO] JMS Transport Queue Demo using Document-Literal Style  SUCCESS [4.289s]
[INFO] RESTful Hello World Demo .......................... SUCCESS [2.561s]
[INFO] WSDL first demo using Document/Literal Style ...... SUCCESS [5.277s]
[INFO] CXF sample using the Aegis Binding without any webservice  SUCCESS [2.348s]
[INFO] Java First demo using JAX-WS APIs ................. SUCCESS [2.558s]
[INFO] WS-RM Demo ........................................ SUCCESS [4.080s]
[INFO] CXF Sample of Stream GZIP Interceptor ............. SUCCESS [3.923s]
[INFO] Spring HTTP Sample ................................ SUCCESS [2.843s]
[INFO] CXF WS-Security UT Demo ........................... SUCCESS [4.334s]
[INFO] WS-Security UT Sign Demo .......................... SUCCESS [4.013s]
[INFO] CXF WS-Security Sign Encoding Demo ................ SUCCESS [3.981s]
[INFO] WS-Security UT Policy Demo ........................ SUCCESS [3.960s]
[INFO] MTOM Demo for SWA and XOP ......................... SUCCESS [4.201s]
[INFO] JAX-WS Asynchronous Demo using Document/Literal Style  SUCCESS [3.869s]
[INFO] Java First POJO Sample ............................ SUCCESS [2.556s]
[INFO] WS-Policy Demo .................................... SUCCESS [4.251s]
[INFO] Hello World Client Demo using JavaScript .......... SUCCESS [3.888s]
[INFO] WSDL first demo using HTTPS ....................... SUCCESS [4.194s]
[INFO] WS-Addressing Demo ................................ SUCCESS [4.155s]
[INFO] Sample using SOAP Headers ......................... SUCCESS [3.897s]
[INFO] SOAP/JMS Transport Specification Demo using Document-Literal Style  SUCCESS [4.256s]
[INFO] CXF sample using WRAPPED Style in XML Binding (pure XML over HTTP)  SUCCESS [4.004s]
[INFO] RESTful HTTP Binding Demo ......................... SUCCESS [2.698s]
[INFO] CXF sample using code first POJO's and the Aegis Binding  SUCCESS [3.666s]
[INFO] Sample of JAX-* Service Using an Aegis Client ..... SUCCESS [2.424s]
[INFO] JAX-WS Handler Demo ............................... SUCCESS [4.098s]
[INFO] WSDL first demo using RPC-Literal Style ........... SUCCESS [3.898s]
[INFO] JMS Transport Publish/Subscribe Demo using Document-Literal Style  SUCCESS [3.946s]
[INFO] JAX-RS Spring Security Demo ....................... SUCCESS [2.803s]
[INFO] Apache CXF Distribution ........................... FAILURE [30.120s]
[INFO] ------------------------------------------------------------------------
[INFO] BUILD FAILURE
[INFO] ------------------------------------------------------------------------
[INFO] Total time: 56:48.749s
[INFO] Finished at: Thu Jan 27 23:01:17 GMT-08:00 2011
[INFO] Final Memory: 143M/205M
[INFO] ------------------------------------------------------------------------
mavenExecutionResult exceptions not empty
org.apache.maven.lifecycle.LifecycleExecutionException: Failed to execute goal org.apache.maven.plugins:maven-checkstyle-plugin:2.6:checkstyle
(validate) on project apache-cxf: Execution validate of goal org.apache.maven.plugins:maven-checkstyle-plugin:2.6:checkstyle
failed: Plugin org.apache.maven.plugins:maven-checkstyle-plugin:2.6 or one of its dependencies
could not be resolved: Failed to collect dependencies for org.apache.maven.plugins:maven-checkstyle-plugin:jar:2.6
()
	at org.apache.maven.lifecycle.internal.MojoExecutor.execute(MojoExecutor.java:225)
	at org.apache.maven.lifecycle.internal.MojoExecutor.execute(MojoExecutor.java:153)
	at org.apache.maven.lifecycle.internal.MojoExecutor.execute(MojoExecutor.java:145)
	at org.apache.maven.lifecycle.internal.LifecycleModuleBuilder.buildProject(LifecycleModuleBuilder.java:84)
	at org.apache.maven.lifecycle.internal.LifecycleModuleBuilder.buildProject(LifecycleModuleBuilder.java:59)
	at org.apache.maven.lifecycle.internal.LifecycleStarter.singleThreadedBuild(LifecycleStarter.java:183)
	at org.apache.maven.lifecycle.internal.LifecycleStarter.execute(LifecycleStarter.java:161)
	at org.apache.maven.DefaultMaven.doExecute(DefaultMaven.java:319)
	at org.apache.maven.DefaultMaven.execute(DefaultMaven.java:156)
	at org.jvnet.hudson.maven3.launcher.Maven3Launcher.main(Maven3Launcher.java:79)
	at sun.reflect.NativeMethodAccessorImpl.invoke0(Native Method)
	at sun.reflect.NativeMethodAccessorImpl.invoke(NativeMethodAccessorImpl.java:39)
	at sun.reflect.DelegatingMethodAccessorImpl.invoke(DelegatingMethodAccessorImpl.java:25)
	at java.lang.reflect.Method.invoke(Method.java:592)
	at org.codehaus.plexus.classworlds.launcher.Launcher.launchStandard(Launcher.java:329)
	at org.codehaus.plexus.classworlds.launcher.Launcher.launch(Launcher.java:239)
	at org.jvnet.hudson.maven3.agent.Maven3Main.launch(Maven3Main.java:145)
	at hudson.maven.Maven3Builder.call(Maven3Builder.java:124)
	at hudson.maven.Maven3Builder.call(Maven3Builder.java:71)
	at hudson.remoting.UserRequest.perform(UserRequest.java:114)
	at hudson.remoting.UserRequest.perform(UserRequest.java:48)
	at hudson.remoting.Request$2.run(Request.java:270)
	at java.util.concurrent.Executors$RunnableAdapter.call(Executors.java:417)
	at java.util.concurrent.FutureTask$Sync.innerRun(FutureTask.java:269)
	at java.util.concurrent.FutureTask.run(FutureTask.java:123)
	at java.util.concurrent.ThreadPoolExecutor$Worker.runTask(ThreadPoolExecutor.java:651)
	at java.util.concurrent.ThreadPoolExecutor$Worker.run(ThreadPoolExecutor.java:676)
	at java.lang.Thread.run(Thread.java:595)
Caused by: org.apache.maven.plugin.PluginExecutionException: Execution validate of goal org.apache.maven.plugins:maven-checkstyle-plugin:2.6:checkstyle
failed: Plugin org.apache.maven.plugins:maven-checkstyle-plugin:2.6 or one of its dependencies
could not be resolved: Failed to collect dependencies for org.apache.maven.plugins:maven-checkstyle-plugin:jar:2.6
()
	at org.apache.maven.plugin.DefaultBuildPluginManager.executeMojo(DefaultBuildPluginManager.java:86)
	at org.apache.maven.lifecycle.internal.MojoExecutor.execute(MojoExecutor.java:209)
	... 27 more
Caused by: org.apache.maven.plugin.PluginResolutionException: Plugin org.apache.maven.plugins:maven-checkstyle-plugin:2.6
or one of its dependencies could not be resolved: Failed to collect dependencies for org.apache.maven.plugins:maven-checkstyle-plugin:jar:2.6
()
	at org.apache.maven.plugin.internal.DefaultPluginDependenciesResolver.resolve(DefaultPluginDependenciesResolver.java:195)
	at org.apache.maven.plugin.internal.DefaultMavenPluginManager.createPluginRealm(DefaultMavenPluginManager.java:347)
	at org.apache.maven.plugin.internal.DefaultMavenPluginManager.setupPluginRealm(DefaultMavenPluginManager.java:315)
	at org.apache.maven.plugin.DefaultBuildPluginManager.getPluginRealm(DefaultBuildPluginManager.java:182)
	at org.apache.maven.plugin.DefaultBuildPluginManager.executeMojo(DefaultBuildPluginManager.java:82)
	... 28 more
Caused by: org.sonatype.aether.collection.DependencyCollectionException: Failed to collect
dependencies for org.apache.maven.plugins:maven-checkstyle-plugin:jar:2.6 ()
	at org.sonatype.aether.impl.internal.DefaultDependencyCollector.collectDependencies(DefaultDependencyCollector.java:251)
	at org.sonatype.aether.impl.internal.DefaultRepositorySystem.collectDependencies(DefaultRepositorySystem.java:318)
	at org.apache.maven.plugin.internal.DefaultPluginDependenciesResolver.resolve(DefaultPluginDependenciesResolver.java:184)
	... 32 more
Caused by: org.sonatype.aether.resolution.ArtifactDescriptorException: Failed to read artifact
descriptor for org.apache.maven:maven-settings:jar:2.0.10
	at org.apache.maven.repository.internal.DefaultArtifactDescriptorReader.loadPom(DefaultArtifactDescriptorReader.java:283)
	at org.apache.maven.repository.internal.DefaultArtifactDescriptorReader.readArtifactDescriptor(DefaultArtifactDescriptorReader.java:173)
	at org.sonatype.aether.impl.internal.DefaultDependencyCollector.process(DefaultDependencyCollector.java:419)
	at org.sonatype.aether.impl.internal.DefaultDependencyCollector.process(DefaultDependencyCollector.java:515)
	at org.sonatype.aether.impl.internal.DefaultDependencyCollector.process(DefaultDependencyCollector.java:515)
	at org.sonatype.aether.impl.internal.DefaultDependencyCollector.collectDependencies(DefaultDependencyCollector.java:233)
	... 34 more
Caused by: org.sonatype.aether.resolution.ArtifactResolutionException: Could not transfer
artifact org.apache.maven:maven-settings:pom:2.0.10 from/to central (http://repo1.maven.org/maven2):
Error transferring file: Connection timed out
	at org.sonatype.aether.impl.internal.DefaultArtifactResolver.resolveArtifacts(DefaultArtifactResolver.java:526)
	at org.sonatype.aether.impl.internal.DefaultArtifactResolver.resolveArtifact(DefaultArtifactResolver.java:214)
	at org.apache.maven.repository.internal.DefaultArtifactDescriptorReader.loadPom(DefaultArtifactDescriptorReader.java:268)
	... 39 more
Caused by: org.sonatype.aether.transfer.ArtifactTransferException: Could not transfer artifact
org.apache.maven:maven-settings:pom:2.0.10 from/to central (http://repo1.maven.org/maven2):
Error transferring file: Connection timed out
	at org.sonatype.aether.connector.wagon.WagonRepositoryConnector$4.wrap(WagonRepositoryConnector.java:949)
	at org.sonatype.aether.connector.wagon.WagonRepositoryConnector$4.wrap(WagonRepositoryConnector.java:940)
	at org.sonatype.aether.connector.wagon.WagonRepositoryConnector$GetTask.flush(WagonRepositoryConnector.java:696)
	at org.sonatype.aether.connector.wagon.WagonRepositoryConnector$GetTask.flush(WagonRepositoryConnector.java:690)
	at org.sonatype.aether.connector.wagon.WagonRepositoryConnector.get(WagonRepositoryConnector.java:435)
	at org.sonatype.aether.impl.internal.DefaultArtifactResolver.resolveArtifacts(DefaultArtifactResolver.java:438)
	... 41 more
Caused by: org.apache.maven.wagon.TransferFailedException: Error transferring file: Connection
timed out
	at org.apache.maven.wagon.providers.http.LightweightHttpWagon.fillInputData(LightweightHttpWagon.java:143)
	at org.apache.maven.wagon.StreamWagon.getInputStream(StreamWagon.java:116)
	at org.apache.maven.wagon.StreamWagon.getIfNewer(StreamWagon.java:88)
	at org.apache.maven.wagon.StreamWagon.get(StreamWagon.java:61)
	at org.sonatype.aether.connector.wagon.WagonRepositoryConnector$GetTask.run(WagonRepositoryConnector.java:605)
	... 3 more
Caused by: java.net.ConnectException: Connection timed out
	at java.net.PlainSocketImpl.socketConnect(Native Method)
	at java.net.PlainSocketImpl.doConnect(PlainSocketImpl.java:333)
	at java.net.PlainSocketImpl.connectToAddress(PlainSocketImpl.java:195)
	at java.net.PlainSocketImpl.connect(PlainSocketImpl.java:182)
	at java.net.Socket.connect(Socket.java:524)
	at java.net.Socket.connect(Socket.java:474)
	at sun.net.NetworkClient.doConnect(NetworkClient.java:157)
	at sun.net.www.http.HttpClient.openServer(HttpClient.java:388)
	at sun.net.www.http.HttpClient.openServer(HttpClient.java:523)
	at sun.net.www.http.HttpClient.<init>(HttpClient.java:231)
	at sun.net.www.http.HttpClient.New(HttpClient.java:304)
	at sun.net.www.http.HttpClient.New(HttpClient.java:321)
	at sun.net.www.protocol.http.HttpURLConnection.getNewHttpClient(HttpURLConnection.java:839)
	at sun.net.www.protocol.http.HttpURLConnection.plainConnect(HttpURLConnection.java:791)
	at sun.net.www.protocol.http.HttpURLConnection.connect(HttpURLConnection.java:716)
	at sun.net.www.protocol.http.HttpURLConnection.getInputStream(HttpURLConnection.java:960)
	at java.net.HttpURLConnection.getResponseCode(HttpURLConnection.java:367)
	at org.apache.maven.wagon.providers.http.LightweightHttpWagon.fillInputData(LightweightHttpWagon.java:115)
	... 7 more
Sending e-mails to: notifications@cxf.apache.org
channel stopped
[locks-and-latches] Releasing all the locks
[locks-and-latches] All the locks released


Mime
View raw message