cxf-notifications mailing list archives

Site index · List index
Message view « Date » · « Thread »
Top « Date » · « Thread »
From Apache Hudson Server <hud...@hudson.apache.org>
Subject Build failed in Jenkins: CXF-trunk-windows #57
Date Fri, 04 Mar 2011 22:23:47 GMT
See <https://hudson.apache.org/hudson/job/CXF-trunk-windows/57/changes>

Changes:

[dkulp] [CXF-3367] Add unit test
Patch from Aki Yoshida applied

[dkulp] Make the Spring bus build off the EM bus
Remove all the META-INF/cxf/cxf.extension things

[sergeyb] [CXF-3372] Adding some documentation and applying minor fixes

[sergeyb] [CXF-3372] Adding a helper for reading arbitrary log files with an optional scanning

------------------------------------------
[...truncated 3908 lines...]
Tests run: 1, Failures: 0, Errors: 0, Skipped: 0, Time elapsed: 0.003 sec
Running org.apache.cxf.ws.rm.DestinationSequenceTest
Tests run: 23, Failures: 1, Errors: 0, Skipped: 0, Time elapsed: 3.862 sec <<< FAILURE!
testAcknowledgeDeferred(org.apache.cxf.ws.rm.DestinationSequenceTest)  Time elapsed: 0.354
sec  <<< FAILURE!
java.lang.AssertionError: 
	at org.junit.Assert.fail(Assert.java:91)
	at org.junit.Assert.assertTrue(Assert.java:43)
	at org.junit.Assert.assertTrue(Assert.java:54)
	at org.apache.cxf.ws.rm.DestinationSequenceTest.testAcknowledgeDeferred(DestinationSequenceTest.java:429)
	at sun.reflect.NativeMethodAccessorImpl.invoke0(Native Method)
	at sun.reflect.NativeMethodAccessorImpl.invoke(NativeMethodAccessorImpl.java:39)
	at sun.reflect.DelegatingMethodAccessorImpl.invoke(DelegatingMethodAccessorImpl.java:25)
	at java.lang.reflect.Method.invoke(Method.java:592)
	at org.junit.runners.model.FrameworkMethod$1.runReflectiveCall(FrameworkMethod.java:44)
	at org.junit.internal.runners.model.ReflectiveCallable.run(ReflectiveCallable.java:15)
	at org.junit.runners.model.FrameworkMethod.invokeExplosively(FrameworkMethod.java:41)
	at org.junit.internal.runners.statements.InvokeMethod.evaluate(InvokeMethod.java:20)
	at org.junit.internal.runners.statements.RunBefores.evaluate(RunBefores.java:28)
	at org.junit.internal.runners.statements.RunAfters.evaluate(RunAfters.java:31)
	at org.junit.runners.BlockJUnit4ClassRunner.runChild(BlockJUnit4ClassRunner.java:76)
	at org.junit.runners.BlockJUnit4ClassRunner.runChild(BlockJUnit4ClassRunner.java:50)
	at org.junit.runners.ParentRunner$3.run(ParentRunner.java:193)
	at org.junit.runners.ParentRunner$1.schedule(ParentRunner.java:52)
	at org.junit.runners.ParentRunner.runChildren(ParentRunner.java:191)
	at org.junit.runners.ParentRunner.access$000(ParentRunner.java:42)
	at org.junit.runners.ParentRunner$2.evaluate(ParentRunner.java:184)
	at org.junit.runners.ParentRunner.run(ParentRunner.java:236)
	at org.apache.maven.surefire.junit4.JUnit4TestSet.execute(JUnit4TestSet.java:35)
	at org.apache.maven.surefire.junit4.JUnit4Provider.executeTestSet(JUnit4Provider.java:115)
	at org.apache.maven.surefire.junit4.JUnit4Provider.invoke(JUnit4Provider.java:97)
	at sun.reflect.NativeMethodAccessorImpl.invoke0(Native Method)
	at sun.reflect.NativeMethodAccessorImpl.invoke(NativeMethodAccessorImpl.java:39)
	at sun.reflect.DelegatingMethodAccessorImpl.invoke(DelegatingMethodAccessorImpl.java:25)
	at java.lang.reflect.Method.invoke(Method.java:592)
	at org.apache.maven.surefire.booter.ProviderFactory$ClassLoaderProxy.invoke(ProviderFactory.java:103)
	at $Proxy0.invoke(Unknown Source)
	at org.apache.maven.surefire.booter.SurefireStarter.invokeProvider(SurefireStarter.java:150)
	at org.apache.maven.surefire.booter.SurefireStarter.runSuitesInProcess(SurefireStarter.java:91)
	at org.apache.maven.surefire.booter.ForkedBooter.main(ForkedBooter.java:69)

Running org.apache.cxf.ws.rm.DestinationTest
Tests run: 7, Failures: 0, Errors: 0, Skipped: 0, Time elapsed: 0.146 sec
Running org.apache.cxf.ws.rm.ProxyTest
Exception in thread "Timer-1" java.lang.NullPointerException
	at org.apache.cxf.ws.rm.DestinationSequence$ImmediateFallbackAcknowledgment.run(DestinationSequence.java:448)
	at java.util.TimerThread.mainLoop(Timer.java:512)
	at java.util.TimerThread.run(Timer.java:462)
Tests run: 12, Failures: 0, Errors: 0, Skipped: 0, Time elapsed: 0.549 sec
Running org.apache.cxf.ws.rm.RMContextUtilsTest
Tests run: 10, Failures: 0, Errors: 0, Skipped: 0, Time elapsed: 0.719 sec
Running org.apache.cxf.ws.rm.RMEndpointTest
Tests run: 18, Failures: 0, Errors: 0, Skipped: 0, Time elapsed: 1.022 sec
Running org.apache.cxf.ws.rm.RMInInterceptorTest
Tests run: 14, Failures: 0, Errors: 0, Skipped: 0, Time elapsed: 0.084 sec
Running org.apache.cxf.ws.rm.RMManagerConfigurationTest
Tests run: 3, Failures: 0, Errors: 0, Skipped: 0, Time elapsed: 2.024 sec
Running org.apache.cxf.ws.rm.RMManagerTest
Tests run: 19, Failures: 0, Errors: 0, Skipped: 0, Time elapsed: 0.119 sec
Running org.apache.cxf.ws.rm.RMOutInterceptorTest
Tests run: 5, Failures: 0, Errors: 0, Skipped: 0, Time elapsed: 0.029 sec
Running org.apache.cxf.ws.rm.RMUtilsTest
Tests run: 1, Failures: 0, Errors: 0, Skipped: 0, Time elapsed: 0.002 sec
Running org.apache.cxf.ws.rm.SourceSequenceTest
Tests run: 8, Failures: 0, Errors: 0, Skipped: 0, Time elapsed: 1.011 sec
Running org.apache.cxf.ws.rm.persistence.PersistenceUtilsTest
Tests run: 1, Failures: 0, Errors: 0, Skipped: 0, Time elapsed: 0.107 sec
Running org.apache.cxf.ws.rm.persistence.jdbc.RMTxStoreConfigurationTest
Tests run: 1, Failures: 0, Errors: 0, Skipped: 0, Time elapsed: 0.479 sec
Running org.apache.cxf.ws.rm.persistence.jdbc.RMTxStoreTest
Tests run: 9, Failures: 0, Errors: 0, Skipped: 0, Time elapsed: 3.006 sec
Running org.apache.cxf.ws.rm.policy.PolicyUtilsTest
Tests run: 3, Failures: 0, Errors: 0, Skipped: 0, Time elapsed: 0.006 sec
Running org.apache.cxf.ws.rm.soap.RMSoapInterceptorTest
Tests run: 8, Failures: 0, Errors: 0, Skipped: 0, Time elapsed: 0.264 sec
Running org.apache.cxf.ws.rm.soap.RetransmissionQueueImplTest
Tests run: 11, Failures: 0, Errors: 0, Skipped: 0, Time elapsed: 0.164 sec
Running org.apache.cxf.ws.rm.soap.SoapFaultFactoryTest
Tests run: 6, Failures: 0, Errors: 0, Skipped: 0, Time elapsed: 0.545 sec

Results :

Failed tests: 
  testAcknowledgeDeferred(org.apache.cxf.ws.rm.DestinationSequenceTest)

Tests run: 167, Failures: 1, Errors: 0, Skipped: 0

[ERROR] There are test failures.

Please refer to C:\hudson\hudson-slave\workspace\CXF-trunk-windows\trunk w spaces\rt\ws\rm\target\surefire-reports
for the individual test results.
[JENKINS] Recording test results
Downloading: http://repository.apache.org/snapshots//org/apache/neethi/neethi/3.0.0-SNAPSHOT/neethi-3.0.0-SNAPSHOT.jar
[INFO] [jar:jar {execution: default-jar}]
[INFO] Building jar: C:\hudson\hudson-slave\workspace\CXF-trunk-windows\trunk w spaces\rt\ws\rm\target\cxf-rt-ws-rm-2.4.0-SNAPSHOT.jar
[INFO] [install:install {execution: default-install}]
[INFO] Installing C:\hudson\hudson-slave\workspace\CXF-trunk-windows\trunk w spaces\rt\ws\rm\target\cxf-rt-ws-rm-2.4.0-SNAPSHOT.jar
to <https://hudson.apache.org/hudson/job/CXF-trunk-windows/ws/.repository\org\apache\cxf\cxf-rt-ws-rm\2.4.0-SNAPSHOT\cxf-rt-ws-rm-2.4.0-SNAPSHOT.jar>
[JENKINS] Archiving disabled - not archiving C:\hudson\hudson-slave\workspace\CXF-trunk-windows\trunk
w spaces\rt\ws\rm\pom.xml
[JENKINS] Archiving disabled - not archiving C:\hudson\hudson-slave\workspace\CXF-trunk-windows\trunk
w spaces\rt\ws\rm\target\cxf-rt-ws-rm-2.4.0-SNAPSHOT.jar
[INFO] ------------------------------------------------------------------------
[INFO] Building Apache CXF Runtime WS Security
[INFO]    task-segment: [clean, install]
[INFO] ------------------------------------------------------------------------
[INFO] [clean:clean {execution: default-clean}]
[INFO] Deleting C:\hudson\hudson-slave\workspace\CXF-trunk-windows\trunk w spaces\rt\ws\security\target
[INFO] [cxf-xml2fastinfoset:xml2fastinfoset {execution: xml2fastinfoset}]
[INFO] [remote-resources:process {execution: default}]
[INFO] snapshot org.apache.ws.security:wss4j:1.6-SNAPSHOT: checking for updates from apache.snapshots
Downloading: http://repository.apache.org/snapshots/org/apache/ws/security/wss4j/1.6-SNAPSHOT/wss4j-1.6-20110304.184305-43.pom
21K downloaded  (wss4j-1.6-20110304.184305-43.pom)
Downloading: http://repository.apache.org/snapshots/org/apache/neethi/neethi/3.0.0-SNAPSHOT/neethi-3.0.0-SNAPSHOT.jar
Downloading: http://repository.apache.org/snapshots/org/apache/ws/security/wss4j/1.6-SNAPSHOT/wss4j-1.6-20110304.184305-43.jar
338K downloaded  (wss4j-1.6-20110304.184305-43.jar)
[INFO] [resources:resources {execution: default-resources}]
[INFO] Using 'UTF-8' encoding to copy filtered resources.
[INFO] Copying 4 resources
[INFO] Copying 1 resource
[INFO] skip non existing resourceDirectory C:\hudson\hudson-slave\workspace\CXF-trunk-windows\trunk
w spaces\rt\ws\security\src\main\resources-filtered
[INFO] skip non existing resourceDirectory C:\hudson\hudson-slave\workspace\CXF-trunk-windows\trunk
w spaces\rt\ws\security\target\generated\src\main\resources
[INFO] Copying 3 resources
Downloading: http://repository.apache.org/snapshots/org/apache/neethi/neethi/3.0.0-SNAPSHOT/neethi-3.0.0-SNAPSHOT.jar
[INFO] [compiler:compile {execution: default-compile}]
[INFO] Compiling 100 source files to C:\hudson\hudson-slave\workspace\CXF-trunk-windows\trunk
w spaces\rt\ws\security\target\classes
[INFO] [resources:testResources {execution: default-testResources}]
[INFO] Using 'UTF-8' encoding to copy filtered resources.
[INFO] Copying 57 resources
[INFO] Copying 1 resource
[INFO] skip non existing resourceDirectory C:\hudson\hudson-slave\workspace\CXF-trunk-windows\trunk
w spaces\rt\ws\security\target\generated\src\test\resources
[INFO] Copying 3 resources
Downloading: http://repository.apache.org/snapshots/org/apache/neethi/neethi/3.0.0-SNAPSHOT/neethi-3.0.0-SNAPSHOT.jar
[INFO] [compiler:testCompile {execution: default-testCompile}]
[INFO] Compiling 15 source files to C:\hudson\hudson-slave\workspace\CXF-trunk-windows\trunk
w spaces\rt\ws\security\target\test-classes
Downloading: http://repository.apache.org/snapshots/org/apache/neethi/neethi/3.0.0-SNAPSHOT/neethi-3.0.0-SNAPSHOT.jar
[INFO] [surefire:test {execution: default-test}]
[INFO] Surefire report directory: C:\hudson\hudson-slave\workspace\CXF-trunk-windows\trunk
w spaces\rt\ws\security\target\surefire-reports

-------------------------------------------------------
 T E S T S
-------------------------------------------------------
Running org.apache.cxf.ws.security.wss4j.CryptoCoverageCheckerTest
Tests run: 7, Failures: 0, Errors: 0, Skipped: 0, Time elapsed: 7.458 sec
Running org.apache.cxf.ws.security.wss4j.PolicyBasedWss4JInOutTest
Tests run: 18, Failures: 0, Errors: 0, Skipped: 0, Time elapsed: 6.583 sec
Running org.apache.cxf.ws.security.wss4j.RoundTripTest
Tests run: 3, Failures: 0, Errors: 0, Skipped: 0, Time elapsed: 5.978 sec
Running org.apache.cxf.ws.security.wss4j.SignatureConfirmationTest
Tests run: 1, Failures: 0, Errors: 0, Skipped: 0, Time elapsed: 0.343 sec
Running org.apache.cxf.ws.security.wss4j.UserNameTokenAuthorizationTest
Tests run: 5, Failures: 0, Errors: 0, Skipped: 0, Time elapsed: 1.562 sec
Running org.apache.cxf.ws.security.wss4j.WSS4JFaultCodeTest
Tests run: 3, Failures: 0, Errors: 0, Skipped: 0, Time elapsed: 1.067 sec
Running org.apache.cxf.ws.security.wss4j.WSS4JInOutTest
Tests run: 9, Failures: 0, Errors: 0, Skipped: 0, Time elapsed: 1.782 sec
Running org.apache.cxf.ws.security.wss4j.WSS4JOutInterceptorTest
Tests run: 6, Failures: 0, Errors: 0, Skipped: 0, Time elapsed: 0.236 sec

Results :

Tests run: 52, Failures: 0, Errors: 0, Skipped: 0

[JENKINS] Recording test results
Downloading: http://repository.apache.org/snapshots/org/apache/neethi/neethi/3.0.0-SNAPSHOT/neethi-3.0.0-SNAPSHOT.jar
[INFO] [jar:jar {execution: default-jar}]
[INFO] Building jar: C:\hudson\hudson-slave\workspace\CXF-trunk-windows\trunk w spaces\rt\ws\security\target\cxf-rt-ws-security-2.4.0-SNAPSHOT.jar
[INFO] [install:install {execution: default-install}]
[INFO] Installing C:\hudson\hudson-slave\workspace\CXF-trunk-windows\trunk w spaces\rt\ws\security\target\cxf-rt-ws-security-2.4.0-SNAPSHOT.jar
to <https://hudson.apache.org/hudson/job/CXF-trunk-windows/ws/.repository\org\apache\cxf\cxf-rt-ws-security\2.4.0-SNAPSHOT\cxf-rt-ws-security-2.4.0-SNAPSHOT.jar>
[JENKINS] Archiving disabled - not archiving C:\hudson\hudson-slave\workspace\CXF-trunk-windows\trunk
w spaces\rt\ws\security\pom.xml
[JENKINS] Archiving disabled - not archiving C:\hudson\hudson-slave\workspace\CXF-trunk-windows\trunk
w spaces\rt\ws\security\target\cxf-rt-ws-security-2.4.0-SNAPSHOT.jar
[INFO] ------------------------------------------------------------------------
[INFO] Building Apache CXF Runtime Web Management
[INFO]    task-segment: [clean, install]
[INFO] ------------------------------------------------------------------------
[INFO] [clean:clean {execution: default-clean}]
[INFO] Deleting C:\hudson\hudson-slave\workspace\CXF-trunk-windows\trunk w spaces\rt\management-web\target
[INFO] [cxf-xml2fastinfoset:xml2fastinfoset {execution: xml2fastinfoset}]
[INFO] [remote-resources:process {execution: default}]
Downloading: http://repository.apache.org/snapshots//org/apache/neethi/neethi/3.0.0-SNAPSHOT/neethi-3.0.0-SNAPSHOT.jar
[INFO] [resources:resources {execution: default-resources}]
[INFO] Using 'UTF-8' encoding to copy filtered resources.
[INFO] Copying 18 resources
[INFO] skip non existing resourceDirectory C:\hudson\hudson-slave\workspace\CXF-trunk-windows\trunk
w spaces\rt\management-web\src\main\resources
[INFO] skip non existing resourceDirectory C:\hudson\hudson-slave\workspace\CXF-trunk-windows\trunk
w spaces\rt\management-web\src\main\resources-filtered
[INFO] skip non existing resourceDirectory C:\hudson\hudson-slave\workspace\CXF-trunk-windows\trunk
w spaces\rt\management-web\target\generated\src\main\resources
[INFO] Copying 3 resources
Downloading: http://repository.apache.org/snapshots//org/apache/neethi/neethi/3.0.0-SNAPSHOT/neethi-3.0.0-SNAPSHOT.jar
[INFO] [compiler:compile {execution: default-compile}]
[INFO] Compiling 106 source files to C:\hudson\hudson-slave\workspace\CXF-trunk-windows\trunk
w spaces\rt\management-web\target\war\WEB-INF\classes
[INFO] -------------------------------------------------------------
[ERROR] COMPILATION ERROR : 
[INFO] -------------------------------------------------------------
[ERROR] \hudson\hudson-slave\workspace\CXF-trunk-windows\trunk w spaces\rt\management-web\src\main\java\org\apache\cxf\management\web\logging\ReadOnlyFileStorage.java:[537,9]
method does not override a method from its superclass
[INFO] 1 error
[INFO] -------------------------------------------------------------
[JENKINS] Archiving disabled - not archiving C:\hudson\hudson-slave\workspace\CXF-trunk-windows\trunk
w spaces\rt\management-web\pom.xml
[INFO] ------------------------------------------------------------------------
[ERROR] BUILD FAILURE
[INFO] ------------------------------------------------------------------------
[INFO] Compilation failure
\hudson\hudson-slave\workspace\CXF-trunk-windows\trunk w spaces\rt\management-web\src\main\java\org\apache\cxf\management\web\logging\ReadOnlyFileStorage.java:[537,9]
method does not override a method from its superclass

[INFO] ------------------------------------------------------------------------
[INFO] Trace
org.apache.maven.BuildFailureException: Compilation failure
\hudson\hudson-slave\workspace\CXF-trunk-windows\trunk w spaces\rt\management-web\src\main\java\org\apache\cxf\management\web\logging\ReadOnlyFileStorage.java:[537,9]
method does not override a method from its superclass

	at org.apache.maven.lifecycle.DefaultLifecycleExecutor.executeGoals(DefaultLifecycleExecutor.java:715)
	at org.apache.maven.lifecycle.DefaultLifecycleExecutor.executeGoalWithLifecycle(DefaultLifecycleExecutor.java:556)
	at org.apache.maven.lifecycle.DefaultLifecycleExecutor.executeGoal(DefaultLifecycleExecutor.java:535)
	at org.apache.maven.lifecycle.DefaultLifecycleExecutor.executeGoalAndHandleFailures(DefaultLifecycleExecutor.java:387)
	at org.apache.maven.lifecycle.DefaultLifecycleExecutor.executeTaskSegments(DefaultLifecycleExecutor.java:348)
	at org.apache.maven.lifecycle.DefaultLifecycleExecutor.execute(DefaultLifecycleExecutor.java:180)
	at org.apache.maven.lifecycle.LifecycleExecutorInterceptor.execute(LifecycleExecutorInterceptor.java:65)
	at org.apache.maven.DefaultMaven.doExecute(DefaultMaven.java:328)
	at org.apache.maven.DefaultMaven.execute(DefaultMaven.java:138)
	at org.apache.maven.cli.MavenCli.main(MavenCli.java:362)
	at sun.reflect.NativeMethodAccessorImpl.invoke0(Native Method)
	at sun.reflect.NativeMethodAccessorImpl.invoke(NativeMethodAccessorImpl.java:39)
	at sun.reflect.DelegatingMethodAccessorImpl.invoke(DelegatingMethodAccessorImpl.java:25)
	at java.lang.reflect.Method.invoke(Method.java:592)
	at org.codehaus.classworlds.Launcher.launchEnhanced(Launcher.java:315)
	at org.codehaus.classworlds.Launcher.launch(Launcher.java:255)
	at hudson.maven.agent.Main.launch(Main.java:173)
	at hudson.maven.MavenBuilder.call(MavenBuilder.java:164)
	at hudson.maven.MavenModuleSetBuild$Builder.call(MavenModuleSetBuild.java:872)
	at hudson.maven.MavenModuleSetBuild$Builder.call(MavenModuleSetBuild.java:803)
	at hudson.remoting.UserRequest.perform(UserRequest.java:114)
	at hudson.remoting.UserRequest.perform(UserRequest.java:48)
	at hudson.remoting.Request$2.run(Request.java:270)
	at java.util.concurrent.Executors$RunnableAdapter.call(Executors.java:417)
	at java.util.concurrent.FutureTask$Sync.innerRun(FutureTask.java:269)
	at java.util.concurrent.FutureTask.run(FutureTask.java:123)
	at java.util.concurrent.ThreadPoolExecutor$Worker.runTask(ThreadPoolExecutor.java:651)
	at java.util.concurrent.ThreadPoolExecutor$Worker.run(ThreadPoolExecutor.java:676)
	at java.lang.Thread.run(Thread.java:595)
Caused by: org.apache.maven.plugin.CompilationFailureException: Compilation failure
\hudson\hudson-slave\workspace\CXF-trunk-windows\trunk w spaces\rt\management-web\src\main\java\org\apache\cxf\management\web\logging\ReadOnlyFileStorage.java:[537,9]
method does not override a method from its superclass

	at org.apache.maven.plugin.AbstractCompilerMojo.execute(AbstractCompilerMojo.java:656)
	at org.apache.maven.plugin.CompilerMojo.execute(CompilerMojo.java:128)
	at org.apache.maven.plugin.DefaultPluginManager.executeMojo(DefaultPluginManager.java:490)
	at hudson.maven.agent.PluginManagerInterceptor.executeMojo(PluginManagerInterceptor.java:182)
	at org.apache.maven.lifecycle.DefaultLifecycleExecutor.executeGoals(DefaultLifecycleExecutor.java:694)
	... 28 more
[INFO] ------------------------------------------------------------------------
[INFO] Total time: 17 minutes 28 seconds
[INFO] Finished at: Fri Mar 04 22:23:31 GMT 2011
[INFO] Final Memory: 167M/326M
[INFO] ------------------------------------------------------------------------
Sending e-mails to: notifications@cxf.apache.org dkulp_apache@dankulp.com
Sending e-mails to: notifications@cxf.apache.org sberyozkin@gmail.com
channel stopped


Mime
View raw message