cxf-notifications mailing list archives

Site index · List index
Message view « Date » · « Thread »
Top « Date » · « Thread »
From Apache Jenkins Server <hud...@hudson.apache.org>
Subject Build failed in Jenkins: CXF-2.3.x-windows #123
Date Thu, 12 May 2011 09:18:42 GMT
See <https://builds.apache.org/hudson/job/CXF-2.3.x-windows/123/changes>

Changes:

[ningjiang] Merged revisions 1102198 via svnmerge from 
https://svn.apache.org/repos/asf/cxf/trunk

........
  r1102198 | ningjiang | 2011-05-12 16:17:09 +0800 (Thu, 12 May 2011) | 1 line
  
  CXF-3472 Made extending the HTTPConduit more easier.
........

------------------------------------------
[...truncated 1419 lines...]
[INFO] [surefire:test {execution: default-test}]
[INFO] Surefire report directory: C:\hudson\hudson-slave\workspace\CXF-2.3.x-windows\2.3.x-fixes\rt\transports\local\target\surefire-reports

-------------------------------------------------------
 T E S T S
-------------------------------------------------------
Running org.apache.cxf.transport.local.LocalTransportFactoryTest
Tests run: 2, Failures: 0, Errors: 0, Skipped: 0, Time elapsed: 0.184 sec

Results :

Tests run: 2, Failures: 0, Errors: 0, Skipped: 0

[JENKINS] Recording test results
[INFO] [jar:jar {execution: default-jar}]
[INFO] Building jar: C:\hudson\hudson-slave\workspace\CXF-2.3.x-windows\2.3.x-fixes\rt\transports\local\target\cxf-rt-transports-local-2.3.5-SNAPSHOT.jar
[INFO] [install:install {execution: default-install}]
[INFO] Installing C:\hudson\hudson-slave\workspace\CXF-2.3.x-windows\2.3.x-fixes\rt\transports\local\target\cxf-rt-transports-local-2.3.5-SNAPSHOT.jar
to <https://builds.apache.org/hudson/job/CXF-2.3.x-windows/ws/.repository\org\apache\cxf\cxf-rt-transports-local\2.3.5-SNAPSHOT\cxf-rt-transports-local-2.3.5-SNAPSHOT.jar>
[JENKINS] Archiving C:\hudson\hudson-slave\workspace\CXF-2.3.x-windows\2.3.x-fixes\rt\transports\local\target\cxf-rt-transports-local-2.3.5-SNAPSHOT.jar
to /home/hudson/hudson/jobs/CXF-2.3.x-windows/modules/org.apache.cxf$cxf-rt-transports-local/builds/2011-05-12_09-13-15/archive/org.apache.cxf/cxf-rt-transports-local/2.3.5-SNAPSHOT/cxf-rt-transports-local-2.3.5-SNAPSHOT.jar
[INFO] ------------------------------------------------------------------------
[INFO] Building Apache CXF Runtime Simple Frontend
[INFO]    task-segment: [clean, install]
[INFO] ------------------------------------------------------------------------
[INFO] [clean:clean {execution: default-clean}]
[INFO] Deleting C:\hudson\hudson-slave\workspace\CXF-2.3.x-windows\2.3.x-fixes\rt\frontend\simple\target
[INFO] [checkstyle:checkstyle {execution: validate}]
[INFO] Starting audit...
Audit done.

[INFO] Preparing pmd:check
[JENKINS] Archiving C:\hudson\hudson-slave\workspace\CXF-2.3.x-windows\2.3.x-fixes\rt\frontend\simple\pom.xml
to /home/hudson/hudson/jobs/CXF-2.3.x-windows/modules/org.apache.cxf$cxf-rt-frontend-simple/builds/2011-05-12_09-13-15/archive/org.apache.cxf/cxf-rt-frontend-simple/2.3.5-SNAPSHOT/cxf-rt-frontend-simple-2.3.5-SNAPSHOT.pom
[INFO] [pmd:pmd {execution: pmd}]
[INFO] [pmd:check {execution: validate}]
[INFO] 
[INFO] [cxf-xml2fastinfoset:xml2fastinfoset {execution: xml2fastinfoset}]
[INFO] [remote-resources:process {execution: default}]
[INFO] [resources:resources {execution: default-resources}]
[INFO] Using 'UTF-8' encoding to copy filtered resources.
[INFO] Copying 2 resources
[INFO] Copying 3 resources
[INFO] skip non existing resourceDirectory C:\hudson\hudson-slave\workspace\CXF-2.3.x-windows\2.3.x-fixes\rt\frontend\simple\src\main\resources-filtered
[INFO] skip non existing resourceDirectory C:\hudson\hudson-slave\workspace\CXF-2.3.x-windows\2.3.x-fixes\rt\frontend\simple\target\generated\src\main\resources
[INFO] Copying 3 resources
[INFO] [compiler:compile {execution: default-compile}]
[INFO] Compiling 16 source files to C:\hudson\hudson-slave\workspace\CXF-2.3.x-windows\2.3.x-fixes\rt\frontend\simple\target\classes
[INFO] [resources:testResources {execution: default-testResources}]
[INFO] Using 'UTF-8' encoding to copy filtered resources.
[INFO] Copying 7 resources
[INFO] skip non existing resourceDirectory C:\hudson\hudson-slave\workspace\CXF-2.3.x-windows\2.3.x-fixes\rt\frontend\simple\src\test\resources
[INFO] skip non existing resourceDirectory C:\hudson\hudson-slave\workspace\CXF-2.3.x-windows\2.3.x-fixes\rt\frontend\simple\target\generated\src\test\resources
[INFO] Copying 3 resources
[INFO] [compiler:testCompile {execution: default-testCompile}]
[INFO] Compiling 14 source files to C:\hudson\hudson-slave\workspace\CXF-2.3.x-windows\2.3.x-fixes\rt\frontend\simple\target\test-classes
[INFO] [surefire:test {execution: default-test}]
[INFO] Surefire report directory: C:\hudson\hudson-slave\workspace\CXF-2.3.x-windows\2.3.x-fixes\rt\frontend\simple\target\surefire-reports

-------------------------------------------------------
 T E S T S
-------------------------------------------------------
Running org.apache.cxf.frontend.soap.SoapBindingSelectionTest
Tests run: 1, Failures: 0, Errors: 0, Skipped: 0, Time elapsed: 1.557 sec
Running org.apache.cxf.frontend.spring.ClientServerTest
Tests run: 1, Failures: 0, Errors: 0, Skipped: 0, Time elapsed: 0.447 sec
Running org.apache.cxf.frontend.spring.SpringBeansTest
Tests run: 2, Failures: 0, Errors: 0, Skipped: 0, Time elapsed: 0.699 sec
Running org.apache.cxf.service.factory.ClientFactoryBeanTest
Tests run: 2, Failures: 0, Errors: 0, Skipped: 0, Time elapsed: 0.37 sec
Running org.apache.cxf.service.factory.ReflectionServiceFactoryTest
Tests run: 4, Failures: 0, Errors: 0, Skipped: 0, Time elapsed: 0.224 sec
Running org.apache.cxf.service.factory.RountripTest
Tests run: 2, Failures: 0, Errors: 0, Skipped: 0, Time elapsed: 0.301 sec
Running org.apache.cxf.service.factory.ServerFactoryTest
Tests run: 3, Failures: 0, Errors: 0, Skipped: 0, Time elapsed: 0.274 sec
Running org.apache.cxf.service.stax.StaxDatabindingTest
Tests run: 2, Failures: 0, Errors: 0, Skipped: 0, Time elapsed: 0.13 sec

Results :

Tests run: 17, Failures: 0, Errors: 0, Skipped: 0

[JENKINS] Recording test results
[INFO] [jar:jar {execution: default-jar}]
[INFO] Building jar: C:\hudson\hudson-slave\workspace\CXF-2.3.x-windows\2.3.x-fixes\rt\frontend\simple\target\cxf-rt-frontend-simple-2.3.5-SNAPSHOT.jar
[INFO] [install:install {execution: default-install}]
[INFO] Installing C:\hudson\hudson-slave\workspace\CXF-2.3.x-windows\2.3.x-fixes\rt\frontend\simple\target\cxf-rt-frontend-simple-2.3.5-SNAPSHOT.jar
to <https://builds.apache.org/hudson/job/CXF-2.3.x-windows/ws/.repository\org\apache\cxf\cxf-rt-frontend-simple\2.3.5-SNAPSHOT\cxf-rt-frontend-simple-2.3.5-SNAPSHOT.jar>
[JENKINS] Archiving C:\hudson\hudson-slave\workspace\CXF-2.3.x-windows\2.3.x-fixes\rt\frontend\simple\target\cxf-rt-frontend-simple-2.3.5-SNAPSHOT.jar
to /home/hudson/hudson/jobs/CXF-2.3.x-windows/modules/org.apache.cxf$cxf-rt-frontend-simple/builds/2011-05-12_09-13-15/archive/org.apache.cxf/cxf-rt-frontend-simple/2.3.5-SNAPSHOT/cxf-rt-frontend-simple-2.3.5-SNAPSHOT.jar
[INFO] ------------------------------------------------------------------------
[INFO] Building Apache CXF Runtime Transport Common Used Classes
[INFO]    task-segment: [clean, install]
[INFO] ------------------------------------------------------------------------
[INFO] [clean:clean {execution: default-clean}]
[INFO] Deleting C:\hudson\hudson-slave\workspace\CXF-2.3.x-windows\2.3.x-fixes\rt\transports\common\target
[INFO] [checkstyle:checkstyle {execution: validate}]
[INFO] Starting audit...
Audit done.

[INFO] Preparing pmd:check
[JENKINS] Archiving C:\hudson\hudson-slave\workspace\CXF-2.3.x-windows\2.3.x-fixes\rt\transports\common\pom.xml
to /home/hudson/hudson/jobs/CXF-2.3.x-windows/modules/org.apache.cxf$cxf-rt-transports-common/builds/2011-05-12_09-13-15/archive/org.apache.cxf/cxf-rt-transports-common/2.3.5-SNAPSHOT/cxf-rt-transports-common-2.3.5-SNAPSHOT.pom
[INFO] [pmd:pmd {execution: pmd}]
[INFO] [pmd:check {execution: validate}]
[INFO] 
[INFO] [cxf-xml2fastinfoset:xml2fastinfoset {execution: xml2fastinfoset}]
[INFO] [remote-resources:process {execution: default}]
[INFO] [resources:resources {execution: default-resources}]
[INFO] Using 'UTF-8' encoding to copy filtered resources.
[INFO] Copying 1 resource
[INFO] skip non existing resourceDirectory C:\hudson\hudson-slave\workspace\CXF-2.3.x-windows\2.3.x-fixes\rt\transports\common\src\main\resources
[INFO] skip non existing resourceDirectory C:\hudson\hudson-slave\workspace\CXF-2.3.x-windows\2.3.x-fixes\rt\transports\common\src\main\resources-filtered
[INFO] skip non existing resourceDirectory C:\hudson\hudson-slave\workspace\CXF-2.3.x-windows\2.3.x-fixes\rt\transports\common\target\generated\src\main\resources
[INFO] Copying 3 resources
[INFO] [compiler:compile {execution: default-compile}]
[INFO] Compiling 3 source files to C:\hudson\hudson-slave\workspace\CXF-2.3.x-windows\2.3.x-fixes\rt\transports\common\target\classes
[INFO] [resources:testResources {execution: default-testResources}]
[INFO] Using 'UTF-8' encoding to copy filtered resources.
[INFO] Copying 0 resource
[INFO] skip non existing resourceDirectory C:\hudson\hudson-slave\workspace\CXF-2.3.x-windows\2.3.x-fixes\rt\transports\common\src\test\resources
[INFO] skip non existing resourceDirectory C:\hudson\hudson-slave\workspace\CXF-2.3.x-windows\2.3.x-fixes\rt\transports\common\target\generated\src\test\resources
[INFO] Copying 3 resources
[INFO] [compiler:testCompile {execution: default-testCompile}]
[INFO] Compiling 1 source file to C:\hudson\hudson-slave\workspace\CXF-2.3.x-windows\2.3.x-fixes\rt\transports\common\target\test-classes
[INFO] [surefire:test {execution: default-test}]
[INFO] Surefire report directory: C:\hudson\hudson-slave\workspace\CXF-2.3.x-windows\2.3.x-fixes\rt\transports\common\target\surefire-reports

-------------------------------------------------------
 T E S T S
-------------------------------------------------------
Running org.apache.cxf.transport.common.gzip.GZIPAcceptEncodingTest
Tests run: 8, Failures: 0, Errors: 0, Skipped: 0, Time elapsed: 0.206 sec

Results :

Tests run: 8, Failures: 0, Errors: 0, Skipped: 0

[JENKINS] Recording test results
[INFO] [jar:jar {execution: default-jar}]
[INFO] Building jar: C:\hudson\hudson-slave\workspace\CXF-2.3.x-windows\2.3.x-fixes\rt\transports\common\target\cxf-rt-transports-common-2.3.5-SNAPSHOT.jar
[INFO] [install:install {execution: default-install}]
[INFO] Installing C:\hudson\hudson-slave\workspace\CXF-2.3.x-windows\2.3.x-fixes\rt\transports\common\target\cxf-rt-transports-common-2.3.5-SNAPSHOT.jar
to <https://builds.apache.org/hudson/job/CXF-2.3.x-windows/ws/.repository\org\apache\cxf\cxf-rt-transports-common\2.3.5-SNAPSHOT\cxf-rt-transports-common-2.3.5-SNAPSHOT.jar>
[JENKINS] Archiving C:\hudson\hudson-slave\workspace\CXF-2.3.x-windows\2.3.x-fixes\rt\transports\common\target\cxf-rt-transports-common-2.3.5-SNAPSHOT.jar
to /home/hudson/hudson/jobs/CXF-2.3.x-windows/modules/org.apache.cxf$cxf-rt-transports-common/builds/2011-05-12_09-13-15/archive/org.apache.cxf/cxf-rt-transports-common/2.3.5-SNAPSHOT/cxf-rt-transports-common-2.3.5-SNAPSHOT.jar
[INFO] ------------------------------------------------------------------------
[INFO] Building Apache CXF Runtime HTTP Transport
[INFO]    task-segment: [clean, install]
[INFO] ------------------------------------------------------------------------
[INFO] [clean:clean {execution: default-clean}]
[INFO] Deleting C:\hudson\hudson-slave\workspace\CXF-2.3.x-windows\2.3.x-fixes\rt\transports\http\target
[INFO] [checkstyle:checkstyle {execution: validate}]
[INFO] Starting audit...
Audit done.

[INFO] Preparing pmd:check
[JENKINS] Archiving C:\hudson\hudson-slave\workspace\CXF-2.3.x-windows\2.3.x-fixes\rt\transports\http\pom.xml
to /home/hudson/hudson/jobs/CXF-2.3.x-windows/modules/org.apache.cxf$cxf-rt-transports-http/builds/2011-05-12_09-13-15/archive/org.apache.cxf/cxf-rt-transports-http/2.3.5-SNAPSHOT/cxf-rt-transports-http-2.3.5-SNAPSHOT.pom
[INFO] [pmd:pmd {execution: pmd}]
[INFO] [pmd:check {execution: validate}]
[INFO] 
[INFO] [cxf-xml2fastinfoset:xml2fastinfoset {execution: xml2fastinfoset}]
[INFO] [cxf-xjc:xsdtojava {execution: generate-sources}]
[INFO] [remote-resources:process {execution: default}]
[INFO] [resources:resources {execution: default-resources}]
[INFO] Using 'UTF-8' encoding to copy filtered resources.
[INFO] Copying 6 resources
[INFO] Copying 10 resources
[INFO] skip non existing resourceDirectory C:\hudson\hudson-slave\workspace\CXF-2.3.x-windows\2.3.x-fixes\rt\transports\http\src\main\resources-filtered
[INFO] Copying 2 resources
[INFO] Copying 3 resources
[INFO] [compiler:compile {execution: default-compile}]
[INFO] Compiling 61 source files to C:\hudson\hudson-slave\workspace\CXF-2.3.x-windows\2.3.x-fixes\rt\transports\http\target\classes
[INFO] -------------------------------------------------------------
[WARNING] COMPILATION WARNING : 
[INFO] -------------------------------------------------------------
[WARNING] \hudson\hudson-slave\workspace\CXF-2.3.x-windows\2.3.x-fixes\rt\transports\http\src\main\java\org\apache\cxf\transport\http\HttpServletRequestSnapshot.java:[136,23]
getHeaders(java.lang.String) in org.apache.cxf.transport.http.HttpServletRequestSnapshot implements
getHeaders(java.lang.String) in javax.servlet.http.HttpServletRequest; return type requires
unchecked conversion
found   : java.util.Enumeration
required: java.util.Enumeration<java.lang.String>
[WARNING] \hudson\hudson-slave\workspace\CXF-2.3.x-windows\2.3.x-fixes\rt\transports\http\src\main\java\org\apache\cxf\transport\http\HttpServletRequestSnapshot.java:[130,23]
getHeaderNames() in org.apache.cxf.transport.http.HttpServletRequestSnapshot implements getHeaderNames()
in javax.servlet.http.HttpServletRequest; return type requires unchecked conversion
found   : java.util.Enumeration
required: java.util.Enumeration<java.lang.String>
[WARNING] \hudson\hudson-slave\workspace\CXF-2.3.x-windows\2.3.x-fixes\rt\transports\http\src\main\java\org\apache\cxf\transport\http\HttpServletRequestSnapshot.java:[232,23]
getLocales() in org.apache.cxf.transport.http.HttpServletRequestSnapshot implements getLocales()
in javax.servlet.ServletRequest; return type requires unchecked conversion
found   : java.util.Enumeration
required: java.util.Enumeration<java.util.Locale>
[INFO] 3 warnings 
[INFO] -------------------------------------------------------------
[INFO] -------------------------------------------------------------
[ERROR] COMPILATION ERROR : 
[INFO] -------------------------------------------------------------
[ERROR] \hudson\hudson-slave\workspace\CXF-2.3.x-windows\2.3.x-fixes\rt\transports\http\src\main\java\org\apache\cxf\transport\http\HTTPConduit.java:[1942,16]
cannot find symbol
symbol  : variable conduitName
location: class org.apache.cxf.transport.http.HTTPConduit.WrappedOutputStream
[ERROR] \hudson\hudson-slave\workspace\CXF-2.3.x-windows\2.3.x-fixes\rt\transports\http\src\main\java\org\apache\cxf\transport\http\HTTPConduit.java:[1942,34]
cannot find symbol
symbol  : variable conduitName
location: class org.apache.cxf.transport.http.HTTPConduit.WrappedOutputStream
[INFO] 2 errors 
[INFO] -------------------------------------------------------------
[INFO] ------------------------------------------------------------------------
[ERROR] BUILD FAILURE
[INFO] ------------------------------------------------------------------------
[INFO] Compilation failure

\hudson\hudson-slave\workspace\CXF-2.3.x-windows\2.3.x-fixes\rt\transports\http\src\main\java\org\apache\cxf\transport\http\HTTPConduit.java:[1942,16]
cannot find symbol
symbol  : variable conduitName
location: class org.apache.cxf.transport.http.HTTPConduit.WrappedOutputStream
\hudson\hudson-slave\workspace\CXF-2.3.x-windows\2.3.x-fixes\rt\transports\http\src\main\java\org\apache\cxf\transport\http\HTTPConduit.java:[1942,34]
cannot find symbol
symbol  : variable conduitName
location: class org.apache.cxf.transport.http.HTTPConduit.WrappedOutputStream

[INFO] ------------------------------------------------------------------------
[INFO] Trace
org.apache.maven.BuildFailureException: Compilation failure
	at org.apache.maven.lifecycle.DefaultLifecycleExecutor.executeGoals(DefaultLifecycleExecutor.java:715)
	at org.apache.maven.lifecycle.DefaultLifecycleExecutor.executeGoalWithLifecycle(DefaultLifecycleExecutor.java:556)
	at org.apache.maven.lifecycle.DefaultLifecycleExecutor.executeGoal(DefaultLifecycleExecutor.java:535)
	at org.apache.maven.lifecycle.DefaultLifecycleExecutor.executeGoalAndHandleFailures(DefaultLifecycleExecutor.java:387)
	at org.apache.maven.lifecycle.DefaultLifecycleExecutor.executeTaskSegments(DefaultLifecycleExecutor.java:348)
	at org.apache.maven.lifecycle.DefaultLifecycleExecutor.execute(DefaultLifecycleExecutor.java:180)
	at org.apache.maven.lifecycle.LifecycleExecutorInterceptor.execute(LifecycleExecutorInterceptor.java:65)
	at org.apache.maven.DefaultMaven.doExecute(DefaultMaven.java:328)
	at org.apache.maven.DefaultMaven.execute(DefaultMaven.java:138)
	at org.apache.maven.cli.MavenCli.main(MavenCli.java:362)
	at sun.reflect.NativeMethodAccessorImpl.invoke0(Native Method)
	at sun.reflect.NativeMethodAccessorImpl.invoke(NativeMethodAccessorImpl.java:39)
	at sun.reflect.DelegatingMethodAccessorImpl.invoke(DelegatingMethodAccessorImpl.java:25)
	at java.lang.reflect.Method.invoke(Method.java:597)
	at org.codehaus.classworlds.Launcher.launchEnhanced(Launcher.java:315)
	at org.codehaus.classworlds.Launcher.launch(Launcher.java:255)
	at hudson.maven.agent.Main.launch(Main.java:185)
	at hudson.maven.MavenBuilder.call(MavenBuilder.java:164)
	at hudson.maven.MavenModuleSetBuild$Builder.call(MavenModuleSetBuild.java:987)
	at hudson.maven.MavenModuleSetBuild$Builder.call(MavenModuleSetBuild.java:918)
	at hudson.remoting.UserRequest.perform(UserRequest.java:118)
	at hudson.remoting.UserRequest.perform(UserRequest.java:48)
	at hudson.remoting.Request$2.run(Request.java:270)
	at java.util.concurrent.Executors$RunnableAdapter.call(Executors.java:441)
	at java.util.concurrent.FutureTask$Sync.innerRun(FutureTask.java:303)
	at java.util.concurrent.FutureTask.run(FutureTask.java:138)
	at java.util.concurrent.ThreadPoolExecutor$Worker.runTask(ThreadPoolExecutor.java:886)
	at java.util.concurrent.ThreadPoolExecutor$Worker.run(ThreadPoolExecutor.java:908)
	at java.lang.Thread.run(Thread.java:619)
Caused by: org.apache.maven.plugin.CompilationFailureException: Compilation failure
	at org.apache.maven.plugin.AbstractCompilerMojo.execute(AbstractCompilerMojo.java:656)
	at org.apache.maven.plugin.CompilerMojo.execute(CompilerMojo.java:128)
	at org.apache.maven.plugin.DefaultPluginManager.executeMojo(DefaultPluginManager.java:490)
	at hudson.maven.agent.PluginManagerInterceptor.executeMojo(PluginManagerInterceptor.java:182)
	at org.apache.maven.lifecycle.DefaultLifecycleExecutor.executeGoals(DefaultLifecycleExecutor.java:694)
	... 28 more
[INFO] ------------------------------------------------------------------------
[INFO] Total time: 5 minutes 18 seconds
[INFO] Finished at: Thu May 12 10:18:37 BST 2011
[INFO] Final Memory: 319M/486M
[INFO] ------------------------------------------------------------------------
Sending e-mails to: notifications@cxf.apache.org willem.jiang@gmail.com
channel stopped


Mime
View raw message