cxf-notifications mailing list archives

Site index · List index
Message view « Date » · « Thread »
Top « Date » · « Thread »
From Apache Jenkins Server <hud...@hudson.apache.org>
Subject Build failed in Jenkins: CXF-2.3.x-windows #146
Date Tue, 24 May 2011 18:28:13 GMT
See <https://builds.apache.org/hudson/job/CXF-2.3.x-windows/146/changes>

Changes:

[dkulp] Blocked revisions 1125209,1127182 via svnmerge

........
  r1125209 | dkulp | 2011-05-19 22:50:08 -0400 (Thu, 19 May 2011) | 1 line
  
  Add an NPE guard
........
  r1127182 | sergeyb | 2011-05-24 13:45:33 -0400 (Tue, 24 May 2011) | 1 line
  
  [CXF-3538] Enabling schema validation for a maven plugin-driven test
........

[dkulp] Blocked revisions 1097041,1099499-1099500,1100016,1100157,1100162,1100198,1100230,1100268-1100269,1101081,1102193,1102248,1102640,1102804,1102942,1103491,1103505,1104182,1124246,1124353,1124690,1124958,1124961,1125571,1126369,1126478,1127127-1127129
via svnmerge

........
  r1097041 | coheigea | 2011-04-27 04:49:17 -0400 (Wed, 27 Apr 2011) | 1 line
  
  [CXF-3476] - AbstractUsernameTokenAuthenticatingInterceptor does not handle digest passwords
correctly
........
  r1099499 | coheigea | 2011-05-04 12:04:41 -0400 (Wed, 04 May 2011) | 1 line
  
  [CXF-3842] - wsse:Reference used instead of wsse:KeyIdentifier error on the server: Cannot
resolve KeyInfo for verifying signature
........
  r1099500 | coheigea | 2011-05-04 12:05:43 -0400 (Wed, 04 May 2011) | 1 line
  
  [CXF-3842] - Pass checkstyle.
........
  r1100016 | dkulp | 2011-05-05 21:24:11 -0400 (Thu, 05 May 2011) | 4 lines
  
  [CXF-3492] Attempt to fix issues of exposing a strange proxied object
  representing an OSGi service.
  Patch from  David Metcalf heavily modified and extended in an attempt to
  make it work for both him and our unit tests.
........
  r1100157 | sergeyb | 2011-05-06 06:12:06 -0400 (Fri, 06 May 2011) | 1 line
  
  [CXF-3493] Reverting the change causing the regression with unqualified elements becoming
qualified after StaxUtils.copy
........
  r1100162 | ningjiang | 2011-05-06 06:30:54 -0400 (Fri, 06 May 2011) | 1 line
  
  CXF-3497 Set the ClassLoader Extension when the bus is load from Spring
........
  r1100198 | cschneider | 2011-05-06 09:08:10 -0400 (Fri, 06 May 2011) | 1 line
  
  CXF-3496 - Use OID SPNEGO instead of KERBEROS. Patch applied with thanks to Aris Tsaklidis
(dunkelhaar)
........
  r1100230 | cschneider | 2011-05-06 10:29:25 -0400 (Fri, 06 May 2011) | 1 line
  
  CXF-3496 - Making OID configureable using a message property to switch between kerberos
and spnego oid
........
  r1100268 | coheigea | 2011-05-06 12:27:23 -0400 (Fri, 06 May 2011) | 1 line
  
  Added BouncyCastle dependency to interop tests to get them working again.
........
  r1100269 | coheigea | 2011-05-06 12:28:11 -0400 (Fri, 06 May 2011) | 1 line
  
  [CXF-3457] - Service fails to find IssuedToken using SAML bearer subject confirmation
........
  r1101081 | coheigea | 2011-05-09 12:02:38 -0400 (Mon, 09 May 2011) | 1 line
  
  Added a SignedElements test for SAML.
........
  r1102193 | ningjiang | 2011-05-12 03:46:43 -0400 (Thu, 12 May 2011) | 1 line
  
  CXF-3512 CXF extension using it's classloader as a fallback to load the class
........
  r1102248 | coheigea | 2011-05-12 07:41:31 -0400 (Thu, 12 May 2011) | 1 line
  
  Fixing a typo in a previous commit.
........
  r1102640 | ffang | 2011-05-13 05:51:18 -0400 (Fri, 13 May 2011) | 1 line
  
  [CXF-3506]Service list page displays no services in unformatted mode
........
  r1102804 | coheigea | 2011-05-13 12:14:57 -0400 (Fri, 13 May 2011) | 1 line
  
  Made some improvements to how token inclusion types are handled inbound + outbound.
........
  r1102942 | ningjiang | 2011-05-13 22:37:40 -0400 (Fri, 13 May 2011) | 1 line
  
  Try to fix the build error of ArrayServiceImpl on windows box
........
  r1103491 | sergeyb | 2011-05-15 14:07:43 -0400 (Sun, 15 May 2011) | 1 line
  
  Fixing reference to parent pom
........
  r1103505 | sergeyb | 2011-05-15 14:43:29 -0400 (Sun, 15 May 2011) | 1 line
  
  Fixing rt/frontend/jaxrs test failures on Win
........
  r1104182 | coheigea | 2011-05-17 08:08:17 -0400 (Tue, 17 May 2011) | 4 lines
  
  Some work on wsse UsernameTokens
   - Added support for SP13 Nonce and Created policy elements
   - Added a Policy Validator for UsernameTokens
   - Added a systest.
........
  r1124246 | dkulp | 2011-05-18 09:08:42 -0400 (Wed, 18 May 2011) | 2 lines
  
  Set the UIRResolver on the transformer to work around issue #1 with it
  on the IBM jdk
........
  r1124353 | sergeyb | 2011-05-18 13:49:52 -0400 (Wed, 18 May 2011) | 1 line
  
  [CXF-3948] Initial support for customizing schema package names
........
  r1124690 | coheigea | 2011-05-19 07:33:19 -0400 (Thu, 19 May 2011) | 1 line
  
  Minor clean up of the SymmetricBindingHandler
........
  r1124958 | coheigea | 2011-05-19 11:42:11 -0400 (Thu, 19 May 2011) | 1 line
  
  Added an X509TokenTest to the ws-security systests
........
  r1124961 | sergeyb | 2011-05-19 11:43:42 -0400 (Thu, 19 May 2011) | 1 line
  
  [CXF-3948] Adding a basic JAXRSContainer loader
........
  r1125571 | dkulp | 2011-05-20 17:33:24 -0400 (Fri, 20 May 2011) | 1 line
  
  [CXF-3542] EndpointPolicyImpl overcalculating the required vocabulary
........
  r1126369 | ay | 2011-05-23 04:09:32 -0400 (Mon, 23 May 2011) | 1 line
  
  CXF 3510 wrong detination determination by OSGi based CXF entry point ...
........
  r1126478 | ay | 2011-05-23 08:53:43 -0400 (Mon, 23 May 2011) | 1 line
  
  cxf-3510 followp fix for jaxrs systests
........
  r1127127 | coheigea | 2011-05-24 12:19:09 -0400 (Tue, 24 May 2011) | 1 line
  
  Added an Asymmetric X509Token test.
........
  r1127128 | coheigea | 2011-05-24 12:19:39 -0400 (Tue, 24 May 2011) | 1 line
  
  Added a policy validator for X.509 Tokens.
........
  r1127129 | coheigea | 2011-05-24 12:20:36 -0400 (Tue, 24 May 2011) | 1 line
  
  Add a BinarySecurityToken to the security header for the asymmetric case, if it is required
and we are not signing anything.
........

[dkulp] Merged revisions 1124689 via svnmerge from 
https://svn.apache.org/repos/asf/cxf/trunk

........
  r1124689 | coheigea | 2011-05-19 07:31:47 -0400 (Thu, 19 May 2011) | 1 line
  
  Missed writing out the sp13 namespace in previous commit.
........

[dkulp] Merged revisions 1124688 via svnmerge from 
https://svn.apache.org/repos/asf/cxf/trunk

........
  r1124688 | coheigea | 2011-05-19 07:29:56 -0400 (Thu, 19 May 2011) | 1 line
  
  Write out UsernameToken sp13 elements in the WSDL.
........

[dkulp] Merged revisions 1124429 via svnmerge from 
https://svn.apache.org/repos/asf/cxf/trunk

........
  r1124429 | dkulp | 2011-05-18 17:11:43 -0400 (Wed, 18 May 2011) | 1 line
  
  Minor pom cleanups
........

[dkulp] Merged revisions 1124428 via svnmerge from 
https://svn.apache.org/repos/asf/cxf/trunk

........
  r1124428 | dkulp | 2011-05-18 17:11:36 -0400 (Wed, 18 May 2011) | 1 line
  
  Last non-WS-Security related IBM JDK failure fixed
........

[dkulp] Merged revisions 1124310 via svnmerge from 
https://svn.apache.org/repos/asf/cxf/trunk

........
  r1124310 | dkulp | 2011-05-18 12:03:58 -0400 (Wed, 18 May 2011) | 1 line
  
  Get more tests running with IBM JDK
........

[dkulp] Merged revisions 1124258 via svnmerge from 
https://svn.apache.org/repos/asf/cxf/trunk

........
  r1124258 | dkulp | 2011-05-18 09:32:50 -0400 (Wed, 18 May 2011) | 2 lines
  
  Move xalan to top of deps to make sure we grab it.  Fixes the tests on
  IBM JDK that don't work with the broken version in jaxp-ri
........

[dkulp] Merged revisions 1104480 via svnmerge from 
https://svn.apache.org/repos/asf/cxf/trunk

........
  r1104480 | dkulp | 2011-05-17 15:22:28 -0400 (Tue, 17 May 2011) | 1 line
  
  Fix the mock to work with the IBM JDK
........

[dkulp] Merged revisions 1104343 via svnmerge from 
https://svn.apache.org/repos/asf/cxf/trunk

........
  r1104343 | dkulp | 2011-05-17 11:41:56 -0400 (Tue, 17 May 2011) | 2 lines
  
  [CXF-3474] Update to latest Jetty, but set to maintain compatible with
  7.3 jetty
........

[dkulp] Merged revisions 1103807 via svnmerge from 
https://svn.apache.org/repos/asf/cxf/trunk

........
  r1103807 | dkulp | 2011-05-16 13:24:21 -0400 (Mon, 16 May 2011) | 2 lines
  
  [CXF-3472] Make it even easier to extend the HTTPConduit by moving the
  creation of the OutputStream into a protected method
........

[dkulp] Merged revisions 1103806 via svnmerge from 
https://svn.apache.org/repos/asf/cxf/trunk

........
  r1103806 | dkulp | 2011-05-16 13:24:13 -0400 (Mon, 16 May 2011) | 1 line
  
  Fix javadoc typos
........

[dkulp] Merged revisions 1103679 via svnmerge from 
https://svn.apache.org/repos/asf/cxf/trunk

........
  r1103679 | coheigea | 2011-05-16 06:37:08 -0400 (Mon, 16 May 2011) | 1 line
  
  Deprecated a misspelled method name.
........

[dkulp] Merged revisions 1102294 via svnmerge from 
https://svn.apache.org/repos/asf/cxf/trunk

........
  r1102294 | coheigea | 2011-05-12 09:36:28 -0400 (Thu, 12 May 2011) | 1 line
  
  Don't send a KeyType if one is being sent in the template.
........

[dkulp] Merged revisions 1102249 via svnmerge from 
https://svn.apache.org/repos/asf/cxf/trunk

........
  r1102249 | coheigea | 2011-05-12 07:42:20 -0400 (Thu, 12 May 2011) | 1 line
  
  Encrypt the SOAP Body if the EncryptedParts policy is empty.
........

[dkulp] Merged revisions 1101079 via svnmerge from 
https://svn.apache.org/repos/asf/cxf/trunk

........
  r1101079 | coheigea | 2011-05-09 12:00:46 -0400 (Mon, 09 May 2011) | 1 line
  
  Default to signing the SOAP Body for an empty SignedParts policy assertion.
........

------------------------------------------
[...truncated 4030 lines...]
[INFO]    task-segment: [clean, install]
[INFO] ------------------------------------------------------------------------
[INFO] [clean:clean {execution: default-clean}]
[INFO] Deleting C:\hudson\hudson-slave\workspace\CXF-2.3.x-windows\2.3.x-fixes\rt\ws\rm\target
[INFO] [checkstyle:checkstyle {execution: validate}]
[INFO] Starting audit...
Audit done.

[INFO] Preparing pmd:check
[JENKINS] Archiving C:\hudson\hudson-slave\workspace\CXF-2.3.x-windows\2.3.x-fixes\rt\ws\rm\pom.xml
to /home/hudson/hudson/jobs/CXF-2.3.x-windows/modules/org.apache.cxf$cxf-rt-ws-rm/builds/2011-05-24_18-12-59/archive/org.apache.cxf/cxf-rt-ws-rm/2.3.5-SNAPSHOT/cxf-rt-ws-rm-2.3.5-SNAPSHOT.pom
[INFO] [pmd:pmd {execution: pmd}]
[INFO] [pmd:check {execution: validate}]
[INFO] 
[INFO] [cxf-xml2fastinfoset:xml2fastinfoset {execution: xml2fastinfoset}]
[INFO] [cxf-xjc:xsdtojava {execution: generate-sources}]
[INFO] [remote-resources:process {execution: default}]
[INFO] [resources:resources {execution: default-resources}]
[INFO] Using 'UTF-8' encoding to copy filtered resources.
[INFO] Copying 3 resources
[INFO] Copying 10 resources
[INFO] skip non existing resourceDirectory C:\hudson\hudson-slave\workspace\CXF-2.3.x-windows\2.3.x-fixes\rt\ws\rm\src\main\resources-filtered
[INFO] Copying 1 resource
[INFO] Copying 3 resources
[INFO] [compiler:compile {execution: default-compile}]
[INFO] Compiling 69 source files to C:\hudson\hudson-slave\workspace\CXF-2.3.x-windows\2.3.x-fixes\rt\ws\rm\target\classes
[INFO] [resources:testResources {execution: default-testResources}]
[INFO] Using 'UTF-8' encoding to copy filtered resources.
[INFO] Copying 9 resources
[INFO] skip non existing resourceDirectory C:\hudson\hudson-slave\workspace\CXF-2.3.x-windows\2.3.x-fixes\rt\ws\rm\src\test\resources
[INFO] skip non existing resourceDirectory C:\hudson\hudson-slave\workspace\CXF-2.3.x-windows\2.3.x-fixes\rt\ws\rm\target\generated\src\test\resources
[INFO] Copying 3 resources
[INFO] [compiler:testCompile {execution: default-testCompile}]
[INFO] Compiling 21 source files to C:\hudson\hudson-slave\workspace\CXF-2.3.x-windows\2.3.x-fixes\rt\ws\rm\target\test-classes
[INFO] [surefire:test {execution: default-test}]
[INFO] Surefire report directory: C:\hudson\hudson-slave\workspace\CXF-2.3.x-windows\2.3.x-fixes\rt\ws\rm\target\surefire-reports

-------------------------------------------------------
 T E S T S
-------------------------------------------------------
Running org.apache.cxf.ws.rm.AbstractEndpointTest
Tests run: 2, Failures: 0, Errors: 0, Skipped: 0, Time elapsed: 0.423 sec
Running org.apache.cxf.ws.rm.AbstractRMInterceptorTest
Tests run: 5, Failures: 0, Errors: 0, Skipped: 0, Time elapsed: 0.154 sec
Running org.apache.cxf.ws.rm.AbstractSequenceTest
Tests run: 1, Failures: 0, Errors: 0, Skipped: 0, Time elapsed: 0.002 sec
Running org.apache.cxf.ws.rm.DestinationSequenceTest
Tests run: 23, Failures: 0, Errors: 0, Skipped: 0, Time elapsed: 2.405 sec
Running org.apache.cxf.ws.rm.DestinationTest
Tests run: 7, Failures: 0, Errors: 0, Skipped: 0, Time elapsed: 0.16 sec
Running org.apache.cxf.ws.rm.ProxyTest
Tests run: 12, Failures: 0, Errors: 0, Skipped: 0, Time elapsed: 0.305 sec
Running org.apache.cxf.ws.rm.RMContextUtilsTest
Tests run: 10, Failures: 0, Errors: 0, Skipped: 0, Time elapsed: 0.048 sec
Running org.apache.cxf.ws.rm.RMEndpointTest
Tests run: 18, Failures: 0, Errors: 0, Skipped: 0, Time elapsed: 0.586 sec
Running org.apache.cxf.ws.rm.RMInInterceptorTest
Tests run: 14, Failures: 0, Errors: 0, Skipped: 0, Time elapsed: 0.071 sec
Running org.apache.cxf.ws.rm.RMManagerConfigurationTest
Tests run: 3, Failures: 0, Errors: 0, Skipped: 0, Time elapsed: 0.895 sec
Running org.apache.cxf.ws.rm.RMManagerTest
Tests run: 19, Failures: 0, Errors: 0, Skipped: 0, Time elapsed: 0.088 sec
Running org.apache.cxf.ws.rm.RMOutInterceptorTest
Tests run: 5, Failures: 0, Errors: 0, Skipped: 0, Time elapsed: 0.018 sec
Running org.apache.cxf.ws.rm.RMUtilsTest
Tests run: 1, Failures: 0, Errors: 0, Skipped: 0, Time elapsed: 0.002 sec
Running org.apache.cxf.ws.rm.SourceSequenceTest
Tests run: 8, Failures: 0, Errors: 0, Skipped: 0, Time elapsed: 1.009 sec
Running org.apache.cxf.ws.rm.persistence.PersistenceUtilsTest
Tests run: 1, Failures: 0, Errors: 0, Skipped: 0, Time elapsed: 0.068 sec
Running org.apache.cxf.ws.rm.persistence.jdbc.RMTxStoreConfigurationTest
Tests run: 1, Failures: 0, Errors: 0, Skipped: 0, Time elapsed: 0.115 sec
Running org.apache.cxf.ws.rm.persistence.jdbc.RMTxStoreTest
Tests run: 9, Failures: 0, Errors: 0, Skipped: 0, Time elapsed: 2.781 sec
Running org.apache.cxf.ws.rm.policy.PolicyUtilsTest
Tests run: 3, Failures: 0, Errors: 0, Skipped: 0, Time elapsed: 0.004 sec
Running org.apache.cxf.ws.rm.soap.RMSoapInterceptorTest
Tests run: 8, Failures: 0, Errors: 0, Skipped: 0, Time elapsed: 0.105 sec
Running org.apache.cxf.ws.rm.soap.RetransmissionQueueImplTest
Tests run: 11, Failures: 0, Errors: 0, Skipped: 0, Time elapsed: 0.066 sec
Running org.apache.cxf.ws.rm.soap.SoapFaultFactoryTest
Tests run: 6, Failures: 0, Errors: 0, Skipped: 0, Time elapsed: 0.12 sec

Results :

Tests run: 167, Failures: 0, Errors: 0, Skipped: 0

[JENKINS] Recording test results
[INFO] [jar:jar {execution: default-jar}]
[INFO] Building jar: C:\hudson\hudson-slave\workspace\CXF-2.3.x-windows\2.3.x-fixes\rt\ws\rm\target\cxf-rt-ws-rm-2.3.5-SNAPSHOT.jar
[INFO] [install:install {execution: default-install}]
[INFO] Installing C:\hudson\hudson-slave\workspace\CXF-2.3.x-windows\2.3.x-fixes\rt\ws\rm\target\cxf-rt-ws-rm-2.3.5-SNAPSHOT.jar
to <https://builds.apache.org/hudson/job/CXF-2.3.x-windows/ws/.repository\org\apache\cxf\cxf-rt-ws-rm\2.3.5-SNAPSHOT\cxf-rt-ws-rm-2.3.5-SNAPSHOT.jar>
[JENKINS] Archiving C:\hudson\hudson-slave\workspace\CXF-2.3.x-windows\2.3.x-fixes\rt\ws\rm\target\cxf-rt-ws-rm-2.3.5-SNAPSHOT.jar
to /home/hudson/hudson/jobs/CXF-2.3.x-windows/modules/org.apache.cxf$cxf-rt-ws-rm/builds/2011-05-24_18-12-59/archive/org.apache.cxf/cxf-rt-ws-rm/2.3.5-SNAPSHOT/cxf-rt-ws-rm-2.3.5-SNAPSHOT.jar
[INFO] ------------------------------------------------------------------------
[INFO] Building Apache CXF Runtime WS Security
[INFO]    task-segment: [clean, install]
[INFO] ------------------------------------------------------------------------
[INFO] [clean:clean {execution: default-clean}]
[INFO] Deleting C:\hudson\hudson-slave\workspace\CXF-2.3.x-windows\2.3.x-fixes\rt\ws\security\target
[INFO] [checkstyle:checkstyle {execution: validate}]
[INFO] Starting audit...
Audit done.

[INFO] Preparing pmd:check
[JENKINS] Archiving C:\hudson\hudson-slave\workspace\CXF-2.3.x-windows\2.3.x-fixes\rt\ws\security\pom.xml
to /home/hudson/hudson/jobs/CXF-2.3.x-windows/modules/org.apache.cxf$cxf-rt-ws-security/builds/2011-05-24_18-12-59/archive/org.apache.cxf/cxf-rt-ws-security/2.3.5-SNAPSHOT/cxf-rt-ws-security-2.3.5-SNAPSHOT.pom
[INFO] [pmd:pmd {execution: pmd}]
[INFO] [pmd:check {execution: validate}]
[INFO] 
[INFO] [cxf-xml2fastinfoset:xml2fastinfoset {execution: xml2fastinfoset}]
[INFO] [remote-resources:process {execution: default}]
[INFO] [resources:resources {execution: default-resources}]
[INFO] Using 'UTF-8' encoding to copy filtered resources.
[INFO] Copying 4 resources
[INFO] Copying 2 resources
[INFO] skip non existing resourceDirectory C:\hudson\hudson-slave\workspace\CXF-2.3.x-windows\2.3.x-fixes\rt\ws\security\src\main\resources-filtered
[INFO] Copying 1 resource
[INFO] Copying 3 resources
[INFO] [compiler:compile {execution: default-compile}]
[INFO] Compiling 101 source files to C:\hudson\hudson-slave\workspace\CXF-2.3.x-windows\2.3.x-fixes\rt\ws\security\target\classes
[INFO] -------------------------------------------------------------
[WARNING] COMPILATION WARNING : 
[INFO] -------------------------------------------------------------
[WARNING] \hudson\hudson-slave\workspace\CXF-2.3.x-windows\2.3.x-fixes\rt\ws\security\src\main\java\org\apache\cxf\ws\security\wss4j\WSS4JInInterceptor.java:[435,59]
[unchecked] unchecked conversion
found   : java.util.Vector
required: java.util.List<org.apache.ws.security.WSSecurityEngineResult>
[INFO] 1 warning
[INFO] -------------------------------------------------------------
[INFO] -------------------------------------------------------------
[ERROR] COMPILATION ERROR : 
[INFO] -------------------------------------------------------------
[ERROR] \hudson\hudson-slave\workspace\CXF-2.3.x-windows\2.3.x-fixes\rt\ws\security\src\main\java\org\apache\cxf\ws\security\policy\model\UsernameToken.java:[26,40]
cannot find symbol
symbol  : class SP13Constants
location: package org.apache.cxf.ws.security.policy
[ERROR] \hudson\hudson-slave\workspace\CXF-2.3.x-windows\2.3.x-fixes\rt\ws\security\src\main\java\org\apache\cxf\ws\security\policy\model\UsernameToken.java:[146,20]
cannot find symbol
symbol  : method isRequireCreated()
location: class org.apache.cxf.ws.security.policy.model.UsernameToken
[ERROR] \hudson\hudson-slave\workspace\CXF-2.3.x-windows\2.3.x-fixes\rt\ws\security\src\main\java\org\apache\cxf\ws\security\policy\model\UsernameToken.java:[147,45]
cannot find symbol
symbol  : variable SP13Constants
location: class org.apache.cxf.ws.security.policy.model.UsernameToken
[ERROR] \hudson\hudson-slave\workspace\CXF-2.3.x-windows\2.3.x-fixes\rt\ws\security\src\main\java\org\apache\cxf\ws\security\policy\model\UsernameToken.java:[147,81]
cannot find symbol
symbol  : variable SP13Constants
location: class org.apache.cxf.ws.security.policy.model.UsernameToken
[ERROR] \hudson\hudson-slave\workspace\CXF-2.3.x-windows\2.3.x-fixes\rt\ws\security\src\main\java\org\apache\cxf\ws\security\policy\model\UsernameToken.java:[148,42]
cannot find symbol
symbol  : variable SP13Constants
location: class org.apache.cxf.ws.security.policy.model.UsernameToken
[ERROR] \hudson\hudson-slave\workspace\CXF-2.3.x-windows\2.3.x-fixes\rt\ws\security\src\main\java\org\apache\cxf\ws\security\policy\model\UsernameToken.java:[148,67]
cannot find symbol
symbol  : variable SP13Constants
location: class org.apache.cxf.ws.security.policy.model.UsernameToken
[ERROR] \hudson\hudson-slave\workspace\CXF-2.3.x-windows\2.3.x-fixes\rt\ws\security\src\main\java\org\apache\cxf\ws\security\policy\model\UsernameToken.java:[151,20]
cannot find symbol
symbol  : method isRequireNonce()
location: class org.apache.cxf.ws.security.policy.model.UsernameToken
[ERROR] \hudson\hudson-slave\workspace\CXF-2.3.x-windows\2.3.x-fixes\rt\ws\security\src\main\java\org\apache\cxf\ws\security\policy\model\UsernameToken.java:[152,45]
cannot find symbol
symbol  : variable SP13Constants
location: class org.apache.cxf.ws.security.policy.model.UsernameToken
[ERROR] \hudson\hudson-slave\workspace\CXF-2.3.x-windows\2.3.x-fixes\rt\ws\security\src\main\java\org\apache\cxf\ws\security\policy\model\UsernameToken.java:[152,79]
cannot find symbol
symbol  : variable SP13Constants
location: class org.apache.cxf.ws.security.policy.model.UsernameToken
[ERROR] \hudson\hudson-slave\workspace\CXF-2.3.x-windows\2.3.x-fixes\rt\ws\security\src\main\java\org\apache\cxf\ws\security\policy\model\UsernameToken.java:[153,42]
cannot find symbol
symbol  : variable SP13Constants
location: class org.apache.cxf.ws.security.policy.model.UsernameToken
[ERROR] \hudson\hudson-slave\workspace\CXF-2.3.x-windows\2.3.x-fixes\rt\ws\security\src\main\java\org\apache\cxf\ws\security\policy\model\UsernameToken.java:[153,67]
cannot find symbol
symbol  : variable SP13Constants
location: class org.apache.cxf.ws.security.policy.model.UsernameToken
[INFO] 11 errors 
[INFO] -------------------------------------------------------------
[INFO] ------------------------------------------------------------------------
[ERROR] BUILD FAILURE
[INFO] ------------------------------------------------------------------------
[INFO] Compilation failure

\hudson\hudson-slave\workspace\CXF-2.3.x-windows\2.3.x-fixes\rt\ws\security\src\main\java\org\apache\cxf\ws\security\policy\model\UsernameToken.java:[26,40]
cannot find symbol
symbol  : class SP13Constants
location: package org.apache.cxf.ws.security.policy
\hudson\hudson-slave\workspace\CXF-2.3.x-windows\2.3.x-fixes\rt\ws\security\src\main\java\org\apache\cxf\ws\security\policy\model\UsernameToken.java:[146,20]
cannot find symbol
symbol  : method isRequireCreated()
location: class org.apache.cxf.ws.security.policy.model.UsernameToken
\hudson\hudson-slave\workspace\CXF-2.3.x-windows\2.3.x-fixes\rt\ws\security\src\main\java\org\apache\cxf\ws\security\policy\model\UsernameToken.java:[147,45]
cannot find symbol
symbol  : variable SP13Constants
location: class org.apache.cxf.ws.security.policy.model.UsernameToken
\hudson\hudson-slave\workspace\CXF-2.3.x-windows\2.3.x-fixes\rt\ws\security\src\main\java\org\apache\cxf\ws\security\policy\model\UsernameToken.java:[147,81]
cannot find symbol
symbol  : variable SP13Constants
location: class org.apache.cxf.ws.security.policy.model.UsernameToken
\hudson\hudson-slave\workspace\CXF-2.3.x-windows\2.3.x-fixes\rt\ws\security\src\main\java\org\apache\cxf\ws\security\policy\model\UsernameToken.java:[148,42]
cannot find symbol
symbol  : variable SP13Constants
location: class org.apache.cxf.ws.security.policy.model.UsernameToken
\hudson\hudson-slave\workspace\CXF-2.3.x-windows\2.3.x-fixes\rt\ws\security\src\main\java\org\apache\cxf\ws\security\policy\model\UsernameToken.java:[148,67]
cannot find symbol
symbol  : variable SP13Constants
location: class org.apache.cxf.ws.security.policy.model.UsernameToken
\hudson\hudson-slave\workspace\CXF-2.3.x-windows\2.3.x-fixes\rt\ws\security\src\main\java\org\apache\cxf\ws\security\policy\model\UsernameToken.java:[151,20]
cannot find symbol
symbol  : method isRequireNonce()
location: class org.apache.cxf.ws.security.policy.model.UsernameToken
\hudson\hudson-slave\workspace\CXF-2.3.x-windows\2.3.x-fixes\rt\ws\security\src\main\java\org\apache\cxf\ws\security\policy\model\UsernameToken.java:[152,45]
cannot find symbol
symbol  : variable SP13Constants
location: class org.apache.cxf.ws.security.policy.model.UsernameToken
\hudson\hudson-slave\workspace\CXF-2.3.x-windows\2.3.x-fixes\rt\ws\security\src\main\java\org\apache\cxf\ws\security\policy\model\UsernameToken.java:[152,79]
cannot find symbol
symbol  : variable SP13Constants
location: class org.apache.cxf.ws.security.policy.model.UsernameToken
\hudson\hudson-slave\workspace\CXF-2.3.x-windows\2.3.x-fixes\rt\ws\security\src\main\java\org\apache\cxf\ws\security\policy\model\UsernameToken.java:[153,42]
cannot find symbol
symbol  : variable SP13Constants
location: class org.apache.cxf.ws.security.policy.model.UsernameToken
\hudson\hudson-slave\workspace\CXF-2.3.x-windows\2.3.x-fixes\rt\ws\security\src\main\java\org\apache\cxf\ws\security\policy\model\UsernameToken.java:[153,67]
cannot find symbol
symbol  : variable SP13Constants
location: class org.apache.cxf.ws.security.policy.model.UsernameToken

[INFO] ------------------------------------------------------------------------
[INFO] Trace
org.apache.maven.BuildFailureException: Compilation failure
	at org.apache.maven.lifecycle.DefaultLifecycleExecutor.executeGoals(DefaultLifecycleExecutor.java:715)
	at org.apache.maven.lifecycle.DefaultLifecycleExecutor.executeGoalWithLifecycle(DefaultLifecycleExecutor.java:556)
	at org.apache.maven.lifecycle.DefaultLifecycleExecutor.executeGoal(DefaultLifecycleExecutor.java:535)
	at org.apache.maven.lifecycle.DefaultLifecycleExecutor.executeGoalAndHandleFailures(DefaultLifecycleExecutor.java:387)
	at org.apache.maven.lifecycle.DefaultLifecycleExecutor.executeTaskSegments(DefaultLifecycleExecutor.java:348)
	at org.apache.maven.lifecycle.DefaultLifecycleExecutor.execute(DefaultLifecycleExecutor.java:180)
	at org.apache.maven.lifecycle.LifecycleExecutorInterceptor.execute(LifecycleExecutorInterceptor.java:65)
	at org.apache.maven.DefaultMaven.doExecute(DefaultMaven.java:328)
	at org.apache.maven.DefaultMaven.execute(DefaultMaven.java:138)
	at org.apache.maven.cli.MavenCli.main(MavenCli.java:362)
	at sun.reflect.NativeMethodAccessorImpl.invoke0(Native Method)
	at sun.reflect.NativeMethodAccessorImpl.invoke(NativeMethodAccessorImpl.java:39)
	at sun.reflect.DelegatingMethodAccessorImpl.invoke(DelegatingMethodAccessorImpl.java:25)
	at java.lang.reflect.Method.invoke(Method.java:597)
	at org.codehaus.classworlds.Launcher.launchEnhanced(Launcher.java:315)
	at org.codehaus.classworlds.Launcher.launch(Launcher.java:255)
	at hudson.maven.agent.Main.launch(Main.java:185)
	at hudson.maven.MavenBuilder.call(MavenBuilder.java:164)
	at hudson.maven.MavenModuleSetBuild$Builder.call(MavenModuleSetBuild.java:987)
	at hudson.maven.MavenModuleSetBuild$Builder.call(MavenModuleSetBuild.java:918)
	at hudson.remoting.UserRequest.perform(UserRequest.java:118)
	at hudson.remoting.UserRequest.perform(UserRequest.java:48)
	at hudson.remoting.Request$2.run(Request.java:270)
	at java.util.concurrent.Executors$RunnableAdapter.call(Executors.java:441)
	at java.util.concurrent.FutureTask$Sync.innerRun(FutureTask.java:303)
	at java.util.concurrent.FutureTask.run(FutureTask.java:138)
	at java.util.concurrent.ThreadPoolExecutor$Worker.runTask(ThreadPoolExecutor.java:886)
	at java.util.concurrent.ThreadPoolExecutor$Worker.run(ThreadPoolExecutor.java:908)
	at java.lang.Thread.run(Thread.java:619)
Caused by: org.apache.maven.plugin.CompilationFailureException: Compilation failure
	at org.apache.maven.plugin.AbstractCompilerMojo.execute(AbstractCompilerMojo.java:656)
	at org.apache.maven.plugin.CompilerMojo.execute(CompilerMojo.java:128)
	at org.apache.maven.plugin.DefaultPluginManager.executeMojo(DefaultPluginManager.java:490)
	at hudson.maven.agent.PluginManagerInterceptor.executeMojo(PluginManagerInterceptor.java:182)
	at org.apache.maven.lifecycle.DefaultLifecycleExecutor.executeGoals(DefaultLifecycleExecutor.java:694)
	... 28 more
[INFO] ------------------------------------------------------------------------
[INFO] Total time: 15 minutes 6 seconds
[INFO] Finished at: Tue May 24 19:28:05 BST 2011
[INFO] Final Memory: 243M/479M
[INFO] ------------------------------------------------------------------------
Sending e-mails to: notifications@cxf.apache.org dkulp_apache@dankulp.com
channel stopped


Mime
View raw message