cxf-notifications mailing list archives

Site index · List index
Message view « Date » · « Thread »
Top « Date » · « Thread »
From Apache Jenkins Server <hud...@hudson.apache.org>
Subject Build failed in Jenkins: CXF-trunk-windows #111
Date Fri, 13 May 2011 22:27:45 GMT
See <https://builds.apache.org/hudson/job/CXF-trunk-windows/111/changes>

Changes:

[coheigea] Made some improvements to how token inclusion types are handled inbound + outbound.

[sergeyb] [CXF-3498] Better support for grammars with referenced schemas

[ffang] [CXF-3506]Service list page displays no services in unformatted mode

[ffang] [CXF-3501]testcase to demonstrate how to pass array by dynamic client

------------------------------------------
[...truncated 5384 lines...]
[INFO] Installing C:\hudson\hudson-slave\workspace\CXF-trunk-windows\trunk w spaces\systests\transports\target\cxf-systests-transports-2.4.1-SNAPSHOT.jar
to <https://builds.apache.org/hudson/job/CXF-trunk-windows/ws/.repository\org\apache\cxf\systests\cxf-systests-transports\2.4.1-SNAPSHOT\cxf-systests-transports-2.4.1-SNAPSHOT.jar>
[INFO] Installing C:\hudson\hudson-slave\workspace\CXF-trunk-windows\trunk w spaces\systests\transports\target\cxf-systests-transports-2.4.1-SNAPSHOT-tests.jar
to <https://builds.apache.org/hudson/job/CXF-trunk-windows/ws/.repository\org\apache\cxf\systests\cxf-systests-transports\2.4.1-SNAPSHOT\cxf-systests-transports-2.4.1-SNAPSHOT-tests.jar>
[JENKINS] Archiving disabled - not archiving C:\hudson\hudson-slave\workspace\CXF-trunk-windows\trunk
w spaces\systests\transports\pom.xml
[JENKINS] Archiving disabled - not archiving C:\hudson\hudson-slave\workspace\CXF-trunk-windows\trunk
w spaces\systests\transports\target\cxf-systests-transports-2.4.1-SNAPSHOT.jar
[JENKINS] Archiving disabled - not archiving C:\hudson\hudson-slave\workspace\CXF-trunk-windows\trunk
w spaces\systests\transports\target\cxf-systests-transports-2.4.1-SNAPSHOT-tests.jar
[INFO] ------------------------------------------------------------------------
[INFO] Building Apache CXF Transport System Tests JMS
[INFO]    task-segment: [clean, install]
[INFO] ------------------------------------------------------------------------
[INFO] [clean:clean {execution: default-clean}]
[INFO] Deleting C:\hudson\hudson-slave\workspace\CXF-trunk-windows\trunk w spaces\systests\transport-jms\target
[INFO] [cxf-xml2fastinfoset:xml2fastinfoset {execution: xml2fastinfoset}]
[INFO] [cxf-xjc:xsdtojava {execution: generate-sources}]
[INFO] [remote-resources:process {execution: default}]
[INFO] [resources:resources {execution: default-resources}]
[INFO] Using 'UTF-8' encoding to copy filtered resources.
[INFO] skip non existing resourceDirectory C:\hudson\hudson-slave\workspace\CXF-trunk-windows\trunk
w spaces\systests\transport-jms\src\main\java
[INFO] skip non existing resourceDirectory C:\hudson\hudson-slave\workspace\CXF-trunk-windows\trunk
w spaces\systests\transport-jms\src\main\resources
[INFO] skip non existing resourceDirectory C:\hudson\hudson-slave\workspace\CXF-trunk-windows\trunk
w spaces\systests\transport-jms\src\main\resources-filtered
[INFO] skip non existing resourceDirectory C:\hudson\hudson-slave\workspace\CXF-trunk-windows\trunk
w spaces\systests\transport-jms\target\generated\src\main\resources
[INFO] Copying 3 resources
[INFO] [compiler:compile {execution: default-compile}]
[INFO] Compiling 6 source files to C:\hudson\hudson-slave\workspace\CXF-trunk-windows\trunk
w spaces\systests\transport-jms\target\classes
[INFO] [cxf-codegen:wsdl2java {execution: generate-test-sources}]
[INFO] Nothing to generate
[INFO] [resources:testResources {execution: default-testResources}]
[INFO] Using 'UTF-8' encoding to copy filtered resources.
[INFO] Copying 9 resources
[INFO] Copying 2 resources
[INFO] skip non existing resourceDirectory C:\hudson\hudson-slave\workspace\CXF-trunk-windows\trunk
w spaces\systests\transport-jms\target\generated\src\test\resources
[INFO] Copying 3 resources
[INFO] [compiler:testCompile {execution: default-testCompile}]
[INFO] Compiling 79 source files to C:\hudson\hudson-slave\workspace\CXF-trunk-windows\trunk
w spaces\systests\transport-jms\target\test-classes
[INFO] [surefire:test {execution: default-test}]
[INFO] Surefire report directory: C:\hudson\hudson-slave\workspace\CXF-trunk-windows\trunk
w spaces\systests\transport-jms\target\surefire-reports

-------------------------------------------------------
 T E S T S
-------------------------------------------------------
Running org.apache.cxf.jms.testsuite.testcases.SOAPJMSTestSuiteTest
Tests run: 32, Failures: 0, Errors: 0, Skipped: 0, Time elapsed: 12.968 sec

Results :

Tests run: 32, Failures: 0, Errors: 0, Skipped: 0


-------------------------------------------------------
 T E S T S
-------------------------------------------------------
Running org.apache.cxf.systest.jms.JMSClientServerGzipTest
Tests run: 1, Failures: 0, Errors: 0, Skipped: 0, Time elapsed: 11.05 sec

Results :

Tests run: 33, Failures: 0, Errors: 0, Skipped: 0


-------------------------------------------------------
 T E S T S
-------------------------------------------------------
Running org.apache.cxf.systest.jms.JMSClientServerTest
Tests run: 24, Failures: 0, Errors: 0, Skipped: 0, Time elapsed: 25.883 sec

Results :

Tests run: 57, Failures: 0, Errors: 0, Skipped: 0


-------------------------------------------------------
 T E S T S
-------------------------------------------------------
Running org.apache.cxf.systest.jms.continuations.HelloWorldContinuationsClientServerTest
Getting continuation for Barry
Suspending invocation for Barry
Getting continuation for Rob
Suspending invocation for Rob
Getting continuation for Fred
Suspending invocation for Fred
Getting continuation for James
Suspending invocation for James
Getting continuation for Harry
Suspending invocation for Harry
Getting continuation for Barry
Saying hi to Barry Jameson
Getting continuation for Rob
Saying hi to Rob Davidson
Getting continuation for Fred
Saying hi to Fred
Getting continuation for James
Saying hi to James ServiceMix
Getting continuation for Harry
Saying hi to Harry
Tests run: 1, Failures: 0, Errors: 0, Skipped: 0, Time elapsed: 9.613 sec

Results :

Tests run: 58, Failures: 0, Errors: 0, Skipped: 0


-------------------------------------------------------
 T E S T S
-------------------------------------------------------
Running org.apache.cxf.systest.jms.continuations.HelloWorldContinuationsThrottleTest
Completed : 5
Tests run: 1, Failures: 0, Errors: 0, Skipped: 0, Time elapsed: 26.248 sec

Results :

Tests run: 59, Failures: 0, Errors: 0, Skipped: 0


-------------------------------------------------------
 T E S T S
-------------------------------------------------------
Running org.apache.cxf.systest.jms.continuations.JMSContinuationsClientServerTest
Tests run: 1, Failures: 0, Errors: 0, Skipped: 0, Time elapsed: 11.715 sec

Results :

Tests run: 60, Failures: 0, Errors: 0, Skipped: 0


-------------------------------------------------------
 T E S T S
-------------------------------------------------------
Running org.apache.cxf.systest.jms.continuations.ProviderJMSContinuationTest
Tests run: 1, Failures: 0, Errors: 0, Skipped: 0, Time elapsed: 8.912 sec

Results :

Tests run: 61, Failures: 0, Errors: 0, Skipped: 0


-------------------------------------------------------
 T E S T S
-------------------------------------------------------
Running org.apache.cxf.systest.jms.tx.JMSTransactionClientServerTest
Tests run: 2, Failures: 0, Errors: 0, Skipped: 0, Time elapsed: 12.276 sec

Results :

Tests run: 63, Failures: 0, Errors: 0, Skipped: 0

[JENKINS] Recording test results
[INFO] [jar:jar {execution: default-jar}]
[INFO] Building jar: C:\hudson\hudson-slave\workspace\CXF-trunk-windows\trunk w spaces\systests\transport-jms\target\cxf-systests-transport-jms-2.4.1-SNAPSHOT.jar
[INFO] [jar:test-jar {execution: attach-sources}]
[INFO] Building jar: C:\hudson\hudson-slave\workspace\CXF-trunk-windows\trunk w spaces\systests\transport-jms\target\cxf-systests-transport-jms-2.4.1-SNAPSHOT-tests.jar
[INFO] [install:install {execution: default-install}]
[INFO] Installing C:\hudson\hudson-slave\workspace\CXF-trunk-windows\trunk w spaces\systests\transport-jms\target\cxf-systests-transport-jms-2.4.1-SNAPSHOT.jar
to <https://builds.apache.org/hudson/job/CXF-trunk-windows/ws/.repository\org\apache\cxf\systests\cxf-systests-transport-jms\2.4.1-SNAPSHOT\cxf-systests-transport-jms-2.4.1-SNAPSHOT.jar>
[INFO] Installing C:\hudson\hudson-slave\workspace\CXF-trunk-windows\trunk w spaces\systests\transport-jms\target\cxf-systests-transport-jms-2.4.1-SNAPSHOT-tests.jar
to <https://builds.apache.org/hudson/job/CXF-trunk-windows/ws/.repository\org\apache\cxf\systests\cxf-systests-transport-jms\2.4.1-SNAPSHOT\cxf-systests-transport-jms-2.4.1-SNAPSHOT-tests.jar>
[JENKINS] Archiving disabled - not archiving C:\hudson\hudson-slave\workspace\CXF-trunk-windows\trunk
w spaces\systests\transport-jms\pom.xml
[JENKINS] Archiving disabled - not archiving C:\hudson\hudson-slave\workspace\CXF-trunk-windows\trunk
w spaces\systests\transport-jms\target\cxf-systests-transport-jms-2.4.1-SNAPSHOT.jar
[JENKINS] Archiving disabled - not archiving C:\hudson\hudson-slave\workspace\CXF-trunk-windows\trunk
w spaces\systests\transport-jms\target\cxf-systests-transport-jms-2.4.1-SNAPSHOT-tests.jar
[INFO] ------------------------------------------------------------------------
[INFO] Building Apache CXF JAX-WS System Tests
[INFO]    task-segment: [clean, install]
[INFO] ------------------------------------------------------------------------
[INFO] [clean:clean {execution: default-clean}]
[INFO] Deleting C:\hudson\hudson-slave\workspace\CXF-trunk-windows\trunk w spaces\systests\jaxws\target
[INFO] [cxf-xml2fastinfoset:xml2fastinfoset {execution: xml2fastinfoset}]
[INFO] [remote-resources:process {execution: default}]
[INFO] [resources:resources {execution: default-resources}]
[INFO] Using 'UTF-8' encoding to copy filtered resources.
[INFO] skip non existing resourceDirectory C:\hudson\hudson-slave\workspace\CXF-trunk-windows\trunk
w spaces\systests\jaxws\src\main\java
[INFO] skip non existing resourceDirectory C:\hudson\hudson-slave\workspace\CXF-trunk-windows\trunk
w spaces\systests\jaxws\src\main\resources
[INFO] skip non existing resourceDirectory C:\hudson\hudson-slave\workspace\CXF-trunk-windows\trunk
w spaces\systests\jaxws\src\main\resources-filtered
[INFO] skip non existing resourceDirectory C:\hudson\hudson-slave\workspace\CXF-trunk-windows\trunk
w spaces\systests\jaxws\target\generated\src\main\resources
[INFO] Copying 3 resources
[INFO] [compiler:compile {execution: default-compile}]
[INFO] No sources to compile
[INFO] [cxf-codegen:wsdl2java {execution: generate-test-sources}]
[INFO] Running wsdl2java in fork mode...
[INFO] Building jar: C:\Users\hudson\AppData\Local\Temp\cxf-tmp-535356\cxf-codegen256209403207342969.jar
[INFO] [resources:testResources {execution: default-testResources}]
[INFO] Using 'UTF-8' encoding to copy filtered resources.
[INFO] Copying 42 resources
[INFO] Copying 7 resources
[INFO] skip non existing resourceDirectory C:\hudson\hudson-slave\workspace\CXF-trunk-windows\trunk
w spaces\systests\jaxws\target\generated\src\test\resources
[INFO] Copying 3 resources
[INFO] [compiler:testCompile {execution: default-testCompile}]
[INFO] Compiling 139 source files to C:\hudson\hudson-slave\workspace\CXF-trunk-windows\trunk
w spaces\systests\jaxws\target\test-classes
[INFO] -------------------------------------------------------------
[ERROR] COMPILATION ERROR : 
[INFO] -------------------------------------------------------------
[ERROR] \hudson\hudson-slave\workspace\CXF-trunk-windows\trunk w spaces\systests\jaxws\src\test\java\org\apache\cxf\systest\jaxws\ArrayServiceImpl.java:[29,5]
method does not override a method from its superclass
[INFO] 1 error
[INFO] -------------------------------------------------------------
[JENKINS] Archiving disabled - not archiving C:\hudson\hudson-slave\workspace\CXF-trunk-windows\trunk
w spaces\systests\jaxws\pom.xml
[INFO] ------------------------------------------------------------------------
[ERROR] BUILD FAILURE
[INFO] ------------------------------------------------------------------------
[INFO] Compilation failure
\hudson\hudson-slave\workspace\CXF-trunk-windows\trunk w spaces\systests\jaxws\src\test\java\org\apache\cxf\systest\jaxws\ArrayServiceImpl.java:[29,5]
method does not override a method from its superclass

[INFO] ------------------------------------------------------------------------
[INFO] Trace
org.apache.maven.BuildFailureException: Compilation failure
\hudson\hudson-slave\workspace\CXF-trunk-windows\trunk w spaces\systests\jaxws\src\test\java\org\apache\cxf\systest\jaxws\ArrayServiceImpl.java:[29,5]
method does not override a method from its superclass

	at org.apache.maven.lifecycle.DefaultLifecycleExecutor.executeGoals(DefaultLifecycleExecutor.java:715)
	at org.apache.maven.lifecycle.DefaultLifecycleExecutor.executeGoalWithLifecycle(DefaultLifecycleExecutor.java:556)
	at org.apache.maven.lifecycle.DefaultLifecycleExecutor.executeGoal(DefaultLifecycleExecutor.java:535)
	at org.apache.maven.lifecycle.DefaultLifecycleExecutor.executeGoalAndHandleFailures(DefaultLifecycleExecutor.java:387)
	at org.apache.maven.lifecycle.DefaultLifecycleExecutor.executeTaskSegments(DefaultLifecycleExecutor.java:348)
	at org.apache.maven.lifecycle.DefaultLifecycleExecutor.execute(DefaultLifecycleExecutor.java:180)
	at org.apache.maven.lifecycle.LifecycleExecutorInterceptor.execute(LifecycleExecutorInterceptor.java:65)
	at org.apache.maven.DefaultMaven.doExecute(DefaultMaven.java:328)
	at org.apache.maven.DefaultMaven.execute(DefaultMaven.java:138)
	at org.apache.maven.cli.MavenCli.main(MavenCli.java:362)
	at sun.reflect.NativeMethodAccessorImpl.invoke0(Native Method)
	at sun.reflect.NativeMethodAccessorImpl.invoke(NativeMethodAccessorImpl.java:39)
	at sun.reflect.DelegatingMethodAccessorImpl.invoke(DelegatingMethodAccessorImpl.java:25)
	at java.lang.reflect.Method.invoke(Method.java:592)
	at org.codehaus.classworlds.Launcher.launchEnhanced(Launcher.java:315)
	at org.codehaus.classworlds.Launcher.launch(Launcher.java:255)
	at hudson.maven.agent.Main.launch(Main.java:185)
	at hudson.maven.MavenBuilder.call(MavenBuilder.java:164)
	at hudson.maven.MavenModuleSetBuild$Builder.call(MavenModuleSetBuild.java:987)
	at hudson.maven.MavenModuleSetBuild$Builder.call(MavenModuleSetBuild.java:918)
	at hudson.remoting.UserRequest.perform(UserRequest.java:118)
	at hudson.remoting.UserRequest.perform(UserRequest.java:48)
	at hudson.remoting.Request$2.run(Request.java:270)
	at java.util.concurrent.Executors$RunnableAdapter.call(Executors.java:417)
	at java.util.concurrent.FutureTask$Sync.innerRun(FutureTask.java:269)
	at java.util.concurrent.FutureTask.run(FutureTask.java:123)
	at java.util.concurrent.ThreadPoolExecutor$Worker.runTask(ThreadPoolExecutor.java:651)
	at java.util.concurrent.ThreadPoolExecutor$Worker.run(ThreadPoolExecutor.java:676)
	at java.lang.Thread.run(Thread.java:595)
Caused by: org.apache.maven.plugin.CompilationFailureException: Compilation failure
\hudson\hudson-slave\workspace\CXF-trunk-windows\trunk w spaces\systests\jaxws\src\test\java\org\apache\cxf\systest\jaxws\ArrayServiceImpl.java:[29,5]
method does not override a method from its superclass

	at org.apache.maven.plugin.AbstractCompilerMojo.execute(AbstractCompilerMojo.java:656)
	at org.apache.maven.plugin.TestCompilerMojo.execute(TestCompilerMojo.java:161)
	at org.apache.maven.plugin.DefaultPluginManager.executeMojo(DefaultPluginManager.java:490)
	at hudson.maven.agent.PluginManagerInterceptor.executeMojo(PluginManagerInterceptor.java:182)
	at org.apache.maven.lifecycle.DefaultLifecycleExecutor.executeGoals(DefaultLifecycleExecutor.java:694)
	... 28 more
[INFO] ------------------------------------------------------------------------
[INFO] Total time: 24 minutes 5 seconds
[INFO] Finished at: Fri May 13 23:27:28 BST 2011
[INFO] Final Memory: 166M/407M
[INFO] ------------------------------------------------------------------------
Waiting for Jenkins to finish collecting data
Sending e-mails to: notifications@cxf.apache.org sberyozkin@gmail.com
Sending e-mails to: notifications@cxf.apache.org ffang@iona.com
Sending e-mails to: notifications@cxf.apache.org
channel stopped


Mime
View raw message