cxf-notifications mailing list archives

Site index · List index
Message view « Date » · « Thread »
Top « Date » · « Thread »
From Apache Jenkins Server <hud...@hudson.apache.org>
Subject Build failed in Jenkins: CXF-Trunk-JDK15 #2104
Date Thu, 26 May 2011 19:09:21 GMT
See <https://builds.apache.org/hudson/job/CXF-Trunk-JDK15/2104/changes>

Changes:

[dkulp] [CXF-2465, CXF-3182] Output wsdl:documentation information into javadoc

[dkulp] [CXF-3514] Start splitting the PRE_PROTOCOL phase to reduce the number
of interceptors that live in it and help make sure the interceptors are
all run in an order that actually will work.
(Note to self: Need to run TCK to verify this change)

------------------------------------------
[...truncated 290 lines...]
[INFO] skip non existing resourceDirectory <https://builds.apache.org/hudson/job/CXF-Trunk-JDK15/ws/trunk/api/target/generated/src/main/resources>
[INFO] Copying 3 resources
[INFO] [compiler:compile {execution: default-compile}]
[INFO] Compiling 279 source files to <https://builds.apache.org/hudson/job/CXF-Trunk-JDK15/ws/trunk/api/target/classes>
[INFO] [cxf-xjc:xsdtojava-tests {execution: generate-test-sources}]
[INFO] [resources:testResources {execution: default-testResources}]
[INFO] Using 'UTF-8' encoding to copy filtered resources.
[INFO] Copying 1 resource
[INFO] Copying 5 resources
[INFO] skip non existing resourceDirectory <https://builds.apache.org/hudson/job/CXF-Trunk-JDK15/ws/trunk/api/target/generated/src/test/resources>
[INFO] Copying 3 resources
[INFO] [compiler:testCompile {execution: default-testCompile}]
[INFO] Compiling 28 source files to <https://builds.apache.org/hudson/job/CXF-Trunk-JDK15/ws/trunk/api/target/test-classes>
[INFO] [surefire:test {execution: default-test}]
[INFO] Surefire report directory: <https://builds.apache.org/hudson/job/CXF-Trunk-JDK15/ws/trunk/api/target/surefire-reports>

-------------------------------------------------------
 T E S T S
-------------------------------------------------------
Running org.apache.cxf.BusFactoryTest
Tests run: 1, Failures: 0, Errors: 0, Skipped: 0, Time elapsed: 0.158 sec
Running org.apache.cxf.NSManagerTest
Tests run: 1, Failures: 0, Errors: 0, Skipped: 0, Time elapsed: 0.004 sec
Running org.apache.cxf.continuations.ContinuationInfoTest
Tests run: 1, Failures: 0, Errors: 0, Skipped: 0, Time elapsed: 0.007 sec
Running org.apache.cxf.continuations.SuspendedInvocationExceptionTest
Tests run: 2, Failures: 0, Errors: 0, Skipped: 0, Time elapsed: 0.004 sec
Running org.apache.cxf.databinding.AbstractDataBindingTest
Tests run: 2, Failures: 0, Errors: 0, Skipped: 0, Time elapsed: 0.004 sec
Running org.apache.cxf.phase.PhaseInterceptorChainTest
Tests run: 21, Failures: 0, Errors: 0, Skipped: 0, Time elapsed: 0.194 sec
Running org.apache.cxf.service.model.BindingFaultInfoTest
Tests run: 1, Failures: 0, Errors: 0, Skipped: 0, Time elapsed: 0.005 sec
Running org.apache.cxf.service.model.BindingMessageInfoTest
Tests run: 1, Failures: 0, Errors: 0, Skipped: 0, Time elapsed: 0.003 sec
Running org.apache.cxf.service.model.BindingOperationInfoTest
Tests run: 6, Failures: 0, Errors: 0, Skipped: 0, Time elapsed: 0.01 sec
Running org.apache.cxf.service.model.FaultInfoTest
Tests run: 1, Failures: 0, Errors: 0, Skipped: 0, Time elapsed: 0.002 sec
Running org.apache.cxf.service.model.InterfaceInfoTest
Tests run: 2, Failures: 0, Errors: 0, Skipped: 0, Time elapsed: 0.031 sec
Running org.apache.cxf.service.model.MessageInfoTest
Tests run: 2, Failures: 0, Errors: 0, Skipped: 0, Time elapsed: 0.002 sec
Running org.apache.cxf.service.model.MessagePartInfoTest
Tests run: 3, Failures: 0, Errors: 0, Skipped: 0, Time elapsed: 0.002 sec
Running org.apache.cxf.service.model.OperationInfoTest
Tests run: 5, Failures: 0, Errors: 0, Skipped: 0, Time elapsed: 0.003 sec
Running org.apache.cxf.ws.policy.AssertionInfoMapTest
Tests run: 4, Failures: 0, Errors: 0, Skipped: 0, Time elapsed: 0.016 sec
Running org.apache.cxf.ws.policy.builder.jaxb.JaxbAssertionBuilderTest
Tests run: 3, Failures: 0, Errors: 0, Skipped: 0, Time elapsed: 0.277 sec
Running org.apache.cxf.ws.policy.builder.jaxb.JaxbAssertionTest
Tests run: 3, Failures: 0, Errors: 0, Skipped: 0, Time elapsed: 0.016 sec
Running org.apache.cxf.wsdl.JAXBExtensionHelperTest
Tests run: 3, Failures: 0, Errors: 0, Skipped: 0, Time elapsed: 0.319 sec

Results :

Tests run: 62, Failures: 0, Errors: 0, Skipped: 0

[JENKINS] Recording test results
[INFO] [jar:jar {execution: default-jar}]
[INFO] Building jar: <https://builds.apache.org/hudson/job/CXF-Trunk-JDK15/ws/trunk/api/target/cxf-api-2.4.1-SNAPSHOT.jar>
[INFO] [install:install {execution: default-install}]
[INFO] Installing <https://builds.apache.org/hudson/job/CXF-Trunk-JDK15/ws/trunk/api/target/cxf-api-2.4.1-SNAPSHOT.jar>
to <https://builds.apache.org/hudson/job/CXF-Trunk-JDK15/ws/.repository/org/apache/cxf/cxf-api/2.4.1-SNAPSHOT/cxf-api-2.4.1-SNAPSHOT.jar>
[JENKINS] Archiving <https://builds.apache.org/hudson/job/CXF-Trunk-JDK15/ws/trunk/api/pom.xml>
to /home/hudson/hudson/jobs/CXF-Trunk-JDK15/modules/org.apache.cxf$cxf-api/builds/2011-05-26_19-07-37/archive/org.apache.cxf/cxf-api/2.4.1-SNAPSHOT/cxf-api-2.4.1-SNAPSHOT.pom
[JENKINS] Archiving <https://builds.apache.org/hudson/job/CXF-Trunk-JDK15/ws/trunk/api/target/cxf-api-2.4.1-SNAPSHOT.jar>
to /home/hudson/hudson/jobs/CXF-Trunk-JDK15/modules/org.apache.cxf$cxf-api/builds/2011-05-26_19-07-37/archive/org.apache.cxf/cxf-api/2.4.1-SNAPSHOT/cxf-api-2.4.1-SNAPSHOT.jar
[INFO] ------------------------------------------------------------------------
[INFO] Building Apache CXF Woodstox/MSV Schema Validation
[INFO]    task-segment: [clean, install]
[INFO] ------------------------------------------------------------------------
[INFO] [clean:clean {execution: default-clean}]
[INFO] Deleting <https://builds.apache.org/hudson/job/CXF-Trunk-JDK15/ws/trunk/common/wstx-msv-validation/target>
[INFO] [cxf-xml2fastinfoset:xml2fastinfoset {execution: xml2fastinfoset}]
[INFO] [remote-resources:process {execution: default}]
[INFO] [resources:resources {execution: default-resources}]
[INFO] Using 'UTF-8' encoding to copy filtered resources.
[INFO] Copying 0 resource
[INFO] Copying 4 resources
[INFO] skip non existing resourceDirectory <https://builds.apache.org/hudson/job/CXF-Trunk-JDK15/ws/trunk/common/wstx-msv-validation/src/main/resources-filtered>
[INFO] Copying 1 resource
[INFO] Copying 3 resources
[INFO] [compiler:compile {execution: default-compile}]
[INFO] Compiling 5 source files to <https://builds.apache.org/hudson/job/CXF-Trunk-JDK15/ws/trunk/common/wstx-msv-validation/target/classes>
[INFO] [resources:testResources {execution: default-testResources}]
[INFO] Using 'UTF-8' encoding to copy filtered resources.
[INFO] skip non existing resourceDirectory <https://builds.apache.org/hudson/job/CXF-Trunk-JDK15/ws/trunk/common/wstx-msv-validation/src/test/java>
[INFO] skip non existing resourceDirectory <https://builds.apache.org/hudson/job/CXF-Trunk-JDK15/ws/trunk/common/wstx-msv-validation/src/test/resources>
[INFO] skip non existing resourceDirectory <https://builds.apache.org/hudson/job/CXF-Trunk-JDK15/ws/trunk/common/wstx-msv-validation/target/generated/src/test/resources>
[INFO] Copying 3 resources
[INFO] [compiler:testCompile {execution: default-testCompile}]
[INFO] No sources to compile
[INFO] [surefire:test {execution: default-test}]
[INFO] Surefire report directory: <https://builds.apache.org/hudson/job/CXF-Trunk-JDK15/ws/trunk/common/wstx-msv-validation/target/surefire-reports>

-------------------------------------------------------
 T E S T S
-------------------------------------------------------
There are no tests to run.

Results :

Tests run: 0, Failures: 0, Errors: 0, Skipped: 0

[JENKINS] Recording test results
[INFO] [jar:jar {execution: default-jar}]
[INFO] Building jar: <https://builds.apache.org/hudson/job/CXF-Trunk-JDK15/ws/trunk/common/wstx-msv-validation/target/cxf-wstx-msv-validation-2.4.1-SNAPSHOT.jar>
[INFO] [install:install {execution: default-install}]
[INFO] Installing <https://builds.apache.org/hudson/job/CXF-Trunk-JDK15/ws/trunk/common/wstx-msv-validation/target/cxf-wstx-msv-validation-2.4.1-SNAPSHOT.jar>
to <https://builds.apache.org/hudson/job/CXF-Trunk-JDK15/ws/.repository/org/apache/cxf/cxf-wstx-msv-validation/2.4.1-SNAPSHOT/cxf-wstx-msv-validation-2.4.1-SNAPSHOT.jar>
[JENKINS] Archiving <https://builds.apache.org/hudson/job/CXF-Trunk-JDK15/ws/trunk/common/wstx-msv-validation/pom.xml>
to /home/hudson/hudson/jobs/CXF-Trunk-JDK15/modules/org.apache.cxf$cxf-wstx-msv-validation/builds/2011-05-26_19-07-37/archive/org.apache.cxf/cxf-wstx-msv-validation/2.4.1-SNAPSHOT/cxf-wstx-msv-validation-2.4.1-SNAPSHOT.pom
[JENKINS] Archiving <https://builds.apache.org/hudson/job/CXF-Trunk-JDK15/ws/trunk/common/wstx-msv-validation/target/cxf-wstx-msv-validation-2.4.1-SNAPSHOT.jar>
to /home/hudson/hudson/jobs/CXF-Trunk-JDK15/modules/org.apache.cxf$cxf-wstx-msv-validation/builds/2011-05-26_19-07-37/archive/org.apache.cxf/cxf-wstx-msv-validation/2.4.1-SNAPSHOT/cxf-wstx-msv-validation-2.4.1-SNAPSHOT.jar
[INFO] ------------------------------------------------------------------------
[INFO] Building Apache CXF XML Schema Validation with Xerces
[INFO]    task-segment: [clean, install]
[INFO] ------------------------------------------------------------------------
[INFO] [clean:clean {execution: default-clean}]
[INFO] Deleting <https://builds.apache.org/hudson/job/CXF-Trunk-JDK15/ws/trunk/common/xerces-xsd-validation/target>
[INFO] [cxf-xml2fastinfoset:xml2fastinfoset {execution: xml2fastinfoset}]
[INFO] [remote-resources:process {execution: default}]
[INFO] [resources:resources {execution: default-resources}]
[INFO] Using 'UTF-8' encoding to copy filtered resources.
[INFO] Copying 0 resource
[INFO] Copying 3 resources
[INFO] skip non existing resourceDirectory <https://builds.apache.org/hudson/job/CXF-Trunk-JDK15/ws/trunk/common/xerces-xsd-validation/src/main/resources-filtered>
[INFO] Copying 1 resource
[INFO] Copying 3 resources
[INFO] [compiler:compile {execution: default-compile}]
[INFO] Compiling 3 source files to <https://builds.apache.org/hudson/job/CXF-Trunk-JDK15/ws/trunk/common/xerces-xsd-validation/target/classes>
[INFO] [resources:testResources {execution: default-testResources}]
[INFO] Using 'UTF-8' encoding to copy filtered resources.
[INFO] skip non existing resourceDirectory <https://builds.apache.org/hudson/job/CXF-Trunk-JDK15/ws/trunk/common/xerces-xsd-validation/src/test/java>
[INFO] skip non existing resourceDirectory <https://builds.apache.org/hudson/job/CXF-Trunk-JDK15/ws/trunk/common/xerces-xsd-validation/src/test/resources>
[INFO] skip non existing resourceDirectory <https://builds.apache.org/hudson/job/CXF-Trunk-JDK15/ws/trunk/common/xerces-xsd-validation/target/generated/src/test/resources>
[INFO] Copying 3 resources
[INFO] [compiler:testCompile {execution: default-testCompile}]
[INFO] No sources to compile
[INFO] [surefire:test {execution: default-test}]
[INFO] Surefire report directory: <https://builds.apache.org/hudson/job/CXF-Trunk-JDK15/ws/trunk/common/xerces-xsd-validation/target/surefire-reports>

-------------------------------------------------------
 T E S T S
-------------------------------------------------------
There are no tests to run.

Results :

Tests run: 0, Failures: 0, Errors: 0, Skipped: 0

[JENKINS] Recording test results
[INFO] [jar:jar {execution: default-jar}]
[INFO] Building jar: <https://builds.apache.org/hudson/job/CXF-Trunk-JDK15/ws/trunk/common/xerces-xsd-validation/target/cxf-xerces-xsd-validation-2.4.1-SNAPSHOT.jar>
[INFO] [install:install {execution: default-install}]
[INFO] Installing <https://builds.apache.org/hudson/job/CXF-Trunk-JDK15/ws/trunk/common/xerces-xsd-validation/target/cxf-xerces-xsd-validation-2.4.1-SNAPSHOT.jar>
to <https://builds.apache.org/hudson/job/CXF-Trunk-JDK15/ws/.repository/org/apache/cxf/cxf-xerces-xsd-validation/2.4.1-SNAPSHOT/cxf-xerces-xsd-validation-2.4.1-SNAPSHOT.jar>
[JENKINS] Archiving <https://builds.apache.org/hudson/job/CXF-Trunk-JDK15/ws/trunk/common/xerces-xsd-validation/pom.xml>
to /home/hudson/hudson/jobs/CXF-Trunk-JDK15/modules/org.apache.cxf$cxf-xerces-xsd-validation/builds/2011-05-26_19-07-37/archive/org.apache.cxf/cxf-xerces-xsd-validation/2.4.1-SNAPSHOT/cxf-xerces-xsd-validation-2.4.1-SNAPSHOT.pom
[JENKINS] Archiving <https://builds.apache.org/hudson/job/CXF-Trunk-JDK15/ws/trunk/common/xerces-xsd-validation/target/cxf-xerces-xsd-validation-2.4.1-SNAPSHOT.jar>
to /home/hudson/hudson/jobs/CXF-Trunk-JDK15/modules/org.apache.cxf$cxf-xerces-xsd-validation/builds/2011-05-26_19-07-37/archive/org.apache.cxf/cxf-xerces-xsd-validation/2.4.1-SNAPSHOT/cxf-xerces-xsd-validation-2.4.1-SNAPSHOT.jar
[INFO] ------------------------------------------------------------------------
[INFO] Building Apache CXF Common
[INFO]    task-segment: [clean, install]
[INFO] ------------------------------------------------------------------------
[INFO] [clean:clean {execution: default-clean}]
[INFO] [site:attach-descriptor {execution: default-attach-descriptor}]
[INFO] [install:install {execution: default-install}]
[INFO] Installing <https://builds.apache.org/hudson/job/CXF-Trunk-JDK15/ws/trunk/common/pom.xml>
to <https://builds.apache.org/hudson/job/CXF-Trunk-JDK15/ws/.repository/org/apache/cxf/cxf-common/2.4.1-SNAPSHOT/cxf-common-2.4.1-SNAPSHOT.pom>
[JENKINS] Archiving <https://builds.apache.org/hudson/job/CXF-Trunk-JDK15/ws/trunk/common/pom.xml>
to /home/hudson/hudson/jobs/CXF-Trunk-JDK15/modules/org.apache.cxf$cxf-common/builds/2011-05-26_19-07-37/archive/org.apache.cxf/cxf-common/2.4.1-SNAPSHOT/cxf-common-2.4.1-SNAPSHOT.pom
[INFO] ------------------------------------------------------------------------
[INFO] Building Apache CXF Runtime Core
[INFO]    task-segment: [clean, install]
[INFO] ------------------------------------------------------------------------
[INFO] [clean:clean {execution: default-clean}]
[INFO] Deleting <https://builds.apache.org/hudson/job/CXF-Trunk-JDK15/ws/trunk/rt/core/target>
[INFO] [cxf-xml2fastinfoset:xml2fastinfoset {execution: xml2fastinfoset}]
[INFO] [remote-resources:process {execution: default}]
[INFO] [resources:resources {execution: default-resources}]
[INFO] Using 'UTF-8' encoding to copy filtered resources.
[INFO] Copying 16 resources
[INFO] Copying 10 resources
[INFO] skip non existing resourceDirectory <https://builds.apache.org/hudson/job/CXF-Trunk-JDK15/ws/trunk/rt/core/src/main/resources-filtered>
[INFO] Copying 1 resource
[INFO] Copying 3 resources
[INFO] [compiler:compile {execution: default-compile}]
[INFO] Compiling 202 source files to <https://builds.apache.org/hudson/job/CXF-Trunk-JDK15/ws/trunk/rt/core/target/classes>
[INFO] -------------------------------------------------------------
[ERROR] COMPILATION ERROR : 
[INFO] -------------------------------------------------------------
[ERROR] <https://builds.apache.org/hudson/job/CXF-Trunk-JDK15/ws/trunk/rt/core/src/main/java/org/apache/cxf/wsdl11/WSDLServiceBuilder.java>:[57,54]
package com.sun.org.apache.xml.internal.security.utils does not exist
[ERROR] <https://builds.apache.org/hudson/job/CXF-Trunk-JDK15/ws/trunk/rt/core/src/main/java/org/apache/cxf/wsdl11/WSDLServiceBuilder.java>:[149,25]
cannot find symbol
symbol  : variable XMLUtils
location: class org.apache.cxf.wsdl11.WSDLServiceBuilder
[INFO] 2 errors 
[INFO] -------------------------------------------------------------
[JENKINS] Archiving <https://builds.apache.org/hudson/job/CXF-Trunk-JDK15/ws/trunk/rt/core/pom.xml>
to /home/hudson/hudson/jobs/CXF-Trunk-JDK15/modules/org.apache.cxf$cxf-rt-core/builds/2011-05-26_19-07-37/archive/org.apache.cxf/cxf-rt-core/2.4.1-SNAPSHOT/cxf-rt-core-2.4.1-SNAPSHOT.pom
[INFO] ------------------------------------------------------------------------
[ERROR] BUILD FAILURE
[INFO] ------------------------------------------------------------------------
[INFO] Compilation failure

<https://builds.apache.org/hudson/job/CXF-Trunk-JDK15/ws/trunk/rt/core/src/main/java/org/apache/cxf/wsdl11/WSDLServiceBuilder.java>:[57,54]
package com.sun.org.apache.xml.internal.security.utils does not exist
<https://builds.apache.org/hudson/job/CXF-Trunk-JDK15/ws/trunk/rt/core/src/main/java/org/apache/cxf/wsdl11/WSDLServiceBuilder.java>:[149,25]
cannot find symbol
symbol  : variable XMLUtils
location: class org.apache.cxf.wsdl11.WSDLServiceBuilder

[INFO] ------------------------------------------------------------------------
[INFO] Trace
org.apache.maven.BuildFailureException: Compilation failure
	at org.apache.maven.lifecycle.DefaultLifecycleExecutor.executeGoals(DefaultLifecycleExecutor.java:715)
	at org.apache.maven.lifecycle.DefaultLifecycleExecutor.executeGoalWithLifecycle(DefaultLifecycleExecutor.java:556)
	at org.apache.maven.lifecycle.DefaultLifecycleExecutor.executeGoal(DefaultLifecycleExecutor.java:535)
	at org.apache.maven.lifecycle.DefaultLifecycleExecutor.executeGoalAndHandleFailures(DefaultLifecycleExecutor.java:387)
	at org.apache.maven.lifecycle.DefaultLifecycleExecutor.executeTaskSegments(DefaultLifecycleExecutor.java:348)
	at org.apache.maven.lifecycle.DefaultLifecycleExecutor.execute(DefaultLifecycleExecutor.java:180)
	at org.apache.maven.lifecycle.LifecycleExecutorInterceptor.execute(LifecycleExecutorInterceptor.java:65)
	at org.apache.maven.DefaultMaven.doExecute(DefaultMaven.java:328)
	at org.apache.maven.DefaultMaven.execute(DefaultMaven.java:138)
	at org.apache.maven.cli.MavenCli.main(MavenCli.java:362)
	at sun.reflect.NativeMethodAccessorImpl.invoke0(Native Method)
	at sun.reflect.NativeMethodAccessorImpl.invoke(NativeMethodAccessorImpl.java:39)
	at sun.reflect.DelegatingMethodAccessorImpl.invoke(DelegatingMethodAccessorImpl.java:25)
	at java.lang.reflect.Method.invoke(Method.java:592)
	at org.codehaus.classworlds.Launcher.launchEnhanced(Launcher.java:315)
	at org.codehaus.classworlds.Launcher.launch(Launcher.java:255)
	at hudson.maven.agent.Main.launch(Main.java:185)
	at hudson.maven.MavenBuilder.call(MavenBuilder.java:164)
	at hudson.maven.MavenModuleSetBuild$Builder.call(MavenModuleSetBuild.java:987)
	at hudson.maven.MavenModuleSetBuild$Builder.call(MavenModuleSetBuild.java:918)
	at hudson.remoting.UserRequest.perform(UserRequest.java:118)
	at hudson.remoting.UserRequest.perform(UserRequest.java:48)
	at hudson.remoting.Request$2.run(Request.java:270)
	at java.util.concurrent.Executors$RunnableAdapter.call(Executors.java:417)
	at java.util.concurrent.FutureTask$Sync.innerRun(FutureTask.java:269)
	at java.util.concurrent.FutureTask.run(FutureTask.java:123)
	at java.util.concurrent.ThreadPoolExecutor$Worker.runTask(ThreadPoolExecutor.java:651)
	at java.util.concurrent.ThreadPoolExecutor$Worker.run(ThreadPoolExecutor.java:676)
	at java.lang.Thread.run(Thread.java:595)
Caused by: org.apache.maven.plugin.CompilationFailureException: Compilation failure
	at org.apache.maven.plugin.AbstractCompilerMojo.execute(AbstractCompilerMojo.java:656)
	at org.apache.maven.plugin.CompilerMojo.execute(CompilerMojo.java:128)
	at org.apache.maven.plugin.DefaultPluginManager.executeMojo(DefaultPluginManager.java:490)
	at hudson.maven.agent.PluginManagerInterceptor.executeMojo(PluginManagerInterceptor.java:182)
	at org.apache.maven.lifecycle.DefaultLifecycleExecutor.executeGoals(DefaultLifecycleExecutor.java:694)
	... 28 more
[INFO] ------------------------------------------------------------------------
[INFO] Total time: 1 minute 8 seconds
[INFO] Finished at: Thu May 26 11:09:16 GMT-08:00 2011
[INFO] Final Memory: 52M/98M
[INFO] ------------------------------------------------------------------------
Sending e-mails to: notifications@cxf.apache.org dkulp_apache@dankulp.com
channel stopped
[locks-and-latches] Releasing all the locks
[locks-and-latches] All the locks released


Mime
View raw message