cxf-notifications mailing list archives

Site index · List index
Message view « Date » · « Thread »
Top « Date » · « Thread »
From Apache Jenkins Server <jenk...@builds.apache.org>
Subject Build failed in Jenkins: CXF-Trunk-JDK15 #2140
Date Wed, 08 Jun 2011 09:01:14 GMT
See <https://builds.apache.org/job/CXF-Trunk-JDK15/2140/changes>

Changes:

[ay] [CXF-3577] add dispatch source support for coloc

[cschneider] CXF-3576 Patch applied with thanks to Oliver Wulff

------------------------------------------
[...truncated 2844 lines...]
[INFO] ------------------------------------------------------------------------
[INFO] [clean:clean {execution: default-clean}]
[INFO] Deleting <https://builds.apache.org/job/CXF-Trunk-JDK15/ws/trunk/rt/databinding/jibx/target>
[INFO] [cxf-xml2fastinfoset:xml2fastinfoset {execution: xml2fastinfoset}]
[INFO] [remote-resources:process {execution: default}]
[INFO] artifact org.eclipse.core:resources: checking for updates from central
[INFO] artifact org.eclipse.core:expressions: checking for updates from central
[INFO] artifact org.eclipse.core:runtime: checking for updates from central
[INFO] artifact org.eclipse:osgi: checking for updates from central
[INFO] artifact org.eclipse.core:jobs: checking for updates from central
[INFO] artifact org.eclipse.equinox:registry: checking for updates from central
[INFO] artifact org.eclipse.equinox:preferences: checking for updates from central
[INFO] artifact org.eclipse.core:contenttype: checking for updates from central
[INFO] artifact org.eclipse.core:filesystem: checking for updates from central
[INFO] artifact org.eclipse:text: checking for updates from central
[INFO] artifact org.eclipse.core:commands: checking for updates from central
[INFO] [resources:resources {execution: default-resources}]
[INFO] Using 'UTF-8' encoding to copy filtered resources.
[INFO] Copying 0 resource
[INFO] Copying 1 resource
[INFO] skip non existing resourceDirectory <https://builds.apache.org/job/CXF-Trunk-JDK15/ws/trunk/rt/databinding/jibx/src/main/resources-filtered>
[INFO] skip non existing resourceDirectory <https://builds.apache.org/job/CXF-Trunk-JDK15/ws/trunk/rt/databinding/jibx/target/generated/src/main/resources>
[INFO] Copying 3 resources
[INFO] [compiler:compile {execution: default-compile}]
[INFO] Compiling 12 source files to <https://builds.apache.org/job/CXF-Trunk-JDK15/ws/trunk/rt/databinding/jibx/target/classes>
[INFO] [resources:testResources {execution: default-testResources}]
[INFO] Using 'UTF-8' encoding to copy filtered resources.
[INFO] Copying 8 resources
[INFO] Copying 8 resources
[INFO] skip non existing resourceDirectory <https://builds.apache.org/job/CXF-Trunk-JDK15/ws/trunk/rt/databinding/jibx/target/generated/src/test/resources>
[INFO] Copying 3 resources
[INFO] [compiler:testCompile {execution: default-testCompile}]
[INFO] Compiling 3 source files to <https://builds.apache.org/job/CXF-Trunk-JDK15/ws/trunk/rt/databinding/jibx/target/test-classes>
[INFO] [surefire:test {execution: default-test}]
[INFO] Surefire report directory: <https://builds.apache.org/job/CXF-Trunk-JDK15/ws/trunk/rt/databinding/jibx/target/surefire-reports>

-------------------------------------------------------
 T E S T S
-------------------------------------------------------
Running org.apache.cxf.jibx.PrimitiveTypesTest
Tests run: 6, Failures: 0, Errors: 0, Skipped: 0, Time elapsed: 1.183 sec

Results :

Tests run: 6, Failures: 0, Errors: 0, Skipped: 0

[JENKINS] Recording test results
[INFO] [jar:jar {execution: default-jar}]
[INFO] Building jar: <https://builds.apache.org/job/CXF-Trunk-JDK15/ws/trunk/rt/databinding/jibx/target/cxf-rt-databinding-jibx-2.4.1-SNAPSHOT.jar>
[INFO] [install:install {execution: default-install}]
[INFO] Installing <https://builds.apache.org/job/CXF-Trunk-JDK15/ws/trunk/rt/databinding/jibx/target/cxf-rt-databinding-jibx-2.4.1-SNAPSHOT.jar>
to <https://builds.apache.org/job/CXF-Trunk-JDK15/ws/.repository/org/apache/cxf/cxf-rt-databinding-jibx/2.4.1-SNAPSHOT/cxf-rt-databinding-jibx-2.4.1-SNAPSHOT.jar>
[JENKINS] Archiving <https://builds.apache.org/job/CXF-Trunk-JDK15/ws/trunk/rt/databinding/jibx/pom.xml>
to /home/hudson/hudson/jobs/CXF-Trunk-JDK15/modules/org.apache.cxf$cxf-rt-databinding-jibx/builds/2011-06-08_08-47-41/archive/org.apache.cxf/cxf-rt-databinding-jibx/2.4.1-SNAPSHOT/cxf-rt-databinding-jibx-2.4.1-SNAPSHOT.pom
[JENKINS] Archiving <https://builds.apache.org/job/CXF-Trunk-JDK15/ws/trunk/rt/databinding/jibx/target/cxf-rt-databinding-jibx-2.4.1-SNAPSHOT.jar>
to /home/hudson/hudson/jobs/CXF-Trunk-JDK15/modules/org.apache.cxf$cxf-rt-databinding-jibx/builds/2011-06-08_08-47-41/archive/org.apache.cxf/cxf-rt-databinding-jibx/2.4.1-SNAPSHOT/cxf-rt-databinding-jibx-2.4.1-SNAPSHOT.jar
[INFO] ------------------------------------------------------------------------
[INFO] Building Apache CXF Runtime HTTP Binding
[INFO]    task-segment: [clean, install]
[INFO] ------------------------------------------------------------------------
[INFO] [clean:clean {execution: default-clean}]
[INFO] Deleting <https://builds.apache.org/job/CXF-Trunk-JDK15/ws/trunk/rt/bindings/http/target>
[INFO] [cxf-xml2fastinfoset:xml2fastinfoset {execution: xml2fastinfoset}]
[INFO] [remote-resources:process {execution: default}]
[INFO] [resources:resources {execution: default-resources}]
[INFO] Using 'UTF-8' encoding to copy filtered resources.
[INFO] Copying 2 resources
[INFO] Copying 2 resources
[INFO] skip non existing resourceDirectory <https://builds.apache.org/job/CXF-Trunk-JDK15/ws/trunk/rt/bindings/http/src/main/resources-filtered>
[INFO] Copying 1 resource
[INFO] Copying 3 resources
[INFO] [compiler:compile {execution: default-compile}]
[INFO] Compiling 16 source files to <https://builds.apache.org/job/CXF-Trunk-JDK15/ws/trunk/rt/bindings/http/target/classes>
[INFO] [cxf-xjc:xsdtojava-tests {execution: generate-sources}]
[INFO] [resources:testResources {execution: default-testResources}]
[INFO] Using 'UTF-8' encoding to copy filtered resources.
[INFO] Copying 7 resources
[INFO] Copying 1 resource
[INFO] skip non existing resourceDirectory <https://builds.apache.org/job/CXF-Trunk-JDK15/ws/trunk/rt/bindings/http/target/generated/src/test/resources>
[INFO] Copying 3 resources
[INFO] [compiler:testCompile {execution: default-testCompile}]
[INFO] Compiling 19 source files to <https://builds.apache.org/job/CXF-Trunk-JDK15/ws/trunk/rt/bindings/http/target/test-classes>
[INFO] [surefire:test {execution: default-test}]
[INFO] Surefire report directory: <https://builds.apache.org/job/CXF-Trunk-JDK15/ws/trunk/rt/bindings/http/target/surefire-reports>

-------------------------------------------------------
 T E S T S
-------------------------------------------------------
Running org.apache.cxf.binding.http.InflectorTest
Tests run: 2, Failures: 0, Errors: 0, Skipped: 0, Time elapsed: 0.047 sec
Running org.apache.cxf.binding.http.IriDecoderTest
Tests run: 1, Failures: 0, Errors: 0, Skipped: 0, Time elapsed: 0.009 sec
Running org.apache.cxf.binding.http.bare.BareServiceTest
Tests run: 4, Failures: 0, Errors: 0, Skipped: 0, Time elapsed: 1.878 sec
Running org.apache.cxf.binding.http.bare.ClientTest
Tests run: 1, Failures: 0, Errors: 0, Skipped: 0, Time elapsed: 0.261 sec
Running org.apache.cxf.binding.http.bare.UserServiceTest
Tests run: 1, Failures: 0, Errors: 0, Skipped: 0, Time elapsed: 0.127 sec
Running org.apache.cxf.binding.http.mtom.MtomTest
Tests run: 1, Failures: 0, Errors: 0, Skipped: 0, Time elapsed: 0.163 sec
Running org.apache.cxf.binding.http.wrapped.WrappedServiceTest
Tests run: 2, Failures: 0, Errors: 0, Skipped: 0, Time elapsed: 0.322 sec

Results :

Tests run: 12, Failures: 0, Errors: 0, Skipped: 0

[JENKINS] Recording test results
[INFO] [jar:jar {execution: default-jar}]
[INFO] Building jar: <https://builds.apache.org/job/CXF-Trunk-JDK15/ws/trunk/rt/bindings/http/target/cxf-rt-bindings-http-2.4.1-SNAPSHOT.jar>
[INFO] [install:install {execution: default-install}]
[INFO] Installing <https://builds.apache.org/job/CXF-Trunk-JDK15/ws/trunk/rt/bindings/http/target/cxf-rt-bindings-http-2.4.1-SNAPSHOT.jar>
to <https://builds.apache.org/job/CXF-Trunk-JDK15/ws/.repository/org/apache/cxf/cxf-rt-bindings-http/2.4.1-SNAPSHOT/cxf-rt-bindings-http-2.4.1-SNAPSHOT.jar>
[JENKINS] Archiving <https://builds.apache.org/job/CXF-Trunk-JDK15/ws/trunk/rt/bindings/http/pom.xml>
to /home/hudson/hudson/jobs/CXF-Trunk-JDK15/modules/org.apache.cxf$cxf-rt-bindings-http/builds/2011-06-08_08-47-41/archive/org.apache.cxf/cxf-rt-bindings-http/2.4.1-SNAPSHOT/cxf-rt-bindings-http-2.4.1-SNAPSHOT.pom
[JENKINS] Archiving <https://builds.apache.org/job/CXF-Trunk-JDK15/ws/trunk/rt/bindings/http/target/cxf-rt-bindings-http-2.4.1-SNAPSHOT.jar>
to /home/hudson/hudson/jobs/CXF-Trunk-JDK15/modules/org.apache.cxf$cxf-rt-bindings-http/builds/2011-06-08_08-47-41/archive/org.apache.cxf/cxf-rt-bindings-http/2.4.1-SNAPSHOT/cxf-rt-bindings-http-2.4.1-SNAPSHOT.jar
[INFO] ------------------------------------------------------------------------
[INFO] Building Apache CXF Runtime Object Binding
[INFO]    task-segment: [clean, install]
[INFO] ------------------------------------------------------------------------
[INFO] [clean:clean {execution: default-clean}]
[INFO] Deleting <https://builds.apache.org/job/CXF-Trunk-JDK15/ws/trunk/rt/bindings/object/target>
[INFO] [cxf-xml2fastinfoset:xml2fastinfoset {execution: xml2fastinfoset}]
[INFO] [remote-resources:process {execution: default}]
[INFO] [resources:resources {execution: default-resources}]
[INFO] Using 'UTF-8' encoding to copy filtered resources.
[INFO] Copying 1 resource
[INFO] Copying 7 resources
[INFO] skip non existing resourceDirectory <https://builds.apache.org/job/CXF-Trunk-JDK15/ws/trunk/rt/bindings/object/src/main/resources-filtered>
[INFO] Copying 1 resource
[INFO] Copying 3 resources
[INFO] [compiler:compile {execution: default-compile}]
[INFO] Compiling 8 source files to <https://builds.apache.org/job/CXF-Trunk-JDK15/ws/trunk/rt/bindings/object/target/classes>
[INFO] [resources:testResources {execution: default-testResources}]
[INFO] Using 'UTF-8' encoding to copy filtered resources.
[INFO] Copying 0 resource
[INFO] skip non existing resourceDirectory <https://builds.apache.org/job/CXF-Trunk-JDK15/ws/trunk/rt/bindings/object/src/test/resources>
[INFO] skip non existing resourceDirectory <https://builds.apache.org/job/CXF-Trunk-JDK15/ws/trunk/rt/bindings/object/target/generated/src/test/resources>
[INFO] Copying 3 resources
[INFO] [compiler:testCompile {execution: default-testCompile}]
[INFO] Compiling 4 source files to <https://builds.apache.org/job/CXF-Trunk-JDK15/ws/trunk/rt/bindings/object/target/test-classes>
[INFO] [surefire:test {execution: default-test}]
[INFO] Surefire report directory: <https://builds.apache.org/job/CXF-Trunk-JDK15/ws/trunk/rt/bindings/object/target/surefire-reports>

-------------------------------------------------------
 T E S T S
-------------------------------------------------------
Running org.apache.cxf.binding.object.LocalServerRegistrationTest
Tests run: 1, Failures: 0, Errors: 0, Skipped: 0, Time elapsed: 2.038 sec
Running org.apache.cxf.binding.object.ObjectBindingTest
Tests run: 3, Failures: 0, Errors: 0, Skipped: 0, Time elapsed: 1.048 sec

Results :

Tests run: 4, Failures: 0, Errors: 0, Skipped: 0

[JENKINS] Recording test results
[INFO] [jar:jar {execution: default-jar}]
[INFO] Building jar: <https://builds.apache.org/job/CXF-Trunk-JDK15/ws/trunk/rt/bindings/object/target/cxf-rt-bindings-object-2.4.1-SNAPSHOT.jar>
[INFO] [install:install {execution: default-install}]
[INFO] Installing <https://builds.apache.org/job/CXF-Trunk-JDK15/ws/trunk/rt/bindings/object/target/cxf-rt-bindings-object-2.4.1-SNAPSHOT.jar>
to <https://builds.apache.org/job/CXF-Trunk-JDK15/ws/.repository/org/apache/cxf/cxf-rt-bindings-object/2.4.1-SNAPSHOT/cxf-rt-bindings-object-2.4.1-SNAPSHOT.jar>
[JENKINS] Archiving <https://builds.apache.org/job/CXF-Trunk-JDK15/ws/trunk/rt/bindings/object/pom.xml>
to /home/hudson/hudson/jobs/CXF-Trunk-JDK15/modules/org.apache.cxf$cxf-rt-bindings-object/builds/2011-06-08_08-47-41/archive/org.apache.cxf/cxf-rt-bindings-object/2.4.1-SNAPSHOT/cxf-rt-bindings-object-2.4.1-SNAPSHOT.pom
[JENKINS] Archiving <https://builds.apache.org/job/CXF-Trunk-JDK15/ws/trunk/rt/bindings/object/target/cxf-rt-bindings-object-2.4.1-SNAPSHOT.jar>
to /home/hudson/hudson/jobs/CXF-Trunk-JDK15/modules/org.apache.cxf$cxf-rt-bindings-object/builds/2011-06-08_08-47-41/archive/org.apache.cxf/cxf-rt-bindings-object/2.4.1-SNAPSHOT/cxf-rt-bindings-object-2.4.1-SNAPSHOT.jar
[INFO] ------------------------------------------------------------------------
[INFO] Building Apache CXF Runtime Colocated Binding
[INFO]    task-segment: [clean, install]
[INFO] ------------------------------------------------------------------------
[INFO] [clean:clean {execution: default-clean}]
[INFO] Deleting <https://builds.apache.org/job/CXF-Trunk-JDK15/ws/trunk/rt/bindings/coloc/target>
[INFO] [cxf-xml2fastinfoset:xml2fastinfoset {execution: xml2fastinfoset}]
[INFO] [remote-resources:process {execution: default}]
[INFO] [resources:resources {execution: default-resources}]
[INFO] Using 'UTF-8' encoding to copy filtered resources.
[INFO] Copying 1 resource
[INFO] Copying 4 resources
[INFO] skip non existing resourceDirectory <https://builds.apache.org/job/CXF-Trunk-JDK15/ws/trunk/rt/bindings/coloc/src/main/resources-filtered>
[INFO] skip non existing resourceDirectory <https://builds.apache.org/job/CXF-Trunk-JDK15/ws/trunk/rt/bindings/coloc/target/generated/src/main/resources>
[INFO] Copying 3 resources
[INFO] [compiler:compile {execution: default-compile}]
[INFO] Compiling 11 source files to <https://builds.apache.org/job/CXF-Trunk-JDK15/ws/trunk/rt/bindings/coloc/target/classes>
[INFO] -------------------------------------------------------------
[ERROR] COMPILATION ERROR : 
[INFO] -------------------------------------------------------------
[ERROR] <https://builds.apache.org/job/CXF-Trunk-JDK15/ws/trunk/rt/bindings/coloc/src/main/java/org/apache/cxf/binding/coloc/ColocUtil.java>:[31,22]
package javax.xml.soap does not exist
[ERROR] <https://builds.apache.org/job/CXF-Trunk-JDK15/ws/trunk/rt/bindings/coloc/src/main/java/org/apache/cxf/binding/coloc/ColocUtil.java>:[185,49]
cannot find symbol
symbol  : class SOAPMessage
location: class org.apache.cxf.binding.coloc.ColocUtil
[ERROR] <https://builds.apache.org/job/CXF-Trunk-JDK15/ws/trunk/rt/bindings/coloc/src/main/java/org/apache/cxf/binding/coloc/ColocUtil.java>:[186,49]
cannot find symbol
symbol  : class SOAPMessage
location: class org.apache.cxf.binding.coloc.ColocUtil
[INFO] 3 errors 
[INFO] -------------------------------------------------------------
[JENKINS] Archiving <https://builds.apache.org/job/CXF-Trunk-JDK15/ws/trunk/rt/bindings/coloc/pom.xml>
to /home/hudson/hudson/jobs/CXF-Trunk-JDK15/modules/org.apache.cxf$cxf-rt-bindings-coloc/builds/2011-06-08_08-47-41/archive/org.apache.cxf/cxf-rt-bindings-coloc/2.4.1-SNAPSHOT/cxf-rt-bindings-coloc-2.4.1-SNAPSHOT.pom
[INFO] ------------------------------------------------------------------------
[ERROR] BUILD FAILURE
[INFO] ------------------------------------------------------------------------
[INFO] Compilation failure

<https://builds.apache.org/job/CXF-Trunk-JDK15/ws/trunk/rt/bindings/coloc/src/main/java/org/apache/cxf/binding/coloc/ColocUtil.java>:[31,22]
package javax.xml.soap does not exist
<https://builds.apache.org/job/CXF-Trunk-JDK15/ws/trunk/rt/bindings/coloc/src/main/java/org/apache/cxf/binding/coloc/ColocUtil.java>:[185,49]
cannot find symbol
symbol  : class SOAPMessage
location: class org.apache.cxf.binding.coloc.ColocUtil
<https://builds.apache.org/job/CXF-Trunk-JDK15/ws/trunk/rt/bindings/coloc/src/main/java/org/apache/cxf/binding/coloc/ColocUtil.java>:[186,49]
cannot find symbol
symbol  : class SOAPMessage
location: class org.apache.cxf.binding.coloc.ColocUtil

[INFO] ------------------------------------------------------------------------
[INFO] Trace
org.apache.maven.BuildFailureException: Compilation failure
	at org.apache.maven.lifecycle.DefaultLifecycleExecutor.executeGoals(DefaultLifecycleExecutor.java:715)
	at org.apache.maven.lifecycle.DefaultLifecycleExecutor.executeGoalWithLifecycle(DefaultLifecycleExecutor.java:556)
	at org.apache.maven.lifecycle.DefaultLifecycleExecutor.executeGoal(DefaultLifecycleExecutor.java:535)
	at org.apache.maven.lifecycle.DefaultLifecycleExecutor.executeGoalAndHandleFailures(DefaultLifecycleExecutor.java:387)
	at org.apache.maven.lifecycle.DefaultLifecycleExecutor.executeTaskSegments(DefaultLifecycleExecutor.java:348)
	at org.apache.maven.lifecycle.DefaultLifecycleExecutor.execute(DefaultLifecycleExecutor.java:180)
	at org.apache.maven.lifecycle.LifecycleExecutorInterceptor.execute(LifecycleExecutorInterceptor.java:65)
	at org.apache.maven.DefaultMaven.doExecute(DefaultMaven.java:328)
	at org.apache.maven.DefaultMaven.execute(DefaultMaven.java:138)
	at org.apache.maven.cli.MavenCli.main(MavenCli.java:362)
	at sun.reflect.NativeMethodAccessorImpl.invoke0(Native Method)
	at sun.reflect.NativeMethodAccessorImpl.invoke(NativeMethodAccessorImpl.java:39)
	at sun.reflect.DelegatingMethodAccessorImpl.invoke(DelegatingMethodAccessorImpl.java:25)
	at java.lang.reflect.Method.invoke(Method.java:592)
	at org.codehaus.classworlds.Launcher.launchEnhanced(Launcher.java:315)
	at org.codehaus.classworlds.Launcher.launch(Launcher.java:255)
	at hudson.maven.agent.Main.launch(Main.java:185)
	at hudson.maven.MavenBuilder.call(MavenBuilder.java:164)
	at hudson.maven.MavenModuleSetBuild$Builder.call(MavenModuleSetBuild.java:987)
	at hudson.maven.MavenModuleSetBuild$Builder.call(MavenModuleSetBuild.java:918)
	at hudson.remoting.UserRequest.perform(UserRequest.java:118)
	at hudson.remoting.UserRequest.perform(UserRequest.java:48)
	at hudson.remoting.Request$2.run(Request.java:270)
	at java.util.concurrent.Executors$RunnableAdapter.call(Executors.java:417)
	at java.util.concurrent.FutureTask$Sync.innerRun(FutureTask.java:269)
	at java.util.concurrent.FutureTask.run(FutureTask.java:123)
	at java.util.concurrent.ThreadPoolExecutor$Worker.runTask(ThreadPoolExecutor.java:651)
	at java.util.concurrent.ThreadPoolExecutor$Worker.run(ThreadPoolExecutor.java:676)
	at java.lang.Thread.run(Thread.java:595)
Caused by: org.apache.maven.plugin.CompilationFailureException: Compilation failure
	at org.apache.maven.plugin.AbstractCompilerMojo.execute(AbstractCompilerMojo.java:656)
	at org.apache.maven.plugin.CompilerMojo.execute(CompilerMojo.java:128)
	at org.apache.maven.plugin.DefaultPluginManager.executeMojo(DefaultPluginManager.java:490)
	at hudson.maven.agent.PluginManagerInterceptor.executeMojo(PluginManagerInterceptor.java:182)
	at org.apache.maven.lifecycle.DefaultLifecycleExecutor.executeGoals(DefaultLifecycleExecutor.java:694)
	... 28 more
[INFO] ------------------------------------------------------------------------
[INFO] Total time: 10 minutes 45 seconds
[INFO] Finished at: Wed Jun 08 08:59:05 UTC 2011
[INFO] Final Memory: 97M/145M
[INFO] ------------------------------------------------------------------------
Sending e-mails to: notifications@cxf.apache.org elakito@gmail.com
channel stopped
[locks-and-latches] Releasing all the locks
[locks-and-latches] All the locks released


Mime
View raw message