cxf-notifications mailing list archives

Site index · List index
Message view « Date » · « Thread »
Top « Date » · « Thread »
From Apache Jenkins Server <jenk...@builds.apache.org>
Subject Build failed in Jenkins: CXF-trunk-deploy #750
Date Fri, 06 Jan 2012 06:30:13 GMT
See <https://builds.apache.org/job/CXF-trunk-deploy/750/changes>

Changes:

[dkulp] Fix rawType warnings up to rt-core

[dkulp] Fix a bunch more eclipse warnings
Update eclipse setup to not need two of the warnings turned off anymore

[dkulp] [CXF-3989] Recorded scopes are "mapped" keys, make sure we map the key
when setting and getting the scope

[dkulp] Update common-utilities and codegen plugin (and some users of it) to fix usage of
raw types, change to new style for loops, etc...

[dkulp] Update version number to 2.6.0-SNAPSHOT

[ay] [CXF-4013] Enhancing the element-append and drop options of OutTransformWriter

[coheigea] [CXF-4012] - Fix for failing STS test

[coheigea] [CXF-4012] - The AlgorithmSuite class does not use the WS-SP standard maximum symmetric
key size

[coheigea] [CXF-4011] - The STS SAML DefaultSubjectProvider does not set the encryption algorithm
when building an EncryptedKey

[coheigea] [CXF-4010] - Add ability to specific EncryptionProperties per STS instance

[ema] [CXF-3981]:Does not store wsa header when wsrm is enabled to fix the SequenceTest

------------------------------------------
[...truncated 19007 lines...]
[INFO] org/apache/cxf already added, skipping
[INFO] org/apache/cxf/js already added, skipping
[INFO] org/apache/cxf/js/rhino already added, skipping
[INFO] META-INF already added, skipping
[INFO] META-INF/LICENSE already added, skipping
[INFO] META-INF/NOTICE already added, skipping
[INFO] META-INF/DEPENDENCIES already added, skipping
[INFO] [javadoc:jar {execution: attach-javadocs}]
[INFO] Building jar: <https://builds.apache.org/job/CXF-trunk-deploy/ws/trunk/rt/frontend/js/target/cxf-rt-frontend-js-2.6.0-SNAPSHOT-javadoc.jar>
[INFO] [install:install {execution: default-install}]
[INFO] Installing <https://builds.apache.org/job/CXF-trunk-deploy/ws/trunk/rt/frontend/js/target/cxf-rt-frontend-js-2.6.0-SNAPSHOT.jar>
to <https://builds.apache.org/job/CXF-trunk-deploy/ws/.repository/org/apache/cxf/cxf-rt-frontend-js/2.6.0-SNAPSHOT/cxf-rt-frontend-js-2.6.0-SNAPSHOT.jar>
[INFO] Installing <https://builds.apache.org/job/CXF-trunk-deploy/ws/trunk/rt/frontend/js/target/cxf-rt-frontend-js-2.6.0-SNAPSHOT-sources.jar>
to <https://builds.apache.org/job/CXF-trunk-deploy/ws/.repository/org/apache/cxf/cxf-rt-frontend-js/2.6.0-SNAPSHOT/cxf-rt-frontend-js-2.6.0-SNAPSHOT-sources.jar>
[INFO] Installing <https://builds.apache.org/job/CXF-trunk-deploy/ws/trunk/rt/frontend/js/target/cxf-rt-frontend-js-2.6.0-SNAPSHOT-javadoc.jar>
to <https://builds.apache.org/job/CXF-trunk-deploy/ws/.repository/org/apache/cxf/cxf-rt-frontend-js/2.6.0-SNAPSHOT/cxf-rt-frontend-js-2.6.0-SNAPSHOT-javadoc.jar>
[INFO] [deploy:deploy {execution: default-deploy}]
[INFO] Retrieving previous build number from apache.snapshots.https
[INFO] repository metadata for: 'snapshot org.apache.cxf:cxf-rt-frontend-js:2.6.0-SNAPSHOT'
could not be found on repository: apache.snapshots.https, so will be created
Uploading: https://repository.apache.org/content/repositories/snapshots/org/apache/cxf/cxf-rt-frontend-js/2.6.0-SNAPSHOT/cxf-rt-frontend-js-2.6.0-20120106.061133-1.jar
21K uploaded  (cxf-rt-frontend-js-2.6.0-20120106.061133-1.jar)
[INFO] Uploading project information for cxf-rt-frontend-js 2.6.0-20120106.061133-1
[INFO] Retrieving previous metadata from apache.snapshots.https
[INFO] repository metadata for: 'snapshot org.apache.cxf:cxf-rt-frontend-js:2.6.0-SNAPSHOT'
could not be found on repository: apache.snapshots.https, so will be created
[INFO] Uploading repository metadata for: 'snapshot org.apache.cxf:cxf-rt-frontend-js:2.6.0-SNAPSHOT'
[INFO] Retrieving previous metadata from apache.snapshots.https
[INFO] Uploading repository metadata for: 'artifact org.apache.cxf:cxf-rt-frontend-js'
[INFO] Retrieving previous build number from apache.snapshots.https
Uploading: https://repository.apache.org/content/repositories/snapshots/org/apache/cxf/cxf-rt-frontend-js/2.6.0-SNAPSHOT/cxf-rt-frontend-js-2.6.0-20120106.061133-1-sources.jar
15K uploaded  (cxf-rt-frontend-js-2.6.0-20120106.061133-1-sources.jar)
[INFO] Retrieving previous build number from apache.snapshots.https
Uploading: https://repository.apache.org/content/repositories/snapshots/org/apache/cxf/cxf-rt-frontend-js/2.6.0-SNAPSHOT/cxf-rt-frontend-js-2.6.0-20120106.061133-1-javadoc.jar
56K uploaded  (cxf-rt-frontend-js-2.6.0-20120106.061133-1-javadoc.jar)
[JENKINS] Archiving <https://builds.apache.org/job/CXF-trunk-deploy/ws/trunk/rt/frontend/js/pom.xml>
to /home/hudson/hudson/jobs/CXF-trunk-deploy/modules/org.apache.cxf$cxf-rt-frontend-js/builds/2012-01-06_06-07-24/archive/org.apache.cxf/cxf-rt-frontend-js/2.6.0-SNAPSHOT/cxf-rt-frontend-js-2.6.0-SNAPSHOT.pom
[JENKINS] Archiving <https://builds.apache.org/job/CXF-trunk-deploy/ws/trunk/rt/frontend/js/target/cxf-rt-frontend-js-2.6.0-SNAPSHOT.jar>
to /home/hudson/hudson/jobs/CXF-trunk-deploy/modules/org.apache.cxf$cxf-rt-frontend-js/builds/2012-01-06_06-07-24/archive/org.apache.cxf/cxf-rt-frontend-js/2.6.0-20120106.061133-1/cxf-rt-frontend-js-2.6.0-20120106.061133-1.jar
[JENKINS] Archiving <https://builds.apache.org/job/CXF-trunk-deploy/ws/trunk/rt/frontend/js/target/cxf-rt-frontend-js-2.6.0-SNAPSHOT-sources.jar>
to /home/hudson/hudson/jobs/CXF-trunk-deploy/modules/org.apache.cxf$cxf-rt-frontend-js/builds/2012-01-06_06-07-24/archive/org.apache.cxf/cxf-rt-frontend-js/2.6.0-20120106.061133-1/cxf-rt-frontend-js-2.6.0-20120106.061133-1-sources.jar
[JENKINS] Archiving <https://builds.apache.org/job/CXF-trunk-deploy/ws/trunk/rt/frontend/js/target/cxf-rt-frontend-js-2.6.0-SNAPSHOT-javadoc.jar>
to /home/hudson/hudson/jobs/CXF-trunk-deploy/modules/org.apache.cxf$cxf-rt-frontend-js/builds/2012-01-06_06-07-24/archive/org.apache.cxf/cxf-rt-frontend-js/2.6.0-20120106.061133-1/cxf-rt-frontend-js-2.6.0-20120106.061133-1-javadoc.jar
[INFO] ------------------------------------------------------------------------
[INFO] Building Apache CXF Runtime WS Policy
[INFO]    task-segment: [clean, deploy]
[INFO] ------------------------------------------------------------------------
[INFO] [clean:clean {execution: default-clean}]
[INFO] [cxf-xml2fastinfoset:xml2fastinfoset {execution: xml2fastinfoset}]
[INFO] [cxf-xjc:xsdtojava {execution: generate-sources}]
[INFO] [remote-resources:process {execution: default}]
Downloading: http://repo1.maven.org/maven2/org/springframework/spring-test/3.0.6.RELEASE/spring-test-3.0.6.RELEASE.pom

Downloading: http://repo1.maven.org/maven2/org/springframework/spring-test/3.0.6.RELEASE/spring-test-3.0.6.RELEASE.jar

[debug] execute contextualize
[INFO] [resources:resources {execution: default-resources}]
[INFO] Using 'UTF-8' encoding to copy filtered resources.
[INFO] Copying 4 resources
[INFO] Copying 19 resources
[INFO] skip non existing resourceDirectory <https://builds.apache.org/job/CXF-trunk-deploy/ws/trunk/rt/ws/policy/src/main/resources-filtered>
[INFO] Copying 1 resource
[INFO] Copying 3 resources
[INFO] [compiler:compile {execution: default-compile}]
[INFO] Compiling 70 source files to <https://builds.apache.org/job/CXF-trunk-deploy/ws/trunk/rt/ws/policy/target/classes>
[INFO] [cxf-codegen:wsdl2java {execution: generate-test-sources}]
[INFO] Running code generation in fork mode...
[INFO] Building jar: /tmp/cxf-tmp-585304/cxf-codegen3711046348934522393.jar
[debug] execute contextualize
[INFO] [resources:testResources {execution: default-testResources}]
[INFO] Using 'UTF-8' encoding to copy filtered resources.
[INFO] Copying 22 resources
[INFO] Copying 90 resources
[INFO] skip non existing resourceDirectory <https://builds.apache.org/job/CXF-trunk-deploy/ws/trunk/rt/ws/policy/target/generated/src/test/resources>
[INFO] Copying 3 resources
[INFO] [compiler:testCompile {execution: default-testCompile}]
[INFO] Compiling 35 source files to <https://builds.apache.org/job/CXF-trunk-deploy/ws/trunk/rt/ws/policy/target/test-classes>
[INFO] [surefire:test {execution: default-test}]
[INFO] Tests are skipped.
[INFO] [jar:jar {execution: default-jar}]
[INFO] Building jar: <https://builds.apache.org/job/CXF-trunk-deploy/ws/trunk/rt/ws/policy/target/cxf-rt-ws-policy-2.6.0-SNAPSHOT.jar>
[INFO] [source:jar-no-fork {execution: attach-sources}]
[INFO] org already added, skipping
[INFO] org/apache already added, skipping
[INFO] org/apache/cxf already added, skipping
[INFO] org/apache/cxf/ws already added, skipping
[INFO] org/apache/cxf/ws/policy already added, skipping
[INFO] org already added, skipping
[INFO] org/apache already added, skipping
[INFO] org/apache/cxf already added, skipping
[INFO] org/apache/cxf/ws already added, skipping
[INFO] org/apache/cxf/ws/policy already added, skipping
[INFO] org/apache/cxf/ws/policy/spring already added, skipping
[INFO] org/apache/cxf/ws/policy/attachment already added, skipping
[INFO] org/apache/cxf/ws/policy/attachment/wsdl11 already added, skipping
[INFO] org/apache/cxf/ws/policy/attachment/external already added, skipping
[INFO] org/apache/cxf/ws/policy/attachment/reference already added, skipping
[INFO] org/apache/cxf/ws/policy/selector already added, skipping
[INFO] org/apache/cxf/ws/policy/mtom already added, skipping
[INFO] org/apache/cxf/ws/policy/blueprint already added, skipping
[INFO] org/apache/cxf/ws/policy/Messages.properties already added, skipping
[INFO] org/apache/cxf/ws/policy/spring/Messages.properties already added, skipping
[INFO] org/apache/cxf/ws/policy/attachment/Messages.properties already added, skipping
[INFO] org/apache/cxf/ws/policy/attachment/external/Messages.properties already added, skipping
[INFO] META-INF already added, skipping
[INFO] META-INF already added, skipping
[INFO] META-INF/cxf already added, skipping
[INFO] META-INF already added, skipping
[INFO] META-INF/LICENSE already added, skipping
[INFO] META-INF/NOTICE already added, skipping
[INFO] META-INF/DEPENDENCIES already added, skipping
[INFO] Building jar: <https://builds.apache.org/job/CXF-trunk-deploy/ws/trunk/rt/ws/policy/target/cxf-rt-ws-policy-2.6.0-SNAPSHOT-sources.jar>
[INFO] org already added, skipping
[INFO] org/apache already added, skipping
[INFO] org/apache/cxf already added, skipping
[INFO] org/apache/cxf/ws already added, skipping
[INFO] org/apache/cxf/ws/policy already added, skipping
[INFO] org already added, skipping
[INFO] org/apache already added, skipping
[INFO] org/apache/cxf already added, skipping
[INFO] org/apache/cxf/ws already added, skipping
[INFO] org/apache/cxf/ws/policy already added, skipping
[INFO] org/apache/cxf/ws/policy/spring already added, skipping
[INFO] org/apache/cxf/ws/policy/attachment already added, skipping
[INFO] org/apache/cxf/ws/policy/attachment/wsdl11 already added, skipping
[INFO] org/apache/cxf/ws/policy/attachment/external already added, skipping
[INFO] org/apache/cxf/ws/policy/attachment/reference already added, skipping
[INFO] org/apache/cxf/ws/policy/selector already added, skipping
[INFO] org/apache/cxf/ws/policy/mtom already added, skipping
[INFO] org/apache/cxf/ws/policy/blueprint already added, skipping
[INFO] org/apache/cxf/ws/policy/Messages.properties already added, skipping
[INFO] org/apache/cxf/ws/policy/spring/Messages.properties already added, skipping
[INFO] org/apache/cxf/ws/policy/attachment/Messages.properties already added, skipping
[INFO] org/apache/cxf/ws/policy/attachment/external/Messages.properties already added, skipping
[INFO] META-INF already added, skipping
[INFO] META-INF already added, skipping
[INFO] META-INF/cxf already added, skipping
[INFO] META-INF already added, skipping
[INFO] META-INF/LICENSE already added, skipping
[INFO] META-INF/NOTICE already added, skipping
[INFO] META-INF/DEPENDENCIES already added, skipping
[INFO] [javadoc:jar {execution: attach-javadocs}]
[INFO] 
2 warnings
[WARNING] Javadoc Warnings
[WARNING] <https://builds.apache.org/job/CXF-trunk-deploy/ws/trunk/rt/ws/policy/src/main/java/org/apache/cxf/ws/policy/PolicyEngineImpl.java>:580:
warning - @param argument "Assertor" is not a parameter name.
[WARNING] <https://builds.apache.org/job/CXF-trunk-deploy/ws/trunk/rt/ws/policy/src/main/java/org/apache/cxf/ws/policy/WSPolicyFeature.java>:58:
warning - Tag @see: reference not found: PolicyBuilder
[INFO] Building jar: <https://builds.apache.org/job/CXF-trunk-deploy/ws/trunk/rt/ws/policy/target/cxf-rt-ws-policy-2.6.0-SNAPSHOT-javadoc.jar>
[INFO] [install:install {execution: default-install}]
[INFO] Installing <https://builds.apache.org/job/CXF-trunk-deploy/ws/trunk/rt/ws/policy/target/cxf-rt-ws-policy-2.6.0-SNAPSHOT.jar>
to <https://builds.apache.org/job/CXF-trunk-deploy/ws/.repository/org/apache/cxf/cxf-rt-ws-policy/2.6.0-SNAPSHOT/cxf-rt-ws-policy-2.6.0-SNAPSHOT.jar>
[INFO] Installing <https://builds.apache.org/job/CXF-trunk-deploy/ws/trunk/rt/ws/policy/target/cxf-rt-ws-policy-2.6.0-SNAPSHOT-sources.jar>
to <https://builds.apache.org/job/CXF-trunk-deploy/ws/.repository/org/apache/cxf/cxf-rt-ws-policy/2.6.0-SNAPSHOT/cxf-rt-ws-policy-2.6.0-SNAPSHOT-sources.jar>
[INFO] Installing <https://builds.apache.org/job/CXF-trunk-deploy/ws/trunk/rt/ws/policy/target/cxf-rt-ws-policy-2.6.0-SNAPSHOT-javadoc.jar>
to <https://builds.apache.org/job/CXF-trunk-deploy/ws/.repository/org/apache/cxf/cxf-rt-ws-policy/2.6.0-SNAPSHOT/cxf-rt-ws-policy-2.6.0-SNAPSHOT-javadoc.jar>
[INFO] [deploy:deploy {execution: default-deploy}]
[INFO] Retrieving previous build number from apache.snapshots.https
[INFO] repository metadata for: 'snapshot org.apache.cxf:cxf-rt-ws-policy:2.6.0-SNAPSHOT'
could not be found on repository: apache.snapshots.https, so will be created
Uploading: https://repository.apache.org/content/repositories/snapshots/org/apache/cxf/cxf-rt-ws-policy/2.6.0-SNAPSHOT/cxf-rt-ws-policy-2.6.0-20120106.061133-1.jar
164K uploaded  (cxf-rt-ws-policy-2.6.0-20120106.061133-1.jar)
[INFO] Uploading project information for cxf-rt-ws-policy 2.6.0-20120106.061133-1
[INFO] Retrieving previous metadata from apache.snapshots.https
[INFO] repository metadata for: 'snapshot org.apache.cxf:cxf-rt-ws-policy:2.6.0-SNAPSHOT'
could not be found on repository: apache.snapshots.https, so will be created
[INFO] Uploading repository metadata for: 'snapshot org.apache.cxf:cxf-rt-ws-policy:2.6.0-SNAPSHOT'
[INFO] Retrieving previous metadata from apache.snapshots.https
[INFO] Uploading repository metadata for: 'artifact org.apache.cxf:cxf-rt-ws-policy'
[INFO] Retrieving previous build number from apache.snapshots.https
Uploading: https://repository.apache.org/content/repositories/snapshots/org/apache/cxf/cxf-rt-ws-policy/2.6.0-SNAPSHOT/cxf-rt-ws-policy-2.6.0-20120106.061133-1-sources.jar
140K uploaded  (cxf-rt-ws-policy-2.6.0-20120106.061133-1-sources.jar)
[INFO] Retrieving previous build number from apache.snapshots.https
Uploading: https://repository.apache.org/content/repositories/snapshots/org/apache/cxf/cxf-rt-ws-policy/2.6.0-SNAPSHOT/cxf-rt-ws-policy-2.6.0-20120106.061133-1-javadoc.jar
413K uploaded  (cxf-rt-ws-policy-2.6.0-20120106.061133-1-javadoc.jar)
[JENKINS] Archiving <https://builds.apache.org/job/CXF-trunk-deploy/ws/trunk/rt/ws/policy/pom.xml>
to /home/hudson/hudson/jobs/CXF-trunk-deploy/modules/org.apache.cxf$cxf-rt-ws-policy/builds/2012-01-06_06-07-24/archive/org.apache.cxf/cxf-rt-ws-policy/2.6.0-SNAPSHOT/cxf-rt-ws-policy-2.6.0-SNAPSHOT.pom
[JENKINS] Archiving <https://builds.apache.org/job/CXF-trunk-deploy/ws/trunk/rt/ws/policy/target/cxf-rt-ws-policy-2.6.0-SNAPSHOT.jar>
to /home/hudson/hudson/jobs/CXF-trunk-deploy/modules/org.apache.cxf$cxf-rt-ws-policy/builds/2012-01-06_06-07-24/archive/org.apache.cxf/cxf-rt-ws-policy/2.6.0-20120106.061133-1/cxf-rt-ws-policy-2.6.0-20120106.061133-1.jar
[JENKINS] Archiving <https://builds.apache.org/job/CXF-trunk-deploy/ws/trunk/rt/ws/policy/target/cxf-rt-ws-policy-2.6.0-SNAPSHOT-sources.jar>
to /home/hudson/hudson/jobs/CXF-trunk-deploy/modules/org.apache.cxf$cxf-rt-ws-policy/builds/2012-01-06_06-07-24/archive/org.apache.cxf/cxf-rt-ws-policy/2.6.0-20120106.061133-1/cxf-rt-ws-policy-2.6.0-20120106.061133-1-sources.jar
[JENKINS] Archiving <https://builds.apache.org/job/CXF-trunk-deploy/ws/trunk/rt/ws/policy/target/cxf-rt-ws-policy-2.6.0-SNAPSHOT-javadoc.jar>
to /home/hudson/hudson/jobs/CXF-trunk-deploy/modules/org.apache.cxf$cxf-rt-ws-policy/builds/2012-01-06_06-07-24/archive/org.apache.cxf/cxf-rt-ws-policy/2.6.0-20120106.061133-1/cxf-rt-ws-policy-2.6.0-20120106.061133-1-javadoc.jar
[INFO] ------------------------------------------------------------------------
[INFO] Building Apache CXF Runtime WS Reliable Messaging
[INFO]    task-segment: [clean, deploy]
[INFO] ------------------------------------------------------------------------
[INFO] [clean:clean {execution: default-clean}]
[INFO] [cxf-xml2fastinfoset:xml2fastinfoset {execution: xml2fastinfoset}]
[INFO] [cxf-xjc:xsdtojava {execution: generate-sources}]
[INFO] [remote-resources:process {execution: default}]
Downloading: http://repo1.maven.org/maven2/org/apache/derby/derby/10.2.2.0/derby-10.2.2.0.pom

Downloading: http://repo1.maven.org/maven2/org/apache/derby/derby/10.2.2.0/derby-10.2.2.0.jar

[debug] execute contextualize
[INFO] [resources:resources {execution: default-resources}]
[INFO] Using 'UTF-8' encoding to copy filtered resources.
[INFO] Copying 3 resources
[INFO] Copying 17 resources
[INFO] skip non existing resourceDirectory <https://builds.apache.org/job/CXF-trunk-deploy/ws/trunk/rt/ws/rm/src/main/resources-filtered>
[INFO] Copying 1 resource
[INFO] Copying 3 resources
[INFO] [compiler:compile {execution: default-compile}]
[INFO] Compiling 147 source files to <https://builds.apache.org/job/CXF-trunk-deploy/ws/trunk/rt/ws/rm/target/classes>
[INFO] -------------------------------------------------------------
[ERROR] COMPILATION ERROR : 
[INFO] -------------------------------------------------------------
[ERROR] <https://builds.apache.org/job/CXF-trunk-deploy/ws/trunk/rt/ws/rm/src/main/java/org/apache/cxf/ws/rm/ManagedRMEndpoint.java>:[58,33]
type javax.management.openmbean.OpenType does not take parameters
[ERROR] <https://builds.apache.org/job/CXF-trunk-deploy/ws/trunk/rt/ws/rm/src/main/java/org/apache/cxf/ws/rm/ManagedRMEndpoint.java>:[65,33]
type javax.management.openmbean.OpenType does not take parameters
[ERROR] <https://builds.apache.org/job/CXF-trunk-deploy/ws/trunk/rt/ws/rm/src/main/java/org/apache/cxf/ws/rm/ManagedRMEndpoint.java>:[72,33]
type javax.management.openmbean.OpenType does not take parameters
[INFO] 3 errors 
[INFO] -------------------------------------------------------------
[JENKINS] Archiving <https://builds.apache.org/job/CXF-trunk-deploy/ws/trunk/rt/ws/rm/pom.xml>
to /home/hudson/hudson/jobs/CXF-trunk-deploy/modules/org.apache.cxf$cxf-rt-ws-rm/builds/2012-01-06_06-07-24/archive/org.apache.cxf/cxf-rt-ws-rm/2.6.0-SNAPSHOT/cxf-rt-ws-rm-2.6.0-SNAPSHOT.pom
[INFO] ------------------------------------------------------------------------
[ERROR] BUILD FAILURE
[INFO] ------------------------------------------------------------------------
[INFO] Compilation failure

<https://builds.apache.org/job/CXF-trunk-deploy/ws/trunk/rt/ws/rm/src/main/java/org/apache/cxf/ws/rm/ManagedRMEndpoint.java>:[58,33]
type javax.management.openmbean.OpenType does not take parameters
<https://builds.apache.org/job/CXF-trunk-deploy/ws/trunk/rt/ws/rm/src/main/java/org/apache/cxf/ws/rm/ManagedRMEndpoint.java>:[65,33]
type javax.management.openmbean.OpenType does not take parameters
<https://builds.apache.org/job/CXF-trunk-deploy/ws/trunk/rt/ws/rm/src/main/java/org/apache/cxf/ws/rm/ManagedRMEndpoint.java>:[72,33]
type javax.management.openmbean.OpenType does not take parameters

[INFO] ------------------------------------------------------------------------
[INFO] Trace
org.apache.maven.BuildFailureException: Compilation failure
	at org.apache.maven.lifecycle.DefaultLifecycleExecutor.executeGoals(DefaultLifecycleExecutor.java:715)
	at org.apache.maven.lifecycle.DefaultLifecycleExecutor.executeGoalWithLifecycle(DefaultLifecycleExecutor.java:556)
	at org.apache.maven.lifecycle.DefaultLifecycleExecutor.executeGoal(DefaultLifecycleExecutor.java:535)
	at org.apache.maven.lifecycle.DefaultLifecycleExecutor.executeGoalAndHandleFailures(DefaultLifecycleExecutor.java:387)
	at org.apache.maven.lifecycle.DefaultLifecycleExecutor.executeTaskSegments(DefaultLifecycleExecutor.java:348)
	at org.apache.maven.lifecycle.DefaultLifecycleExecutor.execute(DefaultLifecycleExecutor.java:180)
	at org.apache.maven.lifecycle.LifecycleExecutorInterceptor.execute(LifecycleExecutorInterceptor.java:65)
	at org.apache.maven.DefaultMaven.doExecute(DefaultMaven.java:328)
	at org.apache.maven.DefaultMaven.execute(DefaultMaven.java:138)
	at org.apache.maven.cli.MavenCli.main(MavenCli.java:362)
	at sun.reflect.NativeMethodAccessorImpl.invoke0(Native Method)
	at sun.reflect.NativeMethodAccessorImpl.invoke(NativeMethodAccessorImpl.java:39)
	at sun.reflect.DelegatingMethodAccessorImpl.invoke(DelegatingMethodAccessorImpl.java:25)
	at java.lang.reflect.Method.invoke(Method.java:592)
	at org.codehaus.classworlds.Launcher.launchEnhanced(Launcher.java:315)
	at org.codehaus.classworlds.Launcher.launch(Launcher.java:255)
	at hudson.maven.agent.Main.launch(Main.java:185)
	at hudson.maven.MavenBuilder.call(MavenBuilder.java:151)
	at hudson.maven.Maven2Builder.call(Maven2Builder.java:77)
	at hudson.maven.Maven2Builder.call(Maven2Builder.java:53)
	at hudson.remoting.UserRequest.perform(UserRequest.java:118)
	at hudson.remoting.UserRequest.perform(UserRequest.java:48)
	at hudson.remoting.Request$2.run(Request.java:287)
	at java.util.concurrent.Executors$RunnableAdapter.call(Executors.java:417)
	at java.util.concurrent.FutureTask$Sync.innerRun(FutureTask.java:269)
	at java.util.concurrent.FutureTask.run(FutureTask.java:123)
	at java.util.concurrent.ThreadPoolExecutor$Worker.runTask(ThreadPoolExecutor.java:651)
	at java.util.concurrent.ThreadPoolExecutor$Worker.run(ThreadPoolExecutor.java:676)
	at java.lang.Thread.run(Thread.java:595)
Caused by: org.apache.maven.plugin.CompilationFailureException: Compilation failure
	at org.apache.maven.plugin.AbstractCompilerMojo.execute(AbstractCompilerMojo.java:656)
	at org.apache.maven.plugin.CompilerMojo.execute(CompilerMojo.java:128)
	at org.apache.maven.plugin.DefaultPluginManager.executeMojo(DefaultPluginManager.java:490)
	at hudson.maven.agent.PluginManagerInterceptor.executeMojo(PluginManagerInterceptor.java:182)
	at org.apache.maven.lifecycle.DefaultLifecycleExecutor.executeGoals(DefaultLifecycleExecutor.java:694)
	... 28 more
[INFO] ------------------------------------------------------------------------
[INFO] Total time: 22 minutes 9 seconds
[INFO] Finished at: Fri Jan 06 06:30:05 UTC 2012
[INFO] Final Memory: 228M/316M
[INFO] ------------------------------------------------------------------------
channel stopped


Mime
View raw message