cxf-notifications mailing list archives

Site index · List index
Message view « Date » · « Thread »
Top « Date » · « Thread »
From Apache Jenkins Server <jenk...@builds.apache.org>
Subject Build failed in Jenkins: CXF-2.5-deploy #1
Date Tue, 17 Jan 2012 07:53:46 GMT
See <https://builds.apache.org/job/CXF-2.5-deploy/1/>

------------------------------------------
[...truncated 13798 lines...]
[INFO] META-INF/cxf already added, skipping
[INFO] META-INF already added, skipping
[INFO] META-INF/LICENSE already added, skipping
[INFO] META-INF/NOTICE already added, skipping
[INFO] META-INF/DEPENDENCIES already added, skipping
[INFO] [javadoc:jar {execution: attach-javadocs}]
[INFO] 
36 warnings
[WARNING] Javadoc Warnings
[WARNING] <https://builds.apache.org/job/CXF-2.5-deploy/ws/cxf-2.5.x-fixes/rt/core/src/main/java/org/apache/cxf/endpoint/ClientImpl.java>:179:
warning - @param argument "service" is not a parameter name.
[WARNING] <https://builds.apache.org/job/CXF-2.5-deploy/ws/cxf-2.5.x-fixes/rt/core/src/main/java/org/apache/cxf/endpoint/EndpointImpl.java>:178:
warning - @param argument "the" is not a parameter name.
[WARNING] <https://builds.apache.org/job/CXF-2.5-deploy/ws/cxf-2.5.x-fixes/rt/core/src/main/java/org/apache/cxf/endpoint/EndpointImplFactory.java>:38:
warning - @return tag has no arguments.
[WARNING] <https://builds.apache.org/job/CXF-2.5-deploy/ws/cxf-2.5.x-fixes/rt/core/src/main/java/org/apache/cxf/endpoint/EndpointResolverRegistryImpl.java>:159:
warning - @param argument "serviceName" is not a parameter name.
[WARNING] <https://builds.apache.org/job/CXF-2.5-deploy/ws/cxf-2.5.x-fixes/rt/core/src/main/java/org/apache/cxf/endpoint/ServiceContractResolverRegistryImpl.java>:55:
warning - @param argument "bus" is not a parameter name.
[WARNING] <https://builds.apache.org/job/CXF-2.5-deploy/ws/cxf-2.5.x-fixes/rt/core/src/main/java/org/apache/cxf/endpoint/SimpleEndpointImplFactory.java>:47:
warning - @return tag has no arguments.
[WARNING] <https://builds.apache.org/job/CXF-2.5-deploy/ws/cxf-2.5.x-fixes/rt/core/src/main/java/org/apache/cxf/transport/AbstractConduit.java>:53:
warning - @param argument "message" is not a parameter name.
[WARNING] <https://builds.apache.org/job/CXF-2.5-deploy/ws/cxf-2.5.x-fixes/rt/core/src/main/java/org/apache/cxf/transport/AbstractMultiplexDestination.java>:54:
warning - @param argument "the" is not a parameter name.
[WARNING] <https://builds.apache.org/job/CXF-2.5-deploy/ws/cxf-2.5.x-fixes/rt/core/src/main/java/org/apache/cxf/transport/AbstractMultiplexDestination.java>:78:
warning - @param argument "the" is not a parameter name.
[WARNING] <https://builds.apache.org/job/CXF-2.5-deploy/ws/cxf-2.5.x-fixes/rt/core/src/main/java/org/apache/cxf/transport/AbstractTransportFactory.java>:32:
warning - Tag @link: reference not found: DestinationFactory
[WARNING] <https://builds.apache.org/job/CXF-2.5-deploy/ws/cxf-2.5.x-fixes/rt/core/src/main/java/org/apache/cxf/transport/AbstractTransportFactory.java>:32:
warning - Tag @link: reference not found: ConduitInitiator
[WARNING] <https://builds.apache.org/job/CXF-2.5-deploy/ws/cxf-2.5.x-fixes/rt/core/src/main/java/org/apache/cxf/interceptor/AbstractEndpointSelectionInterceptor.java>:78:
warning - @return tag has no arguments.
[WARNING] <https://builds.apache.org/job/CXF-2.5-deploy/ws/cxf-2.5.x-fixes/rt/core/src/main/java/org/apache/cxf/interceptor/AbstractInDatabindingInterceptor.java>:139:
warning - @return tag has no arguments.
[WARNING] <https://builds.apache.org/job/CXF-2.5-deploy/ws/cxf-2.5.x-fixes/rt/core/src/main/java/org/apache/cxf/interceptor/AbstractInDatabindingInterceptor.java>:241:
warning - @return tag has no arguments.
[WARNING] <https://builds.apache.org/job/CXF-2.5-deploy/ws/cxf-2.5.x-fixes/rt/core/src/main/java/org/apache/cxf/interceptor/AttachmentInInterceptor.java>:47:
warning - @param argument "messageParam" is not a parameter name.
[WARNING] <https://builds.apache.org/job/CXF-2.5-deploy/ws/cxf-2.5.x-fixes/rt/core/src/main/java/org/apache/cxf/interceptor/FaultOutInterceptor.java>:158:
warning - @return tag has no arguments.
[WARNING] <https://builds.apache.org/job/CXF-2.5-deploy/ws/cxf-2.5.x-fixes/rt/core/src/main/java/org/apache/cxf/feature/FastInfosetFeature.java>:72:
warning - @return tag has no arguments.
[WARNING] <https://builds.apache.org/job/CXF-2.5-deploy/ws/cxf-2.5.x-fixes/rt/core/src/main/java/org/apache/cxf/feature/FastInfosetFeature.java>:72:
warning - Tag @link: can't find setForce(int) in org.apache.cxf.feature.FastInfosetFeature
[WARNING] <https://builds.apache.org/job/CXF-2.5-deploy/ws/cxf-2.5.x-fixes/rt/core/src/main/java/org/apache/cxf/feature/LoggingFeature.java>:121:
warning - @return tag has no arguments.
[WARNING] <https://builds.apache.org/job/CXF-2.5-deploy/ws/cxf-2.5.x-fixes/rt/core/src/main/java/org/apache/cxf/feature/LoggingFeature.java>:128:
warning - @return tag has no arguments.
[WARNING] <https://builds.apache.org/job/CXF-2.5-deploy/ws/cxf-2.5.x-fixes/rt/core/src/main/java/org/apache/cxf/clustering/AbstractStaticFailoverStrategy.java>:164:
warning - @return tag has no arguments.
[WARNING] <https://builds.apache.org/job/CXF-2.5-deploy/ws/cxf-2.5.x-fixes/rt/core/src/main/java/org/apache/cxf/clustering/AbstractStaticFailoverStrategy.java>:77:
warning - @param argument "a" is not a parameter name.
[WARNING] <https://builds.apache.org/job/CXF-2.5-deploy/ws/cxf-2.5.x-fixes/rt/core/src/main/java/org/apache/cxf/clustering/AbstractStaticFailoverStrategy.java>:106:
warning - @param argument "a" is not a parameter name.
[WARNING] <https://builds.apache.org/job/CXF-2.5-deploy/ws/cxf-2.5.x-fixes/rt/core/src/main/java/org/apache/cxf/clustering/RandomStrategy.java>:47:
warning - @return tag has no arguments.
[WARNING] <https://builds.apache.org/job/CXF-2.5-deploy/ws/cxf-2.5.x-fixes/rt/core/src/main/java/org/apache/cxf/clustering/SequentialStrategy.java>:37:
warning - @return tag has no arguments.
[WARNING] <https://builds.apache.org/job/CXF-2.5-deploy/ws/cxf-2.5.x-fixes/rt/core/src/main/java/org/apache/cxf/service/invoker/Factory.java>:36:
warning - @return tag has no arguments.
[WARNING] <https://builds.apache.org/job/CXF-2.5-deploy/ws/cxf-2.5.x-fixes/rt/core/src/main/java/org/apache/cxf/test/TestUtilities.java>:411:
warning - @return tag has no arguments.
[WARNING] <https://builds.apache.org/job/CXF-2.5-deploy/ws/cxf-2.5.x-fixes/rt/core/src/main/java/org/apache/cxf/test/TestUtilities.java>:402:
warning - @return tag has no arguments.
[WARNING] <https://builds.apache.org/job/CXF-2.5-deploy/ws/cxf-2.5.x-fixes/rt/core/src/main/java/org/apache/cxf/test/TestUtilities.java>:126:
warning - @return tag has no arguments.
[WARNING] <https://builds.apache.org/job/CXF-2.5-deploy/ws/cxf-2.5.x-fixes/rt/core/src/main/java/org/apache/cxf/attachment/AttachmentUtil.java>:80:
warning - @return tag has no arguments.
[WARNING] <https://builds.apache.org/job/CXF-2.5-deploy/ws/cxf-2.5.x-fixes/rt/core/src/main/java/org/apache/cxf/binding/AbstractBaseBindingFactory.java>:75:
warning - @return tag has no arguments.
[WARNING] <https://builds.apache.org/job/CXF-2.5-deploy/ws/cxf-2.5.x-fixes/rt/core/src/main/java/org/apache/cxf/binding/AbstractBindingFactory.java>:67:
warning - @return tag has no arguments.
[WARNING] <https://builds.apache.org/job/CXF-2.5-deploy/ws/cxf-2.5.x-fixes/rt/core/src/main/java/org/apache/cxf/transport/AbstractTransportFactory.java>:32:
warning - Tag @link: reference not found: DestinationFactory
[WARNING] <https://builds.apache.org/job/CXF-2.5-deploy/ws/cxf-2.5.x-fixes/rt/core/src/main/java/org/apache/cxf/transport/AbstractTransportFactory.java>:32:
warning - Tag @link: reference not found: ConduitInitiator
[WARNING] <https://builds.apache.org/job/CXF-2.5-deploy/ws/cxf-2.5.x-fixes/rt/core/src/main/java/org/apache/cxf/transport/AbstractTransportFactory.java>:32:
warning - Tag @link: reference not found: DestinationFactory
[WARNING] <https://builds.apache.org/job/CXF-2.5-deploy/ws/cxf-2.5.x-fixes/rt/core/src/main/java/org/apache/cxf/transport/AbstractTransportFactory.java>:32:
warning - Tag @link: reference not found: ConduitInitiator
[INFO] Building jar: <https://builds.apache.org/job/CXF-2.5-deploy/ws/cxf-2.5.x-fixes/rt/core/target/cxf-rt-core-2.5.2-SNAPSHOT-javadoc.jar>
[INFO] [install:install {execution: default-install}]
[INFO] Installing <https://builds.apache.org/job/CXF-2.5-deploy/ws/cxf-2.5.x-fixes/rt/core/target/cxf-rt-core-2.5.2-SNAPSHOT.jar>
to <https://builds.apache.org/job/CXF-2.5-deploy/ws/.repository/org/apache/cxf/cxf-rt-core/2.5.2-SNAPSHOT/cxf-rt-core-2.5.2-SNAPSHOT.jar>
[INFO] Installing <https://builds.apache.org/job/CXF-2.5-deploy/ws/cxf-2.5.x-fixes/rt/core/target/cxf-rt-core-2.5.2-SNAPSHOT-sources.jar>
to <https://builds.apache.org/job/CXF-2.5-deploy/ws/.repository/org/apache/cxf/cxf-rt-core/2.5.2-SNAPSHOT/cxf-rt-core-2.5.2-SNAPSHOT-sources.jar>
[INFO] Installing <https://builds.apache.org/job/CXF-2.5-deploy/ws/cxf-2.5.x-fixes/rt/core/target/cxf-rt-core-2.5.2-SNAPSHOT-javadoc.jar>
to <https://builds.apache.org/job/CXF-2.5-deploy/ws/.repository/org/apache/cxf/cxf-rt-core/2.5.2-SNAPSHOT/cxf-rt-core-2.5.2-SNAPSHOT-javadoc.jar>
[INFO] [deploy:deploy {execution: default-deploy}]
[INFO] Retrieving previous build number from apache.snapshots.https
Uploading: https://repository.apache.org/content/repositories/snapshots/org/apache/cxf/cxf-rt-core/2.5.2-SNAPSHOT/cxf-rt-core-2.5.2-20120117.074820-14.jar
534K uploaded  (cxf-rt-core-2.5.2-20120117.074820-14.jar)
[INFO] Uploading project information for cxf-rt-core 2.5.2-20120117.074820-14
[INFO] Retrieving previous metadata from apache.snapshots.https
[INFO] Uploading repository metadata for: 'artifact org.apache.cxf:cxf-rt-core'
[INFO] Retrieving previous metadata from apache.snapshots.https
[INFO] Uploading repository metadata for: 'snapshot org.apache.cxf:cxf-rt-core:2.5.2-SNAPSHOT'
[INFO] Retrieving previous build number from apache.snapshots.https
Uploading: https://repository.apache.org/content/repositories/snapshots/org/apache/cxf/cxf-rt-core/2.5.2-SNAPSHOT/cxf-rt-core-2.5.2-20120117.074820-14-sources.jar
381K uploaded  (cxf-rt-core-2.5.2-20120117.074820-14-sources.jar)
[INFO] Retrieving previous build number from apache.snapshots.https
Uploading: https://repository.apache.org/content/repositories/snapshots/org/apache/cxf/cxf-rt-core/2.5.2-SNAPSHOT/cxf-rt-core-2.5.2-20120117.074820-14-javadoc.jar
1274K uploaded  (cxf-rt-core-2.5.2-20120117.074820-14-javadoc.jar)
[JENKINS] Archiving <https://builds.apache.org/job/CXF-2.5-deploy/ws/cxf-2.5.x-fixes/rt/core/pom.xml>
to /home/hudson/hudson/jobs/CXF-2.5-deploy/modules/org.apache.cxf$cxf-rt-core/builds/2012-01-17_07-43-36/archive/org.apache.cxf/cxf-rt-core/2.5.2-SNAPSHOT/cxf-rt-core-2.5.2-SNAPSHOT.pom
[JENKINS] Archiving <https://builds.apache.org/job/CXF-2.5-deploy/ws/cxf-2.5.x-fixes/rt/core/target/cxf-rt-core-2.5.2-SNAPSHOT.jar>
to /home/hudson/hudson/jobs/CXF-2.5-deploy/modules/org.apache.cxf$cxf-rt-core/builds/2012-01-17_07-43-36/archive/org.apache.cxf/cxf-rt-core/2.5.2-20120117.074820-14/cxf-rt-core-2.5.2-20120117.074820-14.jar
[JENKINS] Archiving <https://builds.apache.org/job/CXF-2.5-deploy/ws/cxf-2.5.x-fixes/rt/core/target/cxf-rt-core-2.5.2-SNAPSHOT-sources.jar>
to /home/hudson/hudson/jobs/CXF-2.5-deploy/modules/org.apache.cxf$cxf-rt-core/builds/2012-01-17_07-43-36/archive/org.apache.cxf/cxf-rt-core/2.5.2-20120117.074820-14/cxf-rt-core-2.5.2-20120117.074820-14-sources.jar
[JENKINS] Archiving <https://builds.apache.org/job/CXF-2.5-deploy/ws/cxf-2.5.x-fixes/rt/core/target/cxf-rt-core-2.5.2-SNAPSHOT-javadoc.jar>
to /home/hudson/hudson/jobs/CXF-2.5-deploy/modules/org.apache.cxf$cxf-rt-core/builds/2012-01-17_07-43-36/archive/org.apache.cxf/cxf-rt-core/2.5.2-20120117.074820-14/cxf-rt-core-2.5.2-20120117.074820-14-javadoc.jar
[INFO] ------------------------------------------------------------------------
[INFO] Building Apache CXF Command Line Tools Common
[INFO]    task-segment: [clean, deploy]
[INFO] ------------------------------------------------------------------------
[INFO] [clean:clean {execution: default-clean}]
[INFO] [cxf-xml2fastinfoset:xml2fastinfoset {execution: xml2fastinfoset}]
[INFO] [remote-resources:process {execution: default}]
Downloading: http://repo1.maven.org/maven2/org/apache/velocity/velocity/1.7/velocity-1.7.pom
[WARNING] Unable to get resource 'org.apache.velocity:velocity:pom:1.7' from repository central
(http://repo1.maven.org/maven2): Error transferring file: Connection timed out
Downloading: http://repo1.maven.org/maven2/org/apache/velocity/velocity/1.7/velocity-1.7.jar
[WARNING] Unable to get resource 'org.apache.velocity:velocity:jar:1.7' from repository central
(http://repo1.maven.org/maven2): Error transferring file: Connection timed out
[JENKINS] Archiving <https://builds.apache.org/job/CXF-2.5-deploy/ws/cxf-2.5.x-fixes/tools/common/pom.xml>
to /home/hudson/hudson/jobs/CXF-2.5-deploy/modules/org.apache.cxf$cxf-tools-common/builds/2012-01-17_07-43-36/archive/org.apache.cxf/cxf-tools-common/2.5.2-SNAPSHOT/cxf-tools-common-2.5.2-SNAPSHOT.pom
[INFO] ------------------------------------------------------------------------
[ERROR] BUILD ERROR
[INFO] ------------------------------------------------------------------------
[INFO] Failed to resolve artifact.

Missing:
----------
1) org.apache.velocity:velocity:jar:1.7

  Try downloading the file manually from the project website.

  Then, install it using the command: 
      mvn install:install-file -DgroupId=org.apache.velocity -DartifactId=velocity -Dversion=1.7
-Dpackaging=jar -Dfile=/path/to/file

  Alternatively, if you host your own repository you can deploy the file there: 
      mvn deploy:deploy-file -DgroupId=org.apache.velocity -DartifactId=velocity -Dversion=1.7
-Dpackaging=jar -Dfile=/path/to/file -Durl=[url] -DrepositoryId=[id]

  Path to dependency: 
  	1) org.apache.cxf:cxf-tools-common:jar:2.5.2-SNAPSHOT
  	2) org.apache.velocity:velocity:jar:1.7

----------
1 required artifact is missing.

for artifact: 
  org.apache.cxf:cxf-tools-common:jar:2.5.2-SNAPSHOT

from the specified remote repositories:
  central (http://repo1.maven.org/maven2),
  Nexus (http://repository.apache.org/snapshots)



[INFO] ------------------------------------------------------------------------
[INFO] Trace
org.apache.maven.lifecycle.LifecycleExecutionException: Failed to resolve dependencies for
one or more projects in the reactor. Reason: Missing:
----------
1) org.apache.velocity:velocity:jar:1.7

  Try downloading the file manually from the project website.

  Then, install it using the command: 
      mvn install:install-file -DgroupId=org.apache.velocity -DartifactId=velocity -Dversion=1.7
-Dpackaging=jar -Dfile=/path/to/file

  Alternatively, if you host your own repository you can deploy the file there: 
      mvn deploy:deploy-file -DgroupId=org.apache.velocity -DartifactId=velocity -Dversion=1.7
-Dpackaging=jar -Dfile=/path/to/file -Durl=[url] -DrepositoryId=[id]

  Path to dependency: 
  	1) org.apache.cxf:cxf-tools-common:jar:2.5.2-SNAPSHOT
  	2) org.apache.velocity:velocity:jar:1.7

----------
1 required artifact is missing.

for artifact: 
  org.apache.cxf:cxf-tools-common:jar:2.5.2-SNAPSHOT

from the specified remote repositories:
  central (http://repo1.maven.org/maven2),
  Nexus (http://repository.apache.org/snapshots)


	at org.apache.maven.lifecycle.DefaultLifecycleExecutor.executeGoals(DefaultLifecycleExecutor.java:719)
	at org.apache.maven.lifecycle.DefaultLifecycleExecutor.executeGoalWithLifecycle(DefaultLifecycleExecutor.java:556)
	at org.apache.maven.lifecycle.DefaultLifecycleExecutor.executeGoal(DefaultLifecycleExecutor.java:535)
	at org.apache.maven.lifecycle.DefaultLifecycleExecutor.executeGoalAndHandleFailures(DefaultLifecycleExecutor.java:387)
	at org.apache.maven.lifecycle.DefaultLifecycleExecutor.executeTaskSegments(DefaultLifecycleExecutor.java:348)
	at org.apache.maven.lifecycle.DefaultLifecycleExecutor.execute(DefaultLifecycleExecutor.java:180)
	at org.apache.maven.lifecycle.LifecycleExecutorInterceptor.execute(LifecycleExecutorInterceptor.java:65)
	at org.apache.maven.DefaultMaven.doExecute(DefaultMaven.java:328)
	at org.apache.maven.DefaultMaven.execute(DefaultMaven.java:138)
	at org.apache.maven.cli.MavenCli.main(MavenCli.java:362)
	at sun.reflect.NativeMethodAccessorImpl.invoke0(Native Method)
	at sun.reflect.NativeMethodAccessorImpl.invoke(NativeMethodAccessorImpl.java:39)
	at sun.reflect.DelegatingMethodAccessorImpl.invoke(DelegatingMethodAccessorImpl.java:25)
	at java.lang.reflect.Method.invoke(Method.java:592)
	at org.codehaus.classworlds.Launcher.launchEnhanced(Launcher.java:315)
	at org.codehaus.classworlds.Launcher.launch(Launcher.java:255)
	at hudson.maven.agent.Main.launch(Main.java:185)
	at hudson.maven.MavenBuilder.call(MavenBuilder.java:151)
	at hudson.maven.Maven2Builder.call(Maven2Builder.java:77)
	at hudson.maven.Maven2Builder.call(Maven2Builder.java:53)
	at hudson.remoting.UserRequest.perform(UserRequest.java:118)
	at hudson.remoting.UserRequest.perform(UserRequest.java:48)
	at hudson.remoting.Request$2.run(Request.java:287)
	at java.util.concurrent.Executors$RunnableAdapter.call(Executors.java:417)
	at java.util.concurrent.FutureTask$Sync.innerRun(FutureTask.java:269)
	at java.util.concurrent.FutureTask.run(FutureTask.java:123)
	at java.util.concurrent.ThreadPoolExecutor$Worker.runTask(ThreadPoolExecutor.java:651)
	at java.util.concurrent.ThreadPoolExecutor$Worker.run(ThreadPoolExecutor.java:676)
	at java.lang.Thread.run(Thread.java:595)
Caused by: org.apache.maven.plugin.MojoExecutionException: Failed to resolve dependencies
for one or more projects in the reactor. Reason: Missing:
----------
1) org.apache.velocity:velocity:jar:1.7

  Try downloading the file manually from the project website.

  Then, install it using the command: 
      mvn install:install-file -DgroupId=org.apache.velocity -DartifactId=velocity -Dversion=1.7
-Dpackaging=jar -Dfile=/path/to/file

  Alternatively, if you host your own repository you can deploy the file there: 
      mvn deploy:deploy-file -DgroupId=org.apache.velocity -DartifactId=velocity -Dversion=1.7
-Dpackaging=jar -Dfile=/path/to/file -Durl=[url] -DrepositoryId=[id]

  Path to dependency: 
  	1) org.apache.cxf:cxf-tools-common:jar:2.5.2-SNAPSHOT
  	2) org.apache.velocity:velocity:jar:1.7

----------
1 required artifact is missing.

for artifact: 
  org.apache.cxf:cxf-tools-common:jar:2.5.2-SNAPSHOT

from the specified remote repositories:
  central (http://repo1.maven.org/maven2),
  Nexus (http://repository.apache.org/snapshots)


	at org.apache.maven.plugin.resources.remote.ProcessRemoteResourcesMojo.resolveProjectArtifacts(ProcessRemoteResourcesMojo.java:721)
	at org.apache.maven.plugin.resources.remote.ProcessRemoteResourcesMojo.getProjects(ProcessRemoteResourcesMojo.java:621)
	at org.apache.maven.plugin.resources.remote.ProcessRemoteResourcesMojo.configureVelocityContext(ProcessRemoteResourcesMojo.java:988)
	at org.apache.maven.plugin.resources.remote.ProcessRemoteResourcesMojo.execute(ProcessRemoteResourcesMojo.java:511)
	at org.apache.maven.plugin.DefaultPluginManager.executeMojo(DefaultPluginManager.java:490)
	at hudson.maven.agent.PluginManagerInterceptor.executeMojo(PluginManagerInterceptor.java:182)
	at org.apache.maven.lifecycle.DefaultLifecycleExecutor.executeGoals(DefaultLifecycleExecutor.java:694)
	... 28 more
Caused by: org.apache.maven.artifact.resolver.MultipleArtifactsNotFoundException: Missing:
----------
1) org.apache.velocity:velocity:jar:1.7

  Try downloading the file manually from the project website.

  Then, install it using the command: 
      mvn install:install-file -DgroupId=org.apache.velocity -DartifactId=velocity -Dversion=1.7
-Dpackaging=jar -Dfile=/path/to/file

  Alternatively, if you host your own repository you can deploy the file there: 
      mvn deploy:deploy-file -DgroupId=org.apache.velocity -DartifactId=velocity -Dversion=1.7
-Dpackaging=jar -Dfile=/path/to/file -Durl=[url] -DrepositoryId=[id]

  Path to dependency: 
  	1) org.apache.cxf:cxf-tools-common:jar:2.5.2-SNAPSHOT
  	2) org.apache.velocity:velocity:jar:1.7

----------
1 required artifact is missing.

for artifact: 
  org.apache.cxf:cxf-tools-common:jar:2.5.2-SNAPSHOT

from the specified remote repositories:
  central (http://repo1.maven.org/maven2),
  Nexus (http://repository.apache.org/snapshots)


	at org.apache.maven.artifact.resolver.DefaultArtifactResolver.resolveTransitively(DefaultArtifactResolver.java:360)
	at org.apache.maven.artifact.resolver.DefaultArtifactResolver.resolveTransitively(DefaultArtifactResolver.java:304)
	at org.apache.maven.shared.artifact.resolver.DefaultProjectDependenciesResolver.resolve(DefaultProjectDependenciesResolver.java:140)
	at org.apache.maven.shared.artifact.resolver.DefaultProjectDependenciesResolver.resolve(DefaultProjectDependenciesResolver.java:187)
	at org.apache.maven.plugin.resources.remote.ProcessRemoteResourcesMojo.resolveProjectArtifacts(ProcessRemoteResourcesMojo.java:716)
	... 34 more
[INFO] ------------------------------------------------------------------------
[INFO] Total time: 9 minutes 37 seconds
[INFO] Finished at: Tue Jan 17 07:53:43 UTC 2012
[INFO] Final Memory: 95M/170M
[INFO] ------------------------------------------------------------------------
Sending e-mails to: notifications@cxf.apache.org
channel stopped
[locks-and-latches] Releasing all the locks
[locks-and-latches] All the locks released


Mime
View raw message