cxf-notifications mailing list archives

Site index · List index
Message view « Date » · « Thread »
Top « Date » · « Thread »
From Apache Jenkins Server <jenk...@builds.apache.org>
Subject Build failed in Jenkins: CXF-2.4-deploy #152
Date Mon, 06 Feb 2012 06:47:31 GMT
See <https://builds.apache.org/job/CXF-2.4-deploy/152/changes>

Changes:

[ffang] Merged revisions 1240882 via svnmerge from 
https://svn.apache.org/repos/asf/cxf/branches/2.5.x-fixes

................
  r1240882 | ffang | 2012-02-06 10:45:47 +0800 (一, 06  2 2012) | 9 lines
  
  Merged revisions 1240879 via svnmerge from 
  https://svn.apache.org/repos/asf/cxf/trunk
  
  ........
    r1240879 | ffang | 2012-02-06 10:22:21 +0800 (一, 06  2 2012) | 1 line
    
    [CXF-4085]use SystemPropertyAction.getProperty but not System.getProperty
  ........
................

------------------------------------------
[...truncated 2717 lines...]
[INFO] META-INF/DEPENDENCIES already added, skipping
[INFO] META-INF/NOTICE already added, skipping
[INFO] [javadoc:jar {execution: attach-javadocs}]
[INFO] 
8 warnings
[WARNING] Javadoc Warnings
[WARNING] <https://builds.apache.org/job/CXF-2.4-deploy/ws/cxf-2.4.x-fixes/rt/transports/http-jetty/src/main/java/org/apache/cxf/transport/http_jetty/JettyHTTPDestination.java>:84:
warning - @param argument "b" is not a parameter name.
[WARNING] <https://builds.apache.org/job/CXF-2.4-deploy/ws/cxf-2.4.x-fixes/rt/transports/http-jetty/src/main/java/org/apache/cxf/transport/http_jetty/JettyHTTPDestination.java>:84:
warning - @param argument "ci" is not a parameter name.
[WARNING] <https://builds.apache.org/job/CXF-2.4-deploy/ws/cxf-2.4.x-fixes/rt/transports/http-jetty/src/main/java/org/apache/cxf/transport/http_jetty/JettyHTTPDestination.java>:84:
warning - @param argument "endpointInfo" is not a parameter name.
[WARNING] <https://builds.apache.org/job/CXF-2.4-deploy/ws/cxf-2.4.x-fixes/rt/transports/http-jetty/src/main/java/org/apache/cxf/transport/http_jetty/JettyHTTPServerEngine.java>:192:
warning - @return tag has no arguments.
[WARNING] <https://builds.apache.org/job/CXF-2.4-deploy/ws/cxf-2.4.x-fixes/rt/transports/http-jetty/src/main/java/org/apache/cxf/transport/http_jetty/JettyHTTPServerEngine.java>:184:
warning - @return tag has no arguments.
[WARNING] <https://builds.apache.org/job/CXF-2.4-deploy/ws/cxf-2.4.x-fixes/rt/transports/http-jetty/src/main/java/org/apache/cxf/transport/http_jetty/JettyHTTPServerEngine.java>:232:
warning - @return tag has no arguments.
[WARNING] <https://builds.apache.org/job/CXF-2.4-deploy/ws/cxf-2.4.x-fixes/rt/transports/http-jetty/src/main/java/org/apache/cxf/transport/http_jetty/JettyHTTPServerEngine.java>:731:
warning - @return tag has no arguments.
[WARNING] <https://builds.apache.org/job/CXF-2.4-deploy/ws/cxf-2.4.x-fixes/rt/transports/http-jetty/src/main/java/org/apache/cxf/transport/http_jetty/JettyHTTPServerEngineFactory.java>:248:
warning - @return tag has no arguments.
[INFO] Building jar: <https://builds.apache.org/job/CXF-2.4-deploy/ws/cxf-2.4.x-fixes/rt/transports/http-jetty/target/cxf-rt-transports-http-jetty-2.4.7-SNAPSHOT-javadoc.jar>
[INFO] [install:install {execution: default-install}]
[INFO] Installing <https://builds.apache.org/job/CXF-2.4-deploy/ws/cxf-2.4.x-fixes/rt/transports/http-jetty/target/cxf-rt-transports-http-jetty-2.4.7-SNAPSHOT.jar>
to <https://builds.apache.org/job/CXF-2.4-deploy/ws/.repository/org/apache/cxf/cxf-rt-transports-http-jetty/2.4.7-SNAPSHOT/cxf-rt-transports-http-jetty-2.4.7-SNAPSHOT.jar>
[INFO] Installing <https://builds.apache.org/job/CXF-2.4-deploy/ws/cxf-2.4.x-fixes/rt/transports/http-jetty/target/cxf-rt-transports-http-jetty-2.4.7-SNAPSHOT-sources.jar>
to <https://builds.apache.org/job/CXF-2.4-deploy/ws/.repository/org/apache/cxf/cxf-rt-transports-http-jetty/2.4.7-SNAPSHOT/cxf-rt-transports-http-jetty-2.4.7-SNAPSHOT-sources.jar>
[INFO] Installing <https://builds.apache.org/job/CXF-2.4-deploy/ws/cxf-2.4.x-fixes/rt/transports/http-jetty/target/cxf-rt-transports-http-jetty-2.4.7-SNAPSHOT-javadoc.jar>
to <https://builds.apache.org/job/CXF-2.4-deploy/ws/.repository/org/apache/cxf/cxf-rt-transports-http-jetty/2.4.7-SNAPSHOT/cxf-rt-transports-http-jetty-2.4.7-SNAPSHOT-javadoc.jar>
[INFO] [deploy:deploy {execution: default-deploy}]
[INFO] Retrieving previous build number from apache.snapshots.https
Uploading: https://repository.apache.org/content/repositories/snapshots/org/apache/cxf/cxf-rt-transports-http-jetty/2.4.7-SNAPSHOT/cxf-rt-transports-http-jetty-2.4.7-20120206.061748-9.jar
66K uploaded  (cxf-rt-transports-http-jetty-2.4.7-20120206.061748-9.jar)
[INFO] Retrieving previous metadata from apache.snapshots.https
[INFO] Uploading repository metadata for: 'snapshot org.apache.cxf:cxf-rt-transports-http-jetty:2.4.7-SNAPSHOT'
[INFO] Retrieving previous metadata from apache.snapshots.https
[INFO] Uploading repository metadata for: 'artifact org.apache.cxf:cxf-rt-transports-http-jetty'
[JENKINS] Archiving <https://builds.apache.org/job/CXF-2.4-deploy/ws/cxf-2.4.x-fixes/rt/transports/http-jetty/pom.xml>
to /home/hudson/hudson/jobs/CXF-2.4-deploy/modules/org.apache.cxf$cxf-rt-transports-http-jetty/builds/2012-02-06_06-16-51/archive/org.apache.cxf/cxf-rt-transports-http-jetty/2.4.7-SNAPSHOT/cxf-rt-transports-http-jetty-2.4.7-SNAPSHOT.pom[INFO]
Uploading project information for cxf-rt-transports-http-jetty 2.4.7-20120206.061748-9
[INFO] Retrieving previous build number from apache.snapshots.https
Uploading: https://repository.apache.org/content/repositories/snapshots/org/apache/cxf/cxf-rt-transports-http-jetty/2.4.7-SNAPSHOT/cxf-rt-transports-http-jetty-2.4.7-20120206.061748-9-sources.jar
57K uploaded  (cxf-rt-transports-http-jetty-2.4.7-20120206.061748-9-sources.jar)
[INFO] Retrieving previous build number from apache.snapshots.https
Uploading: https://repository.apache.org/content/repositories/snapshots/org/apache/cxf/cxf-rt-transports-http-jetty/2.4.7-SNAPSHOT/cxf-rt-transports-http-jetty-2.4.7-20120206.061748-9-javadoc.jar
191K uploaded  (cxf-rt-transports-http-jetty-2.4.7-20120206.061748-9-javadoc.jar)

[JENKINS] Archiving <https://builds.apache.org/job/CXF-2.4-deploy/ws/cxf-2.4.x-fixes/rt/transports/http-jetty/target/cxf-rt-transports-http-jetty-2.4.7-SNAPSHOT.jar>
to /home/hudson/hudson/jobs/CXF-2.4-deploy/modules/org.apache.cxf$cxf-rt-transports-http-jetty/builds/2012-02-06_06-16-51/archive/org.apache.cxf/cxf-rt-transports-http-jetty/2.4.7-20120206.061748-9/cxf-rt-transports-http-jetty-2.4.7-20120206.061748-9.jar
[JENKINS] Archiving <https://builds.apache.org/job/CXF-2.4-deploy/ws/cxf-2.4.x-fixes/rt/transports/http-jetty/target/cxf-rt-transports-http-jetty-2.4.7-SNAPSHOT-sources.jar>
to /home/hudson/hudson/jobs/CXF-2.4-deploy/modules/org.apache.cxf$cxf-rt-transports-http-jetty/builds/2012-02-06_06-16-51/archive/org.apache.cxf/cxf-rt-transports-http-jetty/2.4.7-20120206.061748-9/cxf-rt-transports-http-jetty-2.4.7-20120206.061748-9-sources.jar
[JENKINS] Archiving <https://builds.apache.org/job/CXF-2.4-deploy/ws/cxf-2.4.x-fixes/rt/transports/http-jetty/target/cxf-rt-transports-http-jetty-2.4.7-SNAPSHOT-javadoc.jar>
to /home/hudson/hudson/jobs/CXF-2.4-deploy/modules/org.apache.cxf$cxf-rt-transports-http-jetty/builds/2012-02-06_06-16-51/archive/org.apache.cxf/cxf-rt-transports-http-jetty/2.4.7-20120206.061748-9/cxf-rt-transports-http-jetty-2.4.7-20120206.061748-9-javadoc.jar
[INFO] ------------------------------------------------------------------------
[INFO] Building Apache CXF Runtime WS Addressing
[INFO]    task-segment: [clean, deploy]
[INFO] ------------------------------------------------------------------------
[INFO] [clean:clean {execution: default-clean}]
[INFO] Deleting <https://builds.apache.org/job/CXF-2.4-deploy/ws/cxf-2.4.x-fixes/rt/ws/addr/target>
[INFO] [cxf-xml2fastinfoset:xml2fastinfoset {execution: xml2fastinfoset}]
[INFO] [remote-resources:process {execution: default}]
[debug] execute contextualize
[INFO] [resources:resources {execution: default-resources}]
[INFO] Using 'UTF-8' encoding to copy filtered resources.
[INFO] Copying 3 resources
[INFO] Copying 7 resources
[INFO] skip non existing resourceDirectory <https://builds.apache.org/job/CXF-2.4-deploy/ws/cxf-2.4.x-fixes/rt/ws/addr/src/main/resources-filtered>
[INFO] Copying 1 resource
[INFO] Copying 3 resources
[INFO] [compiler:compile {execution: default-compile}]
[INFO] Compiling 21 source files to <https://builds.apache.org/job/CXF-2.4-deploy/ws/cxf-2.4.x-fixes/rt/ws/addr/target/classes>
[debug] execute contextualize
[INFO] [resources:testResources {execution: default-testResources}]
[INFO] Using 'UTF-8' encoding to copy filtered resources.
[INFO] Copying 1 resource
[INFO] skip non existing resourceDirectory <https://builds.apache.org/job/CXF-2.4-deploy/ws/cxf-2.4.x-fixes/rt/ws/addr/src/test/resources>
[INFO] skip non existing resourceDirectory <https://builds.apache.org/job/CXF-2.4-deploy/ws/cxf-2.4.x-fixes/rt/ws/addr/target/generated/src/test/resources>
[INFO] Copying 3 resources
[INFO] [compiler:testCompile {execution: default-testCompile}]
[INFO] Compiling 8 source files to <https://builds.apache.org/job/CXF-2.4-deploy/ws/cxf-2.4.x-fixes/rt/ws/addr/target/test-classes>
[INFO] [surefire:test {execution: default-test}]
[INFO] Tests are skipped.
[INFO] [jar:jar {execution: default-jar}]
[INFO] Building jar: <https://builds.apache.org/job/CXF-2.4-deploy/ws/cxf-2.4.x-fixes/rt/ws/addr/target/cxf-rt-ws-addr-2.4.7-SNAPSHOT.jar>
[INFO] [source:jar-no-fork {execution: attach-sources}]
[INFO] org already added, skipping
[INFO] org/apache already added, skipping
[INFO] org/apache/cxf already added, skipping
[INFO] org/apache/cxf/ws already added, skipping
[INFO] org/apache/cxf/ws/addressing already added, skipping
[INFO] org/apache/cxf/ws/addressing/spring already added, skipping
[INFO] org/apache/cxf/ws/addressing/blueprint already added, skipping
[INFO] org/apache/cxf/ws/addressing/policy already added, skipping
[INFO] org/apache/cxf/ws/addressing/soap already added, skipping
[INFO] org/apache/cxf/ws/addressing/Messages.properties already added, skipping
[INFO] org/apache/cxf/ws/addressing/policy/Messages.properties already added, skipping
[INFO] org/apache/cxf/ws/addressing/soap/Messages.properties already added, skipping
[INFO] META-INF already added, skipping
[INFO] META-INF already added, skipping
[INFO] META-INF/cxf already added, skipping
[INFO] META-INF already added, skipping
[INFO] META-INF/LICENSE already added, skipping
[INFO] META-INF/DEPENDENCIES already added, skipping
[INFO] META-INF/NOTICE already added, skipping
[INFO] Building jar: <https://builds.apache.org/job/CXF-2.4-deploy/ws/cxf-2.4.x-fixes/rt/ws/addr/target/cxf-rt-ws-addr-2.4.7-SNAPSHOT-sources.jar>
[INFO] org already added, skipping
[INFO] org/apache already added, skipping
[INFO] org/apache/cxf already added, skipping
[INFO] org/apache/cxf/ws already added, skipping
[INFO] org/apache/cxf/ws/addressing already added, skipping
[INFO] org/apache/cxf/ws/addressing/spring already added, skipping
[INFO] org/apache/cxf/ws/addressing/blueprint already added, skipping
[INFO] org/apache/cxf/ws/addressing/policy already added, skipping
[INFO] org/apache/cxf/ws/addressing/soap already added, skipping
[INFO] org/apache/cxf/ws/addressing/Messages.properties already added, skipping
[INFO] org/apache/cxf/ws/addressing/policy/Messages.properties already added, skipping
[INFO] org/apache/cxf/ws/addressing/soap/Messages.properties already added, skipping
[INFO] META-INF already added, skipping
[INFO] META-INF already added, skipping
[INFO] META-INF/cxf already added, skipping
[INFO] META-INF already added, skipping
[INFO] META-INF/LICENSE already added, skipping
[INFO] META-INF/DEPENDENCIES already added, skipping
[INFO] META-INF/NOTICE already added, skipping
[INFO] [javadoc:jar {execution: attach-javadocs}]
[INFO] 
17 warnings
[WARNING] Javadoc Warnings
[WARNING] <https://builds.apache.org/job/CXF-2.4-deploy/ws/cxf-2.4.x-fixes/rt/ws/addr/src/main/java/org/apache/cxf/ws/addressing/AddressingPropertiesImpl.java>:79:
warning - @param argument "iri" is not a parameter name.
[WARNING] <https://builds.apache.org/job/CXF-2.4-deploy/ws/cxf-2.4.x-fixes/rt/ws/addr/src/main/java/org/apache/cxf/ws/addressing/AddressingPropertiesImpl.java>:86:
warning - @param argument "iri" is not a parameter name.
[WARNING] <https://builds.apache.org/job/CXF-2.4-deploy/ws/cxf-2.4.x-fixes/rt/ws/addr/src/main/java/org/apache/cxf/ws/addressing/AddressingPropertiesImpl.java>:201:
warning - @return tag cannot be used in method with void return type.
[WARNING] <https://builds.apache.org/job/CXF-2.4-deploy/ws/cxf-2.4.x-fixes/rt/ws/addr/src/main/java/org/apache/cxf/ws/addressing/ContextUtils.java>:210:
warning - @param argument "handler" is not a parameter name.
[WARNING] <https://builds.apache.org/job/CXF-2.4-deploy/ws/cxf-2.4.x-fixes/rt/ws/addr/src/main/java/org/apache/cxf/ws/addressing/ContextUtils.java>:228:
warning - @param argument "handler" is not a parameter name.
[WARNING] <https://builds.apache.org/job/CXF-2.4-deploy/ws/cxf-2.4.x-fixes/rt/ws/addr/src/main/java/org/apache/cxf/ws/addressing/ContextUtils.java>:356:
warning - @param argument "ref" is not a parameter name.
[WARNING] <https://builds.apache.org/job/CXF-2.4-deploy/ws/cxf-2.4.x-fixes/rt/ws/addr/src/main/java/org/apache/cxf/ws/addressing/ContextUtils.java>:612:
warning - @returned is an unknown tag.
[WARNING] <https://builds.apache.org/job/CXF-2.4-deploy/ws/cxf-2.4.x-fixes/rt/ws/addr/src/main/java/org/apache/cxf/ws/addressing/ContextUtils.java>:633:
warning - @returned is an unknown tag.
[WARNING] <https://builds.apache.org/job/CXF-2.4-deploy/ws/cxf-2.4.x-fixes/rt/ws/addr/src/main/java/org/apache/cxf/ws/addressing/ContextUtils.java>:657:
warning - @returned is an unknown tag.
[WARNING] <https://builds.apache.org/job/CXF-2.4-deploy/ws/cxf-2.4.x-fixes/rt/ws/addr/src/main/java/org/apache/cxf/ws/addressing/ContextUtils.java>:681:
warning - @returned is an unknown tag.
[WARNING] <https://builds.apache.org/job/CXF-2.4-deploy/ws/cxf-2.4.x-fixes/rt/ws/addr/src/main/java/org/apache/cxf/ws/addressing/ContextUtils.java>:707:
warning - @returned is an unknown tag.
[WARNING] <https://builds.apache.org/job/CXF-2.4-deploy/ws/cxf-2.4.x-fixes/rt/ws/addr/src/main/java/org/apache/cxf/ws/addressing/ContextUtils.java>:722:
warning - @returned is an unknown tag.
[WARNING] <https://builds.apache.org/job/CXF-2.4-deploy/ws/cxf-2.4.x-fixes/rt/ws/addr/src/main/java/org/apache/cxf/ws/addressing/ContextUtils.java>:939:
warning - @param argument "message" is not a parameter name.
[WARNING] <https://builds.apache.org/job/CXF-2.4-deploy/ws/cxf-2.4.x-fixes/rt/ws/addr/src/main/java/org/apache/cxf/ws/addressing/soap/MAPCodec.java>:487:
warning - @param argument "the" is not a parameter name.
[WARNING] <https://builds.apache.org/job/CXF-2.4-deploy/ws/cxf-2.4.x-fixes/rt/ws/addr/src/main/java/org/apache/cxf/ws/addressing/soap/MAPCodec.java>:635:
warning - @param argument "marshaller" is not a parameter name.
[WARNING] <https://builds.apache.org/job/CXF-2.4-deploy/ws/cxf-2.4.x-fixes/rt/ws/addr/src/main/java/org/apache/cxf/ws/addressing/soap/MAPCodec.java>:714:
warning - @param argument "marshaller" is not a parameter name.
[WARNING] <https://builds.apache.org/job/CXF-2.4-deploy/ws/cxf-2.4.x-fixes/rt/ws/addr/src/main/java/org/apache/cxf/ws/addressing/soap/VersionTransformer.java>:125:
warning - @param argument "marshaller" is not a parameter name.
[INFO] Building jar: <https://builds.apache.org/job/CXF-2.4-deploy/ws/cxf-2.4.x-fixes/rt/ws/addr/target/cxf-rt-ws-addr-2.4.7-SNAPSHOT-javadoc.jar>
[INFO] [install:install {execution: default-install}]
[INFO] Installing <https://builds.apache.org/job/CXF-2.4-deploy/ws/cxf-2.4.x-fixes/rt/ws/addr/target/cxf-rt-ws-addr-2.4.7-SNAPSHOT.jar>
to <https://builds.apache.org/job/CXF-2.4-deploy/ws/.repository/org/apache/cxf/cxf-rt-ws-addr/2.4.7-SNAPSHOT/cxf-rt-ws-addr-2.4.7-SNAPSHOT.jar>
[INFO] Installing <https://builds.apache.org/job/CXF-2.4-deploy/ws/cxf-2.4.x-fixes/rt/ws/addr/target/cxf-rt-ws-addr-2.4.7-SNAPSHOT-sources.jar>
to <https://builds.apache.org/job/CXF-2.4-deploy/ws/.repository/org/apache/cxf/cxf-rt-ws-addr/2.4.7-SNAPSHOT/cxf-rt-ws-addr-2.4.7-SNAPSHOT-sources.jar>
[INFO] Installing <https://builds.apache.org/job/CXF-2.4-deploy/ws/cxf-2.4.x-fixes/rt/ws/addr/target/cxf-rt-ws-addr-2.4.7-SNAPSHOT-javadoc.jar>
to <https://builds.apache.org/job/CXF-2.4-deploy/ws/.repository/org/apache/cxf/cxf-rt-ws-addr/2.4.7-SNAPSHOT/cxf-rt-ws-addr-2.4.7-SNAPSHOT-javadoc.jar>
[INFO] [deploy:deploy {execution: default-deploy}]
[INFO] Retrieving previous build number from apache.snapshots.https
Uploading: https://repository.apache.org/content/repositories/snapshots/org/apache/cxf/cxf-rt-ws-addr/2.4.7-SNAPSHOT/cxf-rt-ws-addr-2.4.7-20120206.061748-9.jar
85K uploaded  (cxf-rt-ws-addr-2.4.7-20120206.061748-9.jar)
[INFO] Retrieving previous metadata from apache.snapshots.https
[INFO] Uploading repository metadata for: 'snapshot org.apache.cxf:cxf-rt-ws-addr:2.4.7-SNAPSHOT'
[INFO] Uploading project information for cxf-rt-ws-addr 2.4.7-20120206.061748-9
[INFO] Retrieving previous metadata from apache.snapshots.https
[INFO] Uploading repository metadata for: 'artifact org.apache.cxf:cxf-rt-ws-addr'
[INFO] Retrieving previous build number from apache.snapshots.https
Uploading: https://repository.apache.org/content/repositories/snapshots/org/apache/cxf/cxf-rt-ws-addr/2.4.7-SNAPSHOT/cxf-rt-ws-addr-2.4.7-20120206.061748-9-sources.jar
66K uploaded  (cxf-rt-ws-addr-2.4.7-20120206.061748-9-sources.jar)
[INFO] Retrieving previous build number from apache.snapshots.https
Uploading: https://repository.apache.org/content/repositories/snapshots/org/apache/cxf/cxf-rt-ws-addr/2.4.7-SNAPSHOT/cxf-rt-ws-addr-2.4.7-20120206.061748-9-javadoc.jar
190K uploaded  (cxf-rt-ws-addr-2.4.7-20120206.061748-9-javadoc.jar)
[JENKINS] Archiving <https://builds.apache.org/job/CXF-2.4-deploy/ws/cxf-2.4.x-fixes/rt/ws/addr/pom.xml>
to /home/hudson/hudson/jobs/CXF-2.4-deploy/modules/org.apache.cxf$cxf-rt-ws-addr/builds/2012-02-06_06-16-51/archive/org.apache.cxf/cxf-rt-ws-addr/2.4.7-SNAPSHOT/cxf-rt-ws-addr-2.4.7-SNAPSHOT.pom
[JENKINS] Archiving <https://builds.apache.org/job/CXF-2.4-deploy/ws/cxf-2.4.x-fixes/rt/ws/addr/target/cxf-rt-ws-addr-2.4.7-SNAPSHOT.jar>
to /home/hudson/hudson/jobs/CXF-2.4-deploy/modules/org.apache.cxf$cxf-rt-ws-addr/builds/2012-02-06_06-16-51/archive/org.apache.cxf/cxf-rt-ws-addr/2.4.7-20120206.061748-9/cxf-rt-ws-addr-2.4.7-20120206.061748-9.jar
[JENKINS] Archiving <https://builds.apache.org/job/CXF-2.4-deploy/ws/cxf-2.4.x-fixes/rt/ws/addr/target/cxf-rt-ws-addr-2.4.7-SNAPSHOT-sources.jar>
to /home/hudson/hudson/jobs/CXF-2.4-deploy/modules/org.apache.cxf$cxf-rt-ws-addr/builds/2012-02-06_06-16-51/archive/org.apache.cxf/cxf-rt-ws-addr/2.4.7-20120206.061748-9/cxf-rt-ws-addr-2.4.7-20120206.061748-9-sources.jar
[JENKINS] Archiving <https://builds.apache.org/job/CXF-2.4-deploy/ws/cxf-2.4.x-fixes/rt/ws/addr/target/cxf-rt-ws-addr-2.4.7-SNAPSHOT-javadoc.jar>
to /home/hudson/hudson/jobs/CXF-2.4-deploy/modules/org.apache.cxf$cxf-rt-ws-addr/builds/2012-02-06_06-16-51/archive/org.apache.cxf/cxf-rt-ws-addr/2.4.7-20120206.061748-9/cxf-rt-ws-addr-2.4.7-20120206.061748-9-javadoc.jar
[INFO] ------------------------------------------------------------------------
[INFO] Building Apache CXF Runtime JAX-WS Frontend
[INFO]    task-segment: [clean, deploy]
[INFO] ------------------------------------------------------------------------
[INFO] [clean:clean {execution: default-clean}]
[INFO] Deleting <https://builds.apache.org/job/CXF-2.4-deploy/ws/cxf-2.4.x-fixes/rt/frontend/jaxws/target>
[INFO] [cxf-xml2fastinfoset:xml2fastinfoset {execution: xml2fastinfoset}]
[INFO] [build-helper:add-source {execution: add-source}]
[INFO] Source directory: <https://builds.apache.org/job/CXF-2.4-deploy/ws/cxf-2.4.x-fixes/rt/frontend/jaxws/src/main/generated>
added.
[INFO] [build-helper:add-source {execution: add-jaxws22-source}]
[INFO] Source directory: <https://builds.apache.org/job/CXF-2.4-deploy/ws/cxf-2.4.x-fixes/rt/frontend/jaxws/src/main/jaxws22>
added.
[INFO] [remote-resources:process {execution: default}]
[INFO] [build-helper:add-resource {execution: add-spi}]
[debug] execute contextualize
[INFO] [resources:resources {execution: default-resources}]
[INFO] Using 'UTF-8' encoding to copy filtered resources.
[INFO] Copying 11 resources
[INFO] Copying 7 resources
[INFO] skip non existing resourceDirectory <https://builds.apache.org/job/CXF-2.4-deploy/ws/cxf-2.4.x-fixes/rt/frontend/jaxws/src/main/resources-filtered>
[INFO] Copying 1 resource
[INFO] Copying 3 resources
[INFO] Copying 1 resource
[INFO] [compiler:compile {execution: default-compile}]
[INFO] Compiling 148 source files to <https://builds.apache.org/job/CXF-2.4-deploy/ws/cxf-2.4.x-fixes/rt/frontend/jaxws/target/classes>
[INFO] -------------------------------------------------------------
[ERROR] COMPILATION ERROR : 
[INFO] -------------------------------------------------------------
[ERROR] <https://builds.apache.org/job/CXF-2.4-deploy/ws/cxf-2.4.x-fixes/rt/frontend/jaxws/src/main/java/org/apache/cxf/jaxws/EndpointImpl.java>:[54,34]
cannot find symbol
symbol  : class SystemPropertyAction
location: package org.apache.cxf.common.util
[ERROR] <https://builds.apache.org/job/CXF-2.4-deploy/ws/cxf-2.4.x-fixes/rt/frontend/jaxws/src/main/java/org/apache/cxf/jaxws/EndpointImpl.java>:[494,22]
cannot find symbol
symbol  : variable SystemPropertyAction
location: class org.apache.cxf.jaxws.EndpointImpl
[INFO] 2 errors 
[INFO] -------------------------------------------------------------
[JENKINS] Archiving <https://builds.apache.org/job/CXF-2.4-deploy/ws/cxf-2.4.x-fixes/rt/frontend/jaxws/pom.xml>
to /home/hudson/hudson/jobs/CXF-2.4-deploy/modules/org.apache.cxf$cxf-rt-frontend-jaxws/builds/2012-02-06_06-16-51/archive/org.apache.cxf/cxf-rt-frontend-jaxws/2.4.7-SNAPSHOT/cxf-rt-frontend-jaxws-2.4.7-SNAPSHOT.pom
[INFO] ------------------------------------------------------------------------
[ERROR] BUILD FAILURE
[INFO] ------------------------------------------------------------------------
[INFO] Compilation failure

<https://builds.apache.org/job/CXF-2.4-deploy/ws/cxf-2.4.x-fixes/rt/frontend/jaxws/src/main/java/org/apache/cxf/jaxws/EndpointImpl.java>:[54,34]
cannot find symbol
symbol  : class SystemPropertyAction
location: package org.apache.cxf.common.util
<https://builds.apache.org/job/CXF-2.4-deploy/ws/cxf-2.4.x-fixes/rt/frontend/jaxws/src/main/java/org/apache/cxf/jaxws/EndpointImpl.java>:[494,22]
cannot find symbol
symbol  : variable SystemPropertyAction
location: class org.apache.cxf.jaxws.EndpointImpl

[INFO] ------------------------------------------------------------------------
[INFO] Trace
org.apache.maven.BuildFailureException: Compilation failure
	at org.apache.maven.lifecycle.DefaultLifecycleExecutor.executeGoals(DefaultLifecycleExecutor.java:715)
	at org.apache.maven.lifecycle.DefaultLifecycleExecutor.executeGoalWithLifecycle(DefaultLifecycleExecutor.java:556)
	at org.apache.maven.lifecycle.DefaultLifecycleExecutor.executeGoal(DefaultLifecycleExecutor.java:535)
	at org.apache.maven.lifecycle.DefaultLifecycleExecutor.executeGoalAndHandleFailures(DefaultLifecycleExecutor.java:387)
	at org.apache.maven.lifecycle.DefaultLifecycleExecutor.executeTaskSegments(DefaultLifecycleExecutor.java:348)
	at org.apache.maven.lifecycle.DefaultLifecycleExecutor.execute(DefaultLifecycleExecutor.java:180)
	at org.apache.maven.lifecycle.LifecycleExecutorInterceptor.execute(LifecycleExecutorInterceptor.java:65)
	at org.apache.maven.DefaultMaven.doExecute(DefaultMaven.java:328)
	at org.apache.maven.DefaultMaven.execute(DefaultMaven.java:138)
	at org.apache.maven.cli.MavenCli.main(MavenCli.java:362)
	at sun.reflect.NativeMethodAccessorImpl.invoke0(Native Method)
	at sun.reflect.NativeMethodAccessorImpl.invoke(NativeMethodAccessorImpl.java:39)
	at sun.reflect.DelegatingMethodAccessorImpl.invoke(DelegatingMethodAccessorImpl.java:25)
	at java.lang.reflect.Method.invoke(Method.java:592)
	at org.codehaus.classworlds.Launcher.launchEnhanced(Launcher.java:315)
	at org.codehaus.classworlds.Launcher.launch(Launcher.java:255)
	at hudson.maven.agent.Main.launch(Main.java:185)
	at hudson.maven.MavenBuilder.call(MavenBuilder.java:151)
	at hudson.maven.Maven2Builder.call(Maven2Builder.java:77)
	at hudson.maven.Maven2Builder.call(Maven2Builder.java:53)
	at hudson.remoting.UserRequest.perform(UserRequest.java:118)
	at hudson.remoting.UserRequest.perform(UserRequest.java:48)
	at hudson.remoting.Request$2.run(Request.java:287)
	at java.util.concurrent.Executors$RunnableAdapter.call(Executors.java:417)
	at java.util.concurrent.FutureTask$Sync.innerRun(FutureTask.java:269)
	at java.util.concurrent.FutureTask.run(FutureTask.java:123)
	at java.util.concurrent.ThreadPoolExecutor$Worker.runTask(ThreadPoolExecutor.java:651)
	at java.util.concurrent.ThreadPoolExecutor$Worker.run(ThreadPoolExecutor.java:676)
	at java.lang.Thread.run(Thread.java:595)
Caused by: org.apache.maven.plugin.CompilationFailureException: Compilation failure
	at org.apache.maven.plugin.AbstractCompilerMojo.execute(AbstractCompilerMojo.java:656)
	at org.apache.maven.plugin.CompilerMojo.execute(CompilerMojo.java:128)
	at org.apache.maven.plugin.DefaultPluginManager.executeMojo(DefaultPluginManager.java:490)
	at hudson.maven.agent.PluginManagerInterceptor.executeMojo(PluginManagerInterceptor.java:182)
	at org.apache.maven.lifecycle.DefaultLifecycleExecutor.executeGoals(DefaultLifecycleExecutor.java:694)
	... 28 more
[INFO] ------------------------------------------------------------------------
[INFO] Total time: 29 minutes 27 seconds
[INFO] Finished at: Mon Feb 06 06:46:48 UTC 2012
[INFO] Final Memory: 140M/214M
[INFO] ------------------------------------------------------------------------
channel stopped
[locks-and-latches] Releasing all the locks
[locks-and-latches] All the locks released


Mime
View raw message