cxf-notifications mailing list archives

Site index · List index
Message view « Date » · « Thread »
Top « Date » · « Thread »
From Apache Jenkins Server <jenk...@builds.apache.org>
Subject Build failed in Jenkins: CXF-2.5-deploy #58
Date Tue, 03 Apr 2012 09:16:30 GMT
See <https://builds.apache.org/job/CXF-2.5-deploy/58/changes>

Changes:

[ay] CXF-4218 2.5.x workaround to avoid jmx exception

[ay] Blocking revisions 1307604,1307609 via  svn from
https://svn.apache.org/repos/asf/cxf/trunk

........
  r1307604 | ay | 2012-03-30 22:50:22 +0200 (Fri, 30 Mar 2012) | 1 line
  
  [CXF-4218] Change RMEndpoint and RMStore so that the sequences are recovered and monitored
correctly
........
........
  r1307609 | ay | 2012-03-30 22:58:41 +0200 (Fri, 30 Mar 2012) | 1 line
  
  [CXF-4218] forgot to take the new systests/ws-rm
........

[ay] Blocking revisions 1305836 via  svn from
https://svn.apache.org/repos/asf/cxf/trunk

........
  r1305836 | ay | 2012-03-27 15:42:47 +0200 (Tue, 27 Mar 2012) | 1 line
  
  unifying the retry interface for CXF-4209
........

------------------------------------------
[...truncated 32504 lines...]
[INFO] Compiling 17 source files to <https://builds.apache.org/job/CXF-2.5-deploy/ws/cxf-2.5.x-fixes/distribution/src/main/release/samples/corba/hello_world/target/classes>
[INFO] [resources:testResources {execution: default-testResources}]
[INFO] Using 'UTF-8' encoding to copy filtered resources.
[INFO] skip non existing resourceDirectory <https://builds.apache.org/job/CXF-2.5-deploy/ws/cxf-2.5.x-fixes/distribution/src/main/release/samples/corba/hello_world/src/test/resources>
[INFO] [compiler:testCompile {execution: default-testCompile}]
[INFO] No sources to compile
[INFO] [surefire:test {execution: default-test}]
[INFO] Tests are skipped.
[INFO] [jar:jar {execution: default-jar}]
[INFO] Building jar: <https://builds.apache.org/job/CXF-2.5-deploy/ws/cxf-2.5.x-fixes/distribution/src/main/release/samples/corba/hello_world/target/corba-hello-world-2.5.3-SNAPSHOT.jar>
[INFO] [install:install {execution: default-install}]
[INFO] Installing <https://builds.apache.org/job/CXF-2.5-deploy/ws/cxf-2.5.x-fixes/distribution/src/main/release/samples/corba/hello_world/target/corba-hello-world-2.5.3-SNAPSHOT.jar>
to <https://builds.apache.org/job/CXF-2.5-deploy/ws/.repository/org/apache/cxf/samples/corba-hello-world/2.5.3-SNAPSHOT/corba-hello-world-2.5.3-SNAPSHOT.jar>
[INFO] [deploy:deploy {execution: default-deploy}]
[INFO]  skipping artifact deployement 
[JENKINS] Archiving <https://builds.apache.org/job/CXF-2.5-deploy/ws/cxf-2.5.x-fixes/distribution/src/main/release/samples/corba/hello_world/pom.xml>
to /home/hudson/hudson/jobs/CXF-2.5-deploy/modules/org.apache.cxf.samples$corba-hello-world/builds/2012-04-03_08-01-28/archive/org.apache.cxf.samples/corba-hello-world/2.5.3-SNAPSHOT/corba-hello-world-2.5.3-SNAPSHOT.pom
[JENKINS] Archiving <https://builds.apache.org/job/CXF-2.5-deploy/ws/cxf-2.5.x-fixes/distribution/src/main/release/samples/corba/hello_world/target/corba-hello-world-2.5.3-SNAPSHOT.jar>
to /home/hudson/hudson/jobs/CXF-2.5-deploy/modules/org.apache.cxf.samples$corba-hello-world/builds/2012-04-03_08-01-28/archive/org.apache.cxf.samples/corba-hello-world/2.5.3-SNAPSHOT/corba-hello-world-2.5.3-SNAPSHOT.jar
[INFO] ------------------------------------------------------------------------
[INFO] Building Apache CXF Distribution
[INFO]    task-segment: [clean, deploy]
[INFO] ------------------------------------------------------------------------
Downloading: http://repo1.maven.org/maven2/org/apache/maven/plugins/maven-assembly-plugin/2.3/maven-assembly-plugin-2.3.pom

Downloading: http://repo1.maven.org/maven2/org/apache/maven/plugins/maven-assembly-plugin/2.3/maven-assembly-plugin-2.3.jar

Downloading: http://repo1.maven.org/maven2/org/apache/maven/plugins/maven-checkstyle-plugin/2.9.1/maven-checkstyle-plugin-2.9.1.pom

Downloading: http://repo1.maven.org/maven2/org/apache/maven/plugins/maven-checkstyle-plugin/2.9.1/maven-checkstyle-plugin-2.9.1.jar

[INFO] [clean:clean {execution: default-clean}]
Downloading: http://repo1.maven.org/maven2/org/apache/maven/reporting/maven-reporting-impl/2.2/maven-reporting-impl-2.2.pom

Downloading: http://repo1.maven.org/maven2/commons-validator/commons-validator/1.3.1/commons-validator-1.3.1.pom

Downloading: http://repo1.maven.org/maven2/org/apache/maven/doxia/doxia-sink-api/1.1.3/doxia-sink-api-1.1.3.pom

Downloading: http://repo1.maven.org/maven2/org/apache/maven/doxia/doxia/1.1.3/doxia-1.1.3.pom

Downloading: http://repo1.maven.org/maven2/org/apache/maven/doxia/doxia-logging-api/1.1.3/doxia-logging-api-1.1.3.pom

Downloading: http://repo1.maven.org/maven2/org/apache/maven/doxia/doxia-decoration-model/1.1.3/doxia-decoration-model-1.1.3.pom

Downloading: http://repo1.maven.org/maven2/org/apache/maven/doxia/doxia-sitetools/1.1.3/doxia-sitetools-1.1.3.pom

Downloading: http://repo1.maven.org/maven2/org/apache/maven/doxia/doxia-site-renderer/1.1.3/doxia-site-renderer-1.1.3.pom

Downloading: http://repo1.maven.org/maven2/org/apache/maven/doxia/doxia-core/1.1.3/doxia-core-1.1.3.pom

Downloading: http://repo1.maven.org/maven2/org/apache/maven/doxia/doxia-module-xhtml/1.1.3/doxia-module-xhtml-1.1.3.pom

Downloading: http://repo1.maven.org/maven2/org/apache/maven/doxia/doxia-modules/1.1.3/doxia-modules-1.1.3.pom

Downloading: http://repo1.maven.org/maven2/org/apache/maven/doxia/doxia-module-fml/1.1.3/doxia-module-fml-1.1.3.pom

Downloading: http://repo1.maven.org/maven2/org/apache/maven/shared/maven-doxia-tools/1.2.1/maven-doxia-tools-1.2.1.pom

Downloading: http://repo1.maven.org/maven2/org/codehaus/plexus/plexus-resources/1.0-alpha-7/plexus-resources-1.0-alpha-7.pom

Downloading: http://repo1.maven.org/maven2/com/puppycrawl/tools/checkstyle/5.5/checkstyle-5.5.pom

Downloading: http://repo1.maven.org/maven2/commons-beanutils/commons-beanutils-core/1.8.3/commons-beanutils-core-1.8.3.pom

Downloading: http://repo1.maven.org/maven2/com/google/collections/google-collections/1.0/google-collections-1.0.pom

Downloading: http://repo1.maven.org/maven2/com/puppycrawl/tools/checkstyle/5.5/checkstyle-5.5.jar
Downloading: http://repo1.maven.org/maven2/org/apache/maven/reporting/maven-reporting-impl/2.2/maven-reporting-impl-2.2.jar
Downloading: http://repo1.maven.org/maven2/com/google/collections/google-collections/1.0/google-collections-1.0.jar
Downloading: http://repo1.maven.org/maven2/org/apache/maven/shared/maven-doxia-tools/1.2.1/maven-doxia-tools-1.2.1.jar
Downloading: http://repo1.maven.org/maven2/commons-validator/commons-validator/1.3.1/commons-validator-1.3.1.jar




Downloading: http://repo1.maven.org/maven2/org/apache/maven/doxia/doxia-site-renderer/1.1.3/doxia-site-renderer-1.1.3.jar

Downloading: http://repo1.maven.org/maven2/commons-beanutils/commons-beanutils-core/1.8.3/commons-beanutils-core-1.8.3.jar
Downloading: http://repo1.maven.org/maven2/org/codehaus/plexus/plexus-resources/1.0-alpha-7/plexus-resources-1.0-alpha-7.jar



Downloading: http://repo1.maven.org/maven2/org/apache/maven/doxia/doxia-decoration-model/1.1.3/doxia-decoration-model-1.1.3.jar

Downloading: http://repo1.maven.org/maven2/org/apache/maven/doxia/doxia-module-xhtml/1.1.3/doxia-module-xhtml-1.1.3.jar

Downloading: http://repo1.maven.org/maven2/org/apache/maven/doxia/doxia-module-fml/1.1.3/doxia-module-fml-1.1.3.jar

[INFO] [checkstyle:checkstyle {execution: validate}]
[INFO] [cxf-xml2fastinfoset:xml2fastinfoset {execution: xml2fastinfoset}]
[INFO] [dependency:copy {execution: add-jars}]
[INFO] Configured Artifact: org.apache.cxf:cxf-integration-jca:2.5.3-SNAPSHOT:jar
[INFO] snapshot org.apache.cxf:cxf-integration-jca:2.5.3-SNAPSHOT: checking for updates from
apache.snapshots
[INFO] Configured Artifact: javax.xml.bind:jaxb-api:2.2.3:jar
[INFO] Configured Artifact: org.apache.geronimo.specs:geronimo-jaxws_2.2_spec:1.1:jar
[INFO] Copying cxf-integration-jca-2.5.3-SNAPSHOT.jar to <https://builds.apache.org/job/CXF-2.5-deploy/ws/cxf-2.5.x-fixes/distribution/target/additional-libs/cxf-integration-jca-2.5.3-20120403.080549-42.jar>
[INFO] Copying jaxb-api-2.2.3.jar to <https://builds.apache.org/job/CXF-2.5-deploy/ws/cxf-2.5.x-fixes/distribution/target/libs/endorsed/jaxb-api-2.2.3.jar>
[INFO] Copying geronimo-jaxws_2.2_spec-1.1.jar to <https://builds.apache.org/job/CXF-2.5-deploy/ws/cxf-2.5.x-fixes/distribution/target/libs/endorsed/geronimo-jaxws_2.2_spec-1.1.jar>
[WARNING] DEPRECATED [tasks]: Use target instead
[INFO] [antrun:run {execution: process-sources-xsl}]
[WARNING] Parameter tasks is deprecated, use target instead
[INFO] Executing tasks

main:
[INFO] Executed tasks
[INFO] [remote-resources:process {execution: default}]
Apr 3, 2012 9:06:32 AM org.apache.velocity.runtime.log.JdkLogChute log
INFO: FileResourceLoader : adding path '.'
[INFO] [site:attach-descriptor {execution: default-attach-descriptor}]
[INFO] [source:jar-no-fork {execution: attach-sources}]
[INFO] [javadoc:jar {execution: attach-javadocs}]
[INFO] Not executing Javadoc as the project is not a Java classpath-capable package
[INFO] [dependency:unpack {execution: unpack-javadoc}]
[INFO] Configured Artifact: org.apache.cxf:cxf-api:javadoc:2.5.3-SNAPSHOT:jar
[INFO] Unpacking <https://builds.apache.org/job/CXF-2.5-deploy/ws/.repository/org/apache/cxf/cxf-api/2.5.3-SNAPSHOT/cxf-api-2.5.3-SNAPSHOT-javadoc.jar>
to <https://builds.apache.org/job/CXF-2.5-deploy/ws/cxf-2.5.x-fixes/distribution/target/javadoc>
with includes "" and excludes ""
Downloading: http://repo1.maven.org/maven2/org/slf4j/slf4j-api/1.5.3/slf4j-api-1.5.3.pom

Downloading: http://repo1.maven.org/maven2/commons-httpclient/commons-httpclient/3.0/commons-httpclient-3.0.pom

Downloading: http://repo1.maven.org/maven2/org/slf4j/slf4j-jdk14/1.5.6/slf4j-jdk14-1.5.6.pom

Downloading: http://repo1.maven.org/maven2/org/slf4j/slf4j-api/1.5.6/slf4j-api-1.5.6.pom

Downloading: http://repo1.maven.org/maven2/org/apache/maven/shared/maven-common-artifact-filters/1.4/maven-common-artifact-filters-1.4.pom

Downloading: http://repo1.maven.org/maven2/org/codehaus/plexus/plexus-container-default/1.5.5/plexus-container-default-1.5.5.pom

Downloading: http://repo1.maven.org/maven2/org/apache/maven/shared/maven-repository-builder/1.0-alpha-2/maven-repository-builder-1.0-alpha-2.pom

Downloading: http://repo1.maven.org/maven2/org/apache/maven/maven-artifact/2.0.4/maven-artifact-2.0.4.pom

Downloading: http://repo1.maven.org/maven2/org/apache/maven/maven-artifact-manager/2.0.4/maven-artifact-manager-2.0.4.pom

Downloading: http://repo1.maven.org/maven2/org/apache/maven/shared/maven-common-artifact-filters/1.0-alpha-1/maven-common-artifact-filters-1.0-alpha-1.pom

Downloading: http://repo1.maven.org/maven2/org/apache/maven/shared/maven-shared-components/6/maven-shared-components-6.pom

Downloading: http://repo1.maven.org/maven2/org/apache/maven/shared/maven-common-artifact-filters/1.4/maven-common-artifact-filters-1.4.jar

Downloading: http://repo1.maven.org/maven2/org/apache/maven/shared/maven-repository-builder/1.0-alpha-2/maven-repository-builder-1.0-alpha-2.jar

[INFO] [assembly:single {execution: distribution-package-bin}]
[INFO] Reading assembly descriptor: src/main/assembly/bin.xml
[WARNING] Cannot include project artifact: org.apache.cxf:apache-cxf:pom:2.5.3-SNAPSHOT; it
doesn't have an associated file or directory.
[WARNING] Cannot include project artifact: org.apache.cxf:apache-cxf:pom:2.5.3-SNAPSHOT; it
doesn't have an associated file or directory.
[WARNING] Cannot include project artifact: org.apache.cxf:apache-cxf:pom:2.5.3-SNAPSHOT; it
doesn't have an associated file or directory.
[INFO] Copying files to <https://builds.apache.org/job/CXF-2.5-deploy/ws/cxf-2.5.x-fixes/distribution/target/apache-cxf-2.5.3-SNAPSHOT>
[WARNING] Assembly file: <https://builds.apache.org/job/CXF-2.5-deploy/ws/cxf-2.5.x-fixes/distribution/target/apache-cxf-2.5.3-SNAPSHOT>
is not a regular file (it may be a directory). It cannot be attached to the project build
for installation or deployment.
[WARNING] Cannot include project artifact: org.apache.cxf:apache-cxf:pom:2.5.3-SNAPSHOT; it
doesn't have an associated file or directory.
[WARNING] Cannot include project artifact: org.apache.cxf:apache-cxf:pom:2.5.3-SNAPSHOT; it
doesn't have an associated file or directory.
[WARNING] Cannot include project artifact: org.apache.cxf:apache-cxf:pom:2.5.3-SNAPSHOT; it
doesn't have an associated file or directory.
[INFO] Building tar: <https://builds.apache.org/job/CXF-2.5-deploy/ws/cxf-2.5.x-fixes/distribution/target/apache-cxf-2.5.3-SNAPSHOT.tar.gz>
[WARNING] Cannot include project artifact: org.apache.cxf:apache-cxf:pom:2.5.3-SNAPSHOT; it
doesn't have an associated file or directory.
[WARNING] Cannot include project artifact: org.apache.cxf:apache-cxf:pom:2.5.3-SNAPSHOT; it
doesn't have an associated file or directory.
[WARNING] Cannot include project artifact: org.apache.cxf:apache-cxf:pom:2.5.3-SNAPSHOT; it
doesn't have an associated file or directory.
[INFO] Building zip: <https://builds.apache.org/job/CXF-2.5-deploy/ws/cxf-2.5.x-fixes/distribution/target/apache-cxf-2.5.3-SNAPSHOT.zip>
[INFO] [assembly:single {execution: distribution-package-src}]
[INFO] Reading assembly descriptor: src/main/assembly/src.xml
[INFO] Building tar: <https://builds.apache.org/job/CXF-2.5-deploy/ws/cxf-2.5.x-fixes/distribution/target/apache-cxf-2.5.3-SNAPSHOT-src.tar.gz>
[INFO] Building zip: <https://builds.apache.org/job/CXF-2.5-deploy/ws/cxf-2.5.x-fixes/distribution/target/apache-cxf-2.5.3-SNAPSHOT-src.zip>
[INFO] [install:install {execution: default-install}]
[INFO] Installing <https://builds.apache.org/job/CXF-2.5-deploy/ws/cxf-2.5.x-fixes/distribution/pom.xml>
to <https://builds.apache.org/job/CXF-2.5-deploy/ws/.repository/org/apache/cxf/apache-cxf/2.5.3-SNAPSHOT/apache-cxf-2.5.3-SNAPSHOT.pom>
[INFO] Installing <https://builds.apache.org/job/CXF-2.5-deploy/ws/cxf-2.5.x-fixes/distribution/target/apache-cxf-2.5.3-SNAPSHOT.tar.gz>
to <https://builds.apache.org/job/CXF-2.5-deploy/ws/.repository/org/apache/cxf/apache-cxf/2.5.3-SNAPSHOT/apache-cxf-2.5.3-SNAPSHOT.tar.gz>
[INFO] Installing <https://builds.apache.org/job/CXF-2.5-deploy/ws/cxf-2.5.x-fixes/distribution/target/apache-cxf-2.5.3-SNAPSHOT.zip>
to <https://builds.apache.org/job/CXF-2.5-deploy/ws/.repository/org/apache/cxf/apache-cxf/2.5.3-SNAPSHOT/apache-cxf-2.5.3-SNAPSHOT.zip>
[INFO] Installing <https://builds.apache.org/job/CXF-2.5-deploy/ws/cxf-2.5.x-fixes/distribution/target/apache-cxf-2.5.3-SNAPSHOT-src.tar.gz>
to <https://builds.apache.org/job/CXF-2.5-deploy/ws/.repository/org/apache/cxf/apache-cxf/2.5.3-SNAPSHOT/apache-cxf-2.5.3-SNAPSHOT-src.tar.gz>
[INFO] Installing <https://builds.apache.org/job/CXF-2.5-deploy/ws/cxf-2.5.x-fixes/distribution/target/apache-cxf-2.5.3-SNAPSHOT-src.zip>
to <https://builds.apache.org/job/CXF-2.5-deploy/ws/.repository/org/apache/cxf/apache-cxf/2.5.3-SNAPSHOT/apache-cxf-2.5.3-SNAPSHOT-src.zip>
[INFO] [deploy:deploy {execution: default-deploy}]
[INFO] Retrieving previous build number from apache.snapshots.https
[WARNING] *** CHECKSUM FAILED - Checksum failed on download: local = 'ff697a94f81cc5b4f3b0ab4e46bcb781a527de09';
remote = '37275db1491091dc74dc18df4a7a4bb84c77f3c3' - RETRYING
[WARNING] *** CHECKSUM FAILED - Checksum failed on download: local = 'ff697a94f81cc5b4f3b0ab4e46bcb781a527de09';
remote = '37275db1491091dc74dc18df4a7a4bb84c77f3c3' - IGNORING
Uploading: https://repository.apache.org/content/repositories/snapshots/org/apache/cxf/apache-cxf/2.5.3-SNAPSHOT/apache-cxf-2.5.3-20120403.080549-37.pom
21K uploaded  (apache-cxf-2.5.3-20120403.080549-37.pom)
[INFO] Retrieving previous metadata from apache.snapshots.https
[WARNING] *** CHECKSUM FAILED - Checksum failed on download: local = 'ff697a94f81cc5b4f3b0ab4e46bcb781a527de09';
remote = '37275db1491091dc74dc18df4a7a4bb84c77f3c3' - RETRYING
[WARNING] *** CHECKSUM FAILED - Checksum failed on download: local = 'ff697a94f81cc5b4f3b0ab4e46bcb781a527de09';
remote = '37275db1491091dc74dc18df4a7a4bb84c77f3c3' - IGNORING
[INFO] Uploading repository metadata for: 'snapshot org.apache.cxf:apache-cxf:2.5.3-SNAPSHOT'
[INFO] Retrieving previous metadata from apache.snapshots.https
[INFO] Uploading repository metadata for: 'artifact org.apache.cxf:apache-cxf'
[INFO] Retrieving previous build number from apache.snapshots.https
Uploading: https://repository.apache.org/content/repositories/snapshots/org/apache/cxf/apache-cxf/2.5.3-SNAPSHOT/apache-cxf-2.5.3-20120403.080549-37.tar.gz
34053K uploaded  (apache-cxf-2.5.3-20120403.080549-37.tar.gz)
[INFO] Retrieving previous build number from apache.snapshots.https
Uploading: https://repository.apache.org/content/repositories/snapshots/org/apache/cxf/apache-cxf/2.5.3-SNAPSHOT/apache-cxf-2.5.3-20120403.080549-37.zip
35855K uploaded  (apache-cxf-2.5.3-20120403.080549-37.zip)
[INFO] Retrieving previous build number from apache.snapshots.https
Uploading: https://repository.apache.org/content/repositories/snapshots/org/apache/cxf/apache-cxf/2.5.3-SNAPSHOT/apache-cxf-2.5.3-20120403.080549-37-src.tar.gz
6279K uploaded  (apache-cxf-2.5.3-20120403.080549-37-src.tar.gz)
[INFO] Retrieving previous build number from apache.snapshots.https
Uploading: https://repository.apache.org/content/repositories/snapshots/org/apache/cxf/apache-cxf/2.5.3-SNAPSHOT/apache-cxf-2.5.3-20120403.080549-37-src.zip
14015K uploaded  (apache-cxf-2.5.3-20120403.080549-37-src.zip)
Apr 3, 2012 9:16:20 AM hudson.remoting.Channel$ReaderThread run
SEVERE: I/O error in channel channel
java.io.StreamCorruptedException
	at java.io.ObjectInputStream.readObject0(ObjectInputStream.java:1332)
	at java.io.ObjectInputStream.readObject(ObjectInputStream.java:348)
	at hudson.remoting.Channel$ReaderThread.run(Channel.java:1127)
channel stopped
[INFO] ------------------------------------------------------------------------
[ERROR] FATAL ERROR
[INFO] ------------------------------------------------------------------------
[INFO] null
[INFO] ------------------------------------------------------------------------
[INFO] Trace
java.lang.reflect.UndeclaredThrowableException
	at $Proxy2.isArchivingDisabled(Unknown Source)
	at hudson.maven.MavenBuildProxy$Filter.isArchivingDisabled(MavenBuildProxy.java:227)
	at hudson.maven.reporters.MavenArtifact.archive(MavenArtifact.java:223)
	at hudson.maven.reporters.MavenArtifactArchiver.postBuild(MavenArtifactArchiver.java:106)
	at hudson.maven.Maven2Builder.postModule(Maven2Builder.java:127)
	at hudson.maven.MavenBuilder$Adapter.fireLeaveModule(MavenBuilder.java:327)
	at hudson.maven.MavenBuilder$Adapter.postBuild(MavenBuilder.java:285)
	at org.apache.maven.lifecycle.LifecycleExecutorInterceptor.execute(LifecycleExecutorInterceptor.java:68)
	at org.apache.maven.DefaultMaven.doExecute(DefaultMaven.java:328)
	at org.apache.maven.DefaultMaven.execute(DefaultMaven.java:138)
	at org.apache.maven.cli.MavenCli.main(MavenCli.java:362)
	at sun.reflect.NativeMethodAccessorImpl.invoke0(Native Method)
	at sun.reflect.NativeMethodAccessorImpl.invoke(NativeMethodAccessorImpl.java:39)
	at sun.reflect.DelegatingMethodAccessorImpl.invoke(DelegatingMethodAccessorImpl.java:25)
	at java.lang.reflect.Method.invoke(Method.java:592)
	at org.codehaus.classworlds.Launcher.launchEnhanced(Launcher.java:315)
	at org.codehaus.classworlds.Launcher.launch(Launcher.java:255)
	at hudson.maven.agent.Main.launch(Main.java:185)
	at hudson.maven.MavenBuilder.call(MavenBuilder.java:151)
	at hudson.maven.Maven2Builder.call(Maven2Builder.java:77)
	at hudson.maven.Maven2Builder.call(Maven2Builder.java:53)
	at hudson.remoting.UserRequest.perform(UserRequest.java:118)
	at hudson.remoting.UserRequest.perform(UserRequest.java:48)
	at hudson.remoting.Request$2.run(Request.java:287)
	at hudson.remoting.InterceptingExecutorService$1.call(InterceptingExecutorService.java:72)
	at java.util.concurrent.FutureTask$Sync.innerRun(FutureTask.java:269)
	at java.util.concurrent.FutureTask.run(FutureTask.java:123)
	at java.util.concurrent.ThreadPoolExecutor$Worker.runTask(ThreadPoolExecutor.java:651)
	at java.util.concurrent.ThreadPoolExecutor$Worker.run(ThreadPoolExecutor.java:676)
	at java.lang.Thread.run(Thread.java:595)
Caused by: hudson.remoting.ChannelClosedException: channel is already closed
	at hudson.remoting.Channel.send(Channel.java:499)
	at hudson.remoting.Request.call(Request.java:110)
	at hudson.remoting.Channel.call(Channel.java:681)
	at hudson.remoting.RemoteInvocationHandler.invoke(RemoteInvocationHandler.java:158)
	... 30 more
Caused by: java.io.StreamCorruptedException
	at java.io.ObjectInputStream.readObject0(ObjectInputStream.java:1332)
	at java.io.ObjectInputStream.readObject(ObjectInputStream.java:348)
	at hudson.remoting.Channel$ReaderThread.run(Channel.java:1127)
[INFO] ------------------------------------------------------------------------
[INFO] Total time: 74 minutes 15 seconds
[INFO] Finished at: Tue Apr 03 09:16:20 UTC 2012
Sending e-mails to: notifications@cxf.apache.org
[locks-and-latches] Releasing all the locks
[locks-and-latches] All the locks released
ERROR: Maven JVM terminated unexpectedly with exit code 0


Mime
View raw message