cxf-notifications mailing list archives

Site index · List index
Message view « Date » · « Thread »
Top « Date » · « Thread »
From Apache Jenkins Server <jenk...@builds.apache.org>
Subject Build failed in Jenkins: CXF-2.5-deploy » Test for generating code from wsdl in repo #82
Date Sat, 05 May 2012 07:23:45 GMT
See <https://builds.apache.org/job/CXF-2.5-deploy/org.apache.cxf.systests.wsdl_maven$cxf-systests-codegen/82/>

------------------------------------------
[INFO] ------------------------------------------------------------------------
[INFO] Building Test for generating code from wsdl in repo
[INFO]    task-segment: [clean, install]
[INFO] ------------------------------------------------------------------------
[INFO] [clean:clean {execution: default-clean}]
[INFO] Deleting <https://builds.apache.org/job/CXF-2.5-deploy/org.apache.cxf.systests.wsdl_maven$cxf-systests-codegen/ws/target>
[INFO] [cxf-xml2fastinfoset:xml2fastinfoset {execution: xml2fastinfoset}]
[INFO] [cxf-codegen:wsdl2java {execution: generate-java-sources}]
[INFO] org.apache.cxf.systests.wsdl_maven:cxf-systests-java2ws:wsdl:2.5.4-SNAPSHOT:compile
resolved to /home/jenkins/jenkins-slave/workspace/CXF-2.5-deploy/cxf-2.5.x-fixes/systests/wsdl_maven/java2ws/target/generated/wsdl/HelloWorld.wsdl
[INFO] Resolved WSDL artifact to file /home/jenkins/jenkins-slave/workspace/CXF-2.5-deploy/cxf-2.5.x-fixes/systests/wsdl_maven/java2ws/target/generated/wsdl/HelloWorld.wsdl
[INFO] Running code generation in fork mode...
[INFO] Building jar: /tmp/cxf-tmp-154569/cxf-codegen1144038830806980760.jar
[WARNING] May 5, 2012 7:23:14 AM org.apache.cxf.tools.wsdlto.databinding.jaxb.JAXBDataBinding
checkEncoding
[WARNING] WARNING: Version 2.2.4 of JAXB XJC does not support setting an encoding.  Using
default file encoding of ANSI_X3.4-1968.
[INFO] [cxf-codegen:wsdl2js {execution: generate-js-sources}]
[INFO] org.apache.cxf.systests.wsdl_maven:cxf-systests-java2ws:wsdl:2.5.4-SNAPSHOT:compile
resolved to /home/jenkins/jenkins-slave/workspace/CXF-2.5-deploy/cxf-2.5.x-fixes/systests/wsdl_maven/java2ws/target/generated/wsdl/HelloWorld.wsdl
[INFO] Resolved WSDL artifact to file /home/jenkins/jenkins-slave/workspace/CXF-2.5-deploy/cxf-2.5.x-fixes/systests/wsdl_maven/java2ws/target/generated/wsdl/HelloWorld.wsdl
[INFO] Running code generation in fork mode...
[INFO] Building jar: /tmp/cxf-tmp-154569/cxf-codegen6064943288688809526.jar
[INFO] [remote-resources:process {execution: default}]
[debug] execute contextualize
[INFO] [resources:resources {execution: default-resources}]
[INFO] Using 'UTF-8' encoding to copy filtered resources.
[INFO] skip non existing resourceDirectory <https://builds.apache.org/job/CXF-2.5-deploy/org.apache.cxf.systests.wsdl_maven$cxf-systests-codegen/ws/src/main/java>
[INFO] Copying 1 resource
[INFO] skip non existing resourceDirectory <https://builds.apache.org/job/CXF-2.5-deploy/org.apache.cxf.systests.wsdl_maven$cxf-systests-codegen/ws/src/main/resources-filtered>
[INFO] skip non existing resourceDirectory <https://builds.apache.org/job/CXF-2.5-deploy/org.apache.cxf.systests.wsdl_maven$cxf-systests-codegen/ws/target/generated/src/main/resources>
[INFO] Copying 3 resources
[INFO] [compiler:compile {execution: default-compile}]
[INFO] Compiling 8 source files to <https://builds.apache.org/job/CXF-2.5-deploy/org.apache.cxf.systests.wsdl_maven$cxf-systests-codegen/ws/target/classes>
[debug] execute contextualize
[INFO] [resources:testResources {execution: default-testResources}]
[INFO] Using 'UTF-8' encoding to copy filtered resources.
[INFO] skip non existing resourceDirectory <https://builds.apache.org/job/CXF-2.5-deploy/org.apache.cxf.systests.wsdl_maven$cxf-systests-codegen/ws/src/test/java>
[INFO] skip non existing resourceDirectory <https://builds.apache.org/job/CXF-2.5-deploy/org.apache.cxf.systests.wsdl_maven$cxf-systests-codegen/ws/src/test/resources>
[INFO] skip non existing resourceDirectory <https://builds.apache.org/job/CXF-2.5-deploy/org.apache.cxf.systests.wsdl_maven$cxf-systests-codegen/ws/target/generated/src/test/resources>
[INFO] Copying 3 resources
[INFO] [compiler:testCompile {execution: default-testCompile}]
[INFO] No sources to compile
[INFO] [surefire:test {execution: default-test}]
[INFO] Tests are skipped.
[JENKINS] Recording test results
[INFO] [jar:jar {execution: default-jar}]
[INFO] Building jar: <https://builds.apache.org/job/CXF-2.5-deploy/org.apache.cxf.systests.wsdl_maven$cxf-systests-codegen/ws/target/cxf-systests-codegen-2.5.4-SNAPSHOT.jar>
[INFO] [invoker:install {execution: integration-test}]
[INFO] Installing /home/jenkins/jenkins-slave/workspace/CXF-2.5-deploy/cxf-2.5.x-fixes/systests/wsdl_maven/java2ws/pom.xml
to <https://builds.apache.org/job/CXF-2.5-deploy/org.apache.cxf.systests.wsdl_maven$cxf-systests-codegen/ws/target/local-repo/org/apache/cxf/systests/wsdl_maven/cxf-systests-java2ws/2.5.4-SNAPSHOT/cxf-systests-java2ws-2.5.4-SNAPSHOT.pom>
[INFO] Installing /home/jenkins/jenkins-slave/workspace/CXF-2.5-deploy/cxf-2.5.x-fixes/systests/wsdl_maven/java2ws/target/cxf-systests-java2ws-2.5.4-SNAPSHOT.jar
to <https://builds.apache.org/job/CXF-2.5-deploy/org.apache.cxf.systests.wsdl_maven$cxf-systests-codegen/ws/target/local-repo/org/apache/cxf/systests/wsdl_maven/cxf-systests-java2ws/2.5.4-SNAPSHOT/cxf-systests-java2ws-2.5.4-SNAPSHOT.jar>
[INFO] Installing /home/jenkins/jenkins-slave/workspace/CXF-2.5-deploy/cxf-2.5.x-fixes/systests/wsdl_maven/java2ws/target/generated/wsdl/HelloWorld.wsdl
to <https://builds.apache.org/job/CXF-2.5-deploy/org.apache.cxf.systests.wsdl_maven$cxf-systests-codegen/ws/target/local-repo/org/apache/cxf/systests/wsdl_maven/cxf-systests-java2ws/2.5.4-SNAPSHOT/cxf-systests-java2ws-2.5.4-SNAPSHOT.wsdl>
[INFO] Installing /home/jenkins/jenkins-slave/workspace/CXF-2.5-deploy/cxf-2.5.x-fixes/parent/pom.xml
to <https://builds.apache.org/job/CXF-2.5-deploy/org.apache.cxf.systests.wsdl_maven$cxf-systests-codegen/ws/target/local-repo/org/apache/cxf/cxf-parent/2.5.4-SNAPSHOT/cxf-parent-2.5.4-SNAPSHOT.pom>
[INFO] Installing /home/jenkins/jenkins-slave/workspace/CXF-2.5-deploy/cxf-2.5.x-fixes/pom.xml
to <https://builds.apache.org/job/CXF-2.5-deploy/org.apache.cxf.systests.wsdl_maven$cxf-systests-codegen/ws/target/local-repo/org/apache/cxf/cxf/2.5.4-SNAPSHOT/cxf-2.5.4-SNAPSHOT.pom>
[INFO] Installing /home/jenkins/jenkins-slave/workspace/CXF-2.5-deploy/cxf-2.5.x-fixes/rt/frontend/jaxws/pom.xml
to <https://builds.apache.org/job/CXF-2.5-deploy/org.apache.cxf.systests.wsdl_maven$cxf-systests-codegen/ws/target/local-repo/org/apache/cxf/cxf-rt-frontend-jaxws/2.5.4-SNAPSHOT/cxf-rt-frontend-jaxws-2.5.4-SNAPSHOT.pom>
[INFO] Installing /home/jenkins/jenkins-slave/workspace/CXF-2.5-deploy/cxf-2.5.x-fixes/rt/frontend/jaxws/target/cxf-rt-frontend-jaxws-2.5.4-SNAPSHOT.jar
to <https://builds.apache.org/job/CXF-2.5-deploy/org.apache.cxf.systests.wsdl_maven$cxf-systests-codegen/ws/target/local-repo/org/apache/cxf/cxf-rt-frontend-jaxws/2.5.4-SNAPSHOT/cxf-rt-frontend-jaxws-2.5.4-SNAPSHOT.jar>
[INFO] Installing /home/jenkins/jenkins-slave/workspace/CXF-2.5-deploy/cxf-2.5.x-fixes/api/pom.xml
to <https://builds.apache.org/job/CXF-2.5-deploy/org.apache.cxf.systests.wsdl_maven$cxf-systests-codegen/ws/target/local-repo/org/apache/cxf/cxf-api/2.5.4-SNAPSHOT/cxf-api-2.5.4-SNAPSHOT.pom>
[INFO] Installing /home/jenkins/jenkins-slave/workspace/CXF-2.5-deploy/cxf-2.5.x-fixes/api/target/cxf-api-2.5.4-SNAPSHOT.jar
to <https://builds.apache.org/job/CXF-2.5-deploy/org.apache.cxf.systests.wsdl_maven$cxf-systests-codegen/ws/target/local-repo/org/apache/cxf/cxf-api/2.5.4-SNAPSHOT/cxf-api-2.5.4-SNAPSHOT.jar>
[INFO] Installing /home/jenkins/jenkins-slave/workspace/CXF-2.5-deploy/cxf-2.5.x-fixes/api/target/cxf-api-2.5.4-SNAPSHOT-javadoc.jar
to <https://builds.apache.org/job/CXF-2.5-deploy/org.apache.cxf.systests.wsdl_maven$cxf-systests-codegen/ws/target/local-repo/org/apache/cxf/cxf-api/2.5.4-SNAPSHOT/cxf-api-2.5.4-SNAPSHOT-javadoc.jar>
[INFO] Installing /home/jenkins/jenkins-slave/workspace/CXF-2.5-deploy/cxf-2.5.x-fixes/common/common/pom.xml
to <https://builds.apache.org/job/CXF-2.5-deploy/org.apache.cxf.systests.wsdl_maven$cxf-systests-codegen/ws/target/local-repo/org/apache/cxf/cxf-common-utilities/2.5.4-SNAPSHOT/cxf-common-utilities-2.5.4-SNAPSHOT.pom>
[INFO] Installing /home/jenkins/jenkins-slave/workspace/CXF-2.5-deploy/cxf-2.5.x-fixes/common/common/target/cxf-common-utilities-2.5.4-SNAPSHOT.jar
to <https://builds.apache.org/job/CXF-2.5-deploy/org.apache.cxf.systests.wsdl_maven$cxf-systests-codegen/ws/target/local-repo/org/apache/cxf/cxf-common-utilities/2.5.4-SNAPSHOT/cxf-common-utilities-2.5.4-SNAPSHOT.jar>
[INFO] Installing /home/jenkins/jenkins-slave/workspace/CXF-2.5-deploy/cxf-2.5.x-fixes/rt/core/pom.xml
to <https://builds.apache.org/job/CXF-2.5-deploy/org.apache.cxf.systests.wsdl_maven$cxf-systests-codegen/ws/target/local-repo/org/apache/cxf/cxf-rt-core/2.5.4-SNAPSHOT/cxf-rt-core-2.5.4-SNAPSHOT.pom>
[INFO] Installing /home/jenkins/jenkins-slave/workspace/CXF-2.5-deploy/cxf-2.5.x-fixes/rt/core/target/cxf-rt-core-2.5.4-SNAPSHOT.jar
to <https://builds.apache.org/job/CXF-2.5-deploy/org.apache.cxf.systests.wsdl_maven$cxf-systests-codegen/ws/target/local-repo/org/apache/cxf/cxf-rt-core/2.5.4-SNAPSHOT/cxf-rt-core-2.5.4-SNAPSHOT.jar>
[INFO] Installing /home/jenkins/jenkins-slave/workspace/CXF-2.5-deploy/cxf-2.5.x-fixes/rt/bindings/soap/pom.xml
to <https://builds.apache.org/job/CXF-2.5-deploy/org.apache.cxf.systests.wsdl_maven$cxf-systests-codegen/ws/target/local-repo/org/apache/cxf/cxf-rt-bindings-soap/2.5.4-SNAPSHOT/cxf-rt-bindings-soap-2.5.4-SNAPSHOT.pom>
[INFO] Installing /home/jenkins/jenkins-slave/workspace/CXF-2.5-deploy/cxf-2.5.x-fixes/rt/bindings/soap/target/cxf-rt-bindings-soap-2.5.4-SNAPSHOT.jar
to <https://builds.apache.org/job/CXF-2.5-deploy/org.apache.cxf.systests.wsdl_maven$cxf-systests-codegen/ws/target/local-repo/org/apache/cxf/cxf-rt-bindings-soap/2.5.4-SNAPSHOT/cxf-rt-bindings-soap-2.5.4-SNAPSHOT.jar>
[INFO] Installing /home/jenkins/jenkins-slave/workspace/CXF-2.5-deploy/cxf-2.5.x-fixes/tools/common/pom.xml
to <https://builds.apache.org/job/CXF-2.5-deploy/org.apache.cxf.systests.wsdl_maven$cxf-systests-codegen/ws/target/local-repo/org/apache/cxf/cxf-tools-common/2.5.4-SNAPSHOT/cxf-tools-common-2.5.4-SNAPSHOT.pom>
[INFO] Installing /home/jenkins/jenkins-slave/workspace/CXF-2.5-deploy/cxf-2.5.x-fixes/tools/common/target/cxf-tools-common-2.5.4-SNAPSHOT.jar
to <https://builds.apache.org/job/CXF-2.5-deploy/org.apache.cxf.systests.wsdl_maven$cxf-systests-codegen/ws/target/local-repo/org/apache/cxf/cxf-tools-common/2.5.4-SNAPSHOT/cxf-tools-common-2.5.4-SNAPSHOT.jar>
[INFO] Installing /home/jenkins/jenkins-slave/workspace/CXF-2.5-deploy/cxf-2.5.x-fixes/rt/databinding/jaxb/pom.xml
to <https://builds.apache.org/job/CXF-2.5-deploy/org.apache.cxf.systests.wsdl_maven$cxf-systests-codegen/ws/target/local-repo/org/apache/cxf/cxf-rt-databinding-jaxb/2.5.4-SNAPSHOT/cxf-rt-databinding-jaxb-2.5.4-SNAPSHOT.pom>
[INFO] Installing /home/jenkins/jenkins-slave/workspace/CXF-2.5-deploy/cxf-2.5.x-fixes/rt/databinding/jaxb/target/cxf-rt-databinding-jaxb-2.5.4-SNAPSHOT.jar
to <https://builds.apache.org/job/CXF-2.5-deploy/org.apache.cxf.systests.wsdl_maven$cxf-systests-codegen/ws/target/local-repo/org/apache/cxf/cxf-rt-databinding-jaxb/2.5.4-SNAPSHOT/cxf-rt-databinding-jaxb-2.5.4-SNAPSHOT.jar>
[INFO] Installing /home/jenkins/jenkins-slave/workspace/CXF-2.5-deploy/cxf-2.5.x-fixes/rt/bindings/xml/pom.xml
to <https://builds.apache.org/job/CXF-2.5-deploy/org.apache.cxf.systests.wsdl_maven$cxf-systests-codegen/ws/target/local-repo/org/apache/cxf/cxf-rt-bindings-xml/2.5.4-SNAPSHOT/cxf-rt-bindings-xml-2.5.4-SNAPSHOT.pom>
[INFO] Installing /home/jenkins/jenkins-slave/workspace/CXF-2.5-deploy/cxf-2.5.x-fixes/rt/bindings/xml/target/cxf-rt-bindings-xml-2.5.4-SNAPSHOT.jar
to <https://builds.apache.org/job/CXF-2.5-deploy/org.apache.cxf.systests.wsdl_maven$cxf-systests-codegen/ws/target/local-repo/org/apache/cxf/cxf-rt-bindings-xml/2.5.4-SNAPSHOT/cxf-rt-bindings-xml-2.5.4-SNAPSHOT.jar>
[INFO] Installing /home/jenkins/jenkins-slave/workspace/CXF-2.5-deploy/cxf-2.5.x-fixes/rt/frontend/simple/pom.xml
to <https://builds.apache.org/job/CXF-2.5-deploy/org.apache.cxf.systests.wsdl_maven$cxf-systests-codegen/ws/target/local-repo/org/apache/cxf/cxf-rt-frontend-simple/2.5.4-SNAPSHOT/cxf-rt-frontend-simple-2.5.4-SNAPSHOT.pom>
[INFO] Installing /home/jenkins/jenkins-slave/workspace/CXF-2.5-deploy/cxf-2.5.x-fixes/rt/frontend/simple/target/cxf-rt-frontend-simple-2.5.4-SNAPSHOT.jar
to <https://builds.apache.org/job/CXF-2.5-deploy/org.apache.cxf.systests.wsdl_maven$cxf-systests-codegen/ws/target/local-repo/org/apache/cxf/cxf-rt-frontend-simple/2.5.4-SNAPSHOT/cxf-rt-frontend-simple-2.5.4-SNAPSHOT.jar>
[INFO] Installing /home/jenkins/jenkins-slave/workspace/CXF-2.5-deploy/cxf-2.5.x-fixes/rt/transports/http/pom.xml
to <https://builds.apache.org/job/CXF-2.5-deploy/org.apache.cxf.systests.wsdl_maven$cxf-systests-codegen/ws/target/local-repo/org/apache/cxf/cxf-rt-transports-http/2.5.4-SNAPSHOT/cxf-rt-transports-http-2.5.4-SNAPSHOT.pom>
[INFO] Installing /home/jenkins/jenkins-slave/workspace/CXF-2.5-deploy/cxf-2.5.x-fixes/rt/transports/http/target/cxf-rt-transports-http-2.5.4-SNAPSHOT.jar
to <https://builds.apache.org/job/CXF-2.5-deploy/org.apache.cxf.systests.wsdl_maven$cxf-systests-codegen/ws/target/local-repo/org/apache/cxf/cxf-rt-transports-http/2.5.4-SNAPSHOT/cxf-rt-transports-http-2.5.4-SNAPSHOT.jar>
[INFO] Installing /home/jenkins/jenkins-slave/workspace/CXF-2.5-deploy/cxf-2.5.x-fixes/rt/transports/common/pom.xml
to <https://builds.apache.org/job/CXF-2.5-deploy/org.apache.cxf.systests.wsdl_maven$cxf-systests-codegen/ws/target/local-repo/org/apache/cxf/cxf-rt-transports-common/2.5.4-SNAPSHOT/cxf-rt-transports-common-2.5.4-SNAPSHOT.pom>
[INFO] Installing /home/jenkins/jenkins-slave/workspace/CXF-2.5-deploy/cxf-2.5.x-fixes/rt/transports/common/target/cxf-rt-transports-common-2.5.4-SNAPSHOT.jar
to <https://builds.apache.org/job/CXF-2.5-deploy/org.apache.cxf.systests.wsdl_maven$cxf-systests-codegen/ws/target/local-repo/org/apache/cxf/cxf-rt-transports-common/2.5.4-SNAPSHOT/cxf-rt-transports-common-2.5.4-SNAPSHOT.jar>
[INFO] Installing /home/jenkins/jenkins-slave/workspace/CXF-2.5-deploy/cxf-2.5.x-fixes/rt/ws/addr/pom.xml
to <https://builds.apache.org/job/CXF-2.5-deploy/org.apache.cxf.systests.wsdl_maven$cxf-systests-codegen/ws/target/local-repo/org/apache/cxf/cxf-rt-ws-addr/2.5.4-SNAPSHOT/cxf-rt-ws-addr-2.5.4-SNAPSHOT.pom>
[INFO] Installing /home/jenkins/jenkins-slave/workspace/CXF-2.5-deploy/cxf-2.5.x-fixes/rt/ws/addr/target/cxf-rt-ws-addr-2.5.4-SNAPSHOT.jar
to <https://builds.apache.org/job/CXF-2.5-deploy/org.apache.cxf.systests.wsdl_maven$cxf-systests-codegen/ws/target/local-repo/org/apache/cxf/cxf-rt-ws-addr/2.5.4-SNAPSHOT/cxf-rt-ws-addr-2.5.4-SNAPSHOT.jar>
[INFO] Installing <https://builds.apache.org/job/CXF-2.5-deploy/org.apache.cxf.systests.wsdl_maven$cxf-systests-codegen/ws/pom.xml>
to <https://builds.apache.org/job/CXF-2.5-deploy/org.apache.cxf.systests.wsdl_maven$cxf-systests-codegen/ws/target/local-repo/org/apache/cxf/systests/wsdl_maven/cxf-systests-codegen/2.5.4-SNAPSHOT/cxf-systests-codegen-2.5.4-SNAPSHOT.pom>
[INFO] Installing <https://builds.apache.org/job/CXF-2.5-deploy/org.apache.cxf.systests.wsdl_maven$cxf-systests-codegen/ws/target/cxf-systests-codegen-2.5.4-SNAPSHOT.jar>
to <https://builds.apache.org/job/CXF-2.5-deploy/org.apache.cxf.systests.wsdl_maven$cxf-systests-codegen/ws/target/local-repo/org/apache/cxf/systests/wsdl_maven/cxf-systests-codegen/2.5.4-SNAPSHOT/cxf-systests-codegen-2.5.4-SNAPSHOT.jar>
[INFO] [invoker:integration-test {execution: integration-test}]
[INFO] Building: it-parent/pom.xml
[INFO] ..SUCCESS (2.8 s)
[INFO] Building: cxf-4004/pom.xml
[INFO] ..FAILED (20.3 s)
[INFO]   The build exited with code 1. See <https://builds.apache.org/job/CXF-2.5-deploy/org.apache.cxf.systests.wsdl_maven$cxf-systests-codegen/ws/target/it/cxf-4004/build.log>
for details.
[INFO] [invoker:verify {execution: integration-test}]
[INFO] -------------------------------------------------
[INFO] Build Summary:
[INFO]   Passed: 1, Failed: 1, Errors: 0, Skipped: 0
[INFO] -------------------------------------------------
[ERROR] The following builds failed:
[ERROR] *  cxf-4004/pom.xml
[INFO] -------------------------------------------------
[JENKINS] Archiving <https://builds.apache.org/job/CXF-2.5-deploy/org.apache.cxf.systests.wsdl_maven$cxf-systests-codegen/ws/pom.xml>
to /home/hudson/hudson/jobs/CXF-2.5-deploy/modules/org.apache.cxf.systests.wsdl_maven$cxf-systests-codegen/builds/2012-05-05_07-16-04/archive/org.apache.cxf.systests.wsdl_maven/cxf-systests-codegen/2.5.4-SNAPSHOT/cxf-systests-codegen-2.5.4-SNAPSHOT.pom
[JENKINS] Archiving <https://builds.apache.org/job/CXF-2.5-deploy/org.apache.cxf.systests.wsdl_maven$cxf-systests-codegen/ws/target/cxf-systests-codegen-2.5.4-SNAPSHOT.jar>
to /home/hudson/hudson/jobs/CXF-2.5-deploy/modules/org.apache.cxf.systests.wsdl_maven$cxf-systests-codegen/builds/2012-05-05_07-16-04/archive/org.apache.cxf.systests.wsdl_maven/cxf-systests-codegen/2.5.4-SNAPSHOT/cxf-systests-codegen-2.5.4-SNAPSHOT.jar
[INFO] ------------------------------------------------------------------------
[ERROR] BUILD FAILURE
[INFO] ------------------------------------------------------------------------
[INFO] : org.apache.maven.plugin.invoker.InvokerSession@ed456c
1 build failed.
[INFO] ------------------------------------------------------------------------
[INFO] Trace
org.apache.maven.BuildFailureException: 1 build failed.
	at org.apache.maven.lifecycle.DefaultLifecycleExecutor.executeGoals(DefaultLifecycleExecutor.java:715)
	at org.apache.maven.lifecycle.DefaultLifecycleExecutor.executeGoalWithLifecycle(DefaultLifecycleExecutor.java:556)
	at org.apache.maven.lifecycle.DefaultLifecycleExecutor.executeGoal(DefaultLifecycleExecutor.java:535)
	at org.apache.maven.lifecycle.DefaultLifecycleExecutor.executeGoalAndHandleFailures(DefaultLifecycleExecutor.java:387)
	at org.apache.maven.lifecycle.DefaultLifecycleExecutor.executeTaskSegments(DefaultLifecycleExecutor.java:348)
	at org.apache.maven.lifecycle.DefaultLifecycleExecutor.execute(DefaultLifecycleExecutor.java:180)
	at org.apache.maven.lifecycle.LifecycleExecutorInterceptor.execute(LifecycleExecutorInterceptor.java:65)
	at org.apache.maven.DefaultMaven.doExecute(DefaultMaven.java:328)
	at org.apache.maven.DefaultMaven.execute(DefaultMaven.java:138)
	at org.apache.maven.cli.MavenCli.main(MavenCli.java:362)
	at sun.reflect.NativeMethodAccessorImpl.invoke0(Native Method)
	at sun.reflect.NativeMethodAccessorImpl.invoke(NativeMethodAccessorImpl.java:39)
	at sun.reflect.DelegatingMethodAccessorImpl.invoke(DelegatingMethodAccessorImpl.java:25)
	at java.lang.reflect.Method.invoke(Method.java:592)
	at org.codehaus.classworlds.Launcher.launchEnhanced(Launcher.java:315)
	at org.codehaus.classworlds.Launcher.launch(Launcher.java:255)
	at hudson.maven.agent.Main.launch(Main.java:185)
	at hudson.maven.MavenBuilder.call(MavenBuilder.java:151)
	at hudson.maven.Maven2Builder.call(Maven2Builder.java:77)
	at hudson.maven.Maven2Builder.call(Maven2Builder.java:53)
	at hudson.remoting.UserRequest.perform(UserRequest.java:118)
	at hudson.remoting.UserRequest.perform(UserRequest.java:48)
	at hudson.remoting.Request$2.run(Request.java:287)
	at hudson.remoting.InterceptingExecutorService$1.call(InterceptingExecutorService.java:72)
	at java.util.concurrent.FutureTask$Sync.innerRun(FutureTask.java:269)
	at java.util.concurrent.FutureTask.run(FutureTask.java:123)
	at java.util.concurrent.ThreadPoolExecutor$Worker.runTask(ThreadPoolExecutor.java:651)
	at java.util.concurrent.ThreadPoolExecutor$Worker.run(ThreadPoolExecutor.java:676)
	at java.lang.Thread.run(Thread.java:595)
Caused by: org.apache.maven.plugin.MojoFailureException: 1 build failed.
	at org.apache.maven.plugin.invoker.InvokerSession.handleFailures(InvokerSession.java:263)
	at org.apache.maven.plugin.invoker.VerifyMojo.execute(VerifyMojo.java:124)
	at org.apache.maven.plugin.DefaultPluginManager.executeMojo(DefaultPluginManager.java:490)
	at hudson.maven.agent.PluginManagerInterceptor.executeMojo(PluginManagerInterceptor.java:182)
	at org.apache.maven.lifecycle.DefaultLifecycleExecutor.executeGoals(DefaultLifecycleExecutor.java:694)
	... 28 more
[INFO] ------------------------------------------------------------------------
[INFO] Total time: 7 minutes 32 seconds
[INFO] Finished at: Sat May 05 07:23:44 GMT 2012
[INFO] Final Memory: 364M/460M
[INFO] ------------------------------------------------------------------------

Mime
View raw message