cxf-notifications mailing list archives

Site index · List index
Message view « Date » · « Thread »
Top « Date » · « Thread »
From Apache Jenkins Server <jenk...@builds.apache.org>
Subject Build failed in Jenkins: CXF-2.5-deploy #82
Date Sat, 05 May 2012 07:35:27 GMT
See <https://builds.apache.org/job/CXF-2.5-deploy/82/changes>

Changes:

[dkulp] Merged revisions 1334142 via svnmerge from 
https://svn.apache.org/repos/asf/cxf/trunk

........
  r1334142 | dkulp | 2012-05-04 15:53:02 -0400 (Fri, 04 May 2012) | 1 line
  
  Fix possible NPE
........

[dkulp] Recording revisions 1334057,1334084 via  git from
https://svn.apache.org/repos/asf/cxf/trunk

[dkulp] Merged revisions 1334084 via  git cherry-pick from
https://svn.apache.org/repos/asf/cxf/trunk

........
  r1334084 | dkulp | 2012-05-04 13:46:29 -0400 (Fri, 04 May 2012) | 2 lines

  [CXF-4288] Consider the full signature when mapping methods to roles

........

[dkulp] Merged revisions 1334057 via  git cherry-pick from
https://svn.apache.org/repos/asf/cxf/trunk

........
  r1334057 | dkulp | 2012-05-04 12:48:00 -0400 (Fri, 04 May 2012) | 2 lines

  update  site plugin version

........

[sergeyb] Merged revisions 1333910 via svnmerge from 
https://svn.apache.org/repos/asf/cxf/trunk

........
  r1333910 | sergeyb | 2012-05-04 13:35:39 +0100 (Fri, 04 May 2012) | 1 line
  
  [CXF-4281] Update to UriBuilder.replacePath implementation
........

[coheigea] Recording revisions 1333886 via  git from
https://svn.apache.org/repos/asf/cxf/trunk

[coheigea] Fix for sporadically failing systest with JDK 1.7

[sergeyb] Merged revisions 1333857 via svnmerge from 
https://svn.apache.org/repos/asf/cxf/trunk

........
  r1333857 | sergeyb | 2012-05-04 11:20:02 +0100 (Fri, 04 May 2012) | 1 line
  
  [CXF-4281] Adding one mmore UriBuilder test with duplicate template vars
........

[sergeyb] Merged revisions 1333832 via svnmerge from 
https://svn.apache.org/repos/asf/cxf/trunk

........
  r1333832 | sergeyb | 2012-05-04 10:49:58 +0100 (Fri, 04 May 2012) | 1 line
  
  Updating some of JAXRSClientServerBookTest tests not to depend on the state updates
........

------------------------------------------
[...truncated 18926 lines...]
[INFO] [install:install {execution: default-install}]
[INFO] Installing /x1/jenkins/jenkins-slave/workspace/CXF-2.5-deploy/cxf-2.5.x-fixes/systests/rs-security/target/cxf-systests-rs-security-2.5.4-SNAPSHOT.jar to <https://builds.apache.org/job/CXF-2.5-deploy/ws/.repository/org/apache/cxf/systests/cxf-systests-rs-security/2.5.4-SNAPSHOT/cxf-systests-rs-security-2.5.4-SNAPSHOT.jar>
[INFO] Installing /x1/jenkins/jenkins-slave/workspace/CXF-2.5-deploy/cxf-2.5.x-fixes/systests/rs-security/target/cxf-systests-rs-security-2.5.4-SNAPSHOT-sources.jar to <https://builds.apache.org/job/CXF-2.5-deploy/ws/.repository/org/apache/cxf/systests/cxf-systests-rs-security/2.5.4-SNAPSHOT/cxf-systests-rs-security-2.5.4-SNAPSHOT-sources.jar>
[INFO] Installing /x1/jenkins/jenkins-slave/workspace/CXF-2.5-deploy/cxf-2.5.x-fixes/systests/rs-security/target/cxf-systests-rs-security-2.5.4-SNAPSHOT-tests.jar to <https://builds.apache.org/job/CXF-2.5-deploy/ws/.repository/org/apache/cxf/systests/cxf-systests-rs-security/2.5.4-SNAPSHOT/cxf-systests-rs-security-2.5.4-SNAPSHOT-tests.jar>
[INFO] [deploy:deploy {execution: default-deploy}]
[INFO] Retrieving previous build number from apache.snapshots.https
[WARNING] *** CHECKSUM FAILED - Checksum failed on download: local = '084dc7302196fe461f400a0cc8f40fa79fcda718'; remote = 'eb29db2761af9ebba5924ba6b1d78b4b8c5a4acb' - RETRYING
[WARNING] *** CHECKSUM FAILED - Checksum failed on download: local = '084dc7302196fe461f400a0cc8f40fa79fcda718'; remote = 'eb29db2761af9ebba5924ba6b1d78b4b8c5a4acb' - IGNORING
Uploading: https://repository.apache.org/content/repositories/snapshots/org/apache/cxf/systests/cxf-systests-rs-security/2.5.4-SNAPSHOT/cxf-systests-rs-security-2.5.4-20120505.072355-16.jar
10K uploaded  (cxf-systests-rs-security-2.5.4-20120505.072355-16.jar)
[INFO] Retrieving previous metadata from apache.snapshots.https
[INFO] Uploading repository metadata for: 'artifact org.apache.cxf.systests:cxf-systests-rs-security'
[INFO] Retrieving previous metadata from apache.snapshots.https
[WARNING] *** CHECKSUM FAILED - Checksum failed on download: local = '084dc7302196fe461f400a0cc8f40fa79fcda718'; remote = 'eb29db2761af9ebba5924ba6b1d78b4b8c5a4acb' - RETRYING
[WARNING] *** CHECKSUM FAILED - Checksum failed on download: local = '084dc7302196fe461f400a0cc8f40fa79fcda718'; remote = 'eb29db2761af9ebba5924ba6b1d78b4b8c5a4acb' - IGNORING
[INFO] Uploading repository metadata for: 'snapshot org.apache.cxf.systests:cxf-systests-rs-security:2.5.4-SNAPSHOT'
[INFO] Uploading project information for cxf-systests-rs-security 2.5.4-20120505.072355-16
[INFO] Retrieving previous build number from apache.snapshots.https
Uploading: https://repository.apache.org/content/repositories/snapshots/org/apache/cxf/systests/cxf-systests-rs-security/2.5.4-SNAPSHOT/cxf-systests-rs-security-2.5.4-20120505.072355-16-sources.jar
7K uploaded  (cxf-systests-rs-security-2.5.4-20120505.072355-16-sources.jar)
[INFO] Retrieving previous build number from apache.snapshots.https
Uploading: https://repository.apache.org/content/repositories/snapshots/org/apache/cxf/systests/cxf-systests-rs-security/2.5.4-SNAPSHOT/cxf-systests-rs-security-2.5.4-20120505.072355-16-tests.jar
105K uploaded  (cxf-systests-rs-security-2.5.4-20120505.072355-16-tests.jar)
[INFO] ------------------------------------------------------------------------
[INFO] Building Test for writing wsdl to repo
[INFO]    task-segment: [deploy]
[INFO] ------------------------------------------------------------------------
[INFO] [cxf-xml2fastinfoset:xml2fastinfoset {execution: xml2fastinfoset}]
[INFO] [remote-resources:process {execution: default}]
[debug] execute contextualize
[INFO] [resources:resources {execution: default-resources}]
[INFO] Using 'UTF-8' encoding to copy filtered resources.
[INFO] Copying 0 resource
[INFO] skip non existing resourceDirectory /x1/jenkins/jenkins-slave/workspace/CXF-2.5-deploy/cxf-2.5.x-fixes/systests/wsdl_maven/java2ws/src/main/resources
[INFO] skip non existing resourceDirectory /x1/jenkins/jenkins-slave/workspace/CXF-2.5-deploy/cxf-2.5.x-fixes/systests/wsdl_maven/java2ws/src/main/resources-filtered
[INFO] skip non existing resourceDirectory /x1/jenkins/jenkins-slave/workspace/CXF-2.5-deploy/cxf-2.5.x-fixes/systests/wsdl_maven/java2ws/target/generated/src/main/resources
[INFO] Copying 3 resources
[INFO] [compiler:compile {execution: default-compile}]
[INFO] Nothing to compile - all classes are up to date
[INFO] [cxf-java2ws:java2ws {execution: process-classes}]
java2ws -cp /x1/jenkins/jenkins-slave/workspace/CXF-2.5-deploy/cxf-2.5.x-fixes/systests/wsdl_maven/java2ws/target/classes:/x1/jenkins/jenkins-slave/workspace/CXF-2.5-deploy/cxf-2.5.x-fixes/systests/wsdl_maven/java2ws/target/classes:/x1/jenkins/jenkins-slave/workspace/CXF-2.5-deploy/cxf-2.5.x-fixes/rt/frontend/jaxws/target/cxf-rt-frontend-jaxws-2.5.4-SNAPSHOT.jar:<https://builds.apache.org/job/CXF-2.5-deploy/ws/.repository/xml-resolver/xml-resolver/1.2/xml-resolver-1.2.jar>:<https://builds.apache.org/job/CXF-2.5-deploy/ws/.repository/asm/asm/3.3.1/asm-3.3.1.jar>:/x1/jenkins/jenkins-slave/workspace/CXF-2.5-deploy/cxf-2.5.x-fixes/api/target/cxf-api-2.5.4-SNAPSHOT.jar:/x1/jenkins/jenkins-slave/workspace/CXF-2.5-deploy/cxf-2.5.x-fixes/common/common/target/cxf-common-utilities-2.5.4-SNAPSHOT.jar:<https://builds.apache.org/job/CXF-2.5-deploy/ws/.repository/org/apache/ws/xmlschema/xmlschema-core/2.0.2/xmlschema-core-2.0.2.jar>:<https://builds.apache.org/job/CXF-2.5-deploy/ws/.repository/org/codehaus/woodstox/woodstox-core-asl/4.1.2/woodstox-core-asl-4.1.2.jar>:<https://builds.apache.org/job/CXF-2.5-deploy/ws/.repository/org/codehaus/woodstox/stax2-api/3.1.1/stax2-api-3.1.1.jar>:<https://builds.apache.org/job/CXF-2.5-deploy/ws/.repository/org/apache/geronimo/specs/geronimo-stax-api_1.0_spec/1.0.1/geronimo-stax-api_1.0_spec-1.0.1.jar>:<https://builds.apache.org/job/CXF-2.5-deploy/ws/.repository/org/apache/geronimo/specs/geronimo-annotation_1.0_spec/1.1.1/geronimo-annotation_1.0_spec-1.1.1.jar>:<https://builds.apache.org/job/CXF-2.5-deploy/ws/.repository/javax/xml/bind/jaxb-api/2.2.3/jaxb-api-2.2.3.jar>:<https://builds.apache.org/job/CXF-2.5-deploy/ws/.repository/org/apache/neethi/neethi/3.0.2/neethi-3.0.2.jar>:<https://builds.apache.org/job/CXF-2.5-deploy/ws/.repository/wsdl4j/wsdl4j/1.6.2/wsdl4j-1.6.2.jar>:<https://builds.apache.org/job/CXF-2.5-deploy/ws/.repository/org/apache/geronimo/specs/geronimo-activation_1.1_spec/1.1/geronimo-activation_1.1_spec-1.1.jar>:/x1/jenkins/jenkins-slave/workspace/CXF-2.5-deploy/cxf-2.5.x-fixes/rt/core/target/cxf-rt-core-2.5.4-SNAPSHOT.jar:<https://builds.apache.org/job/CXF-2.5-deploy/ws/.repository/com/sun/xml/bind/jaxb-impl/2.2.4-1/jaxb-impl-2.2.4-1.jar>:<https://builds.apache.org/job/CXF-2.5-deploy/ws/.repository/org/apache/geronimo/specs/geronimo-javamail_1.4_spec/1.7.1/geronimo-javamail_1.4_spec-1.7.1.jar>:/x1/jenkins/jenkins-slave/workspace/CXF-2.5-deploy/cxf-2.5.x-fixes/rt/bindings/soap/target/cxf-rt-bindings-soap-2.5.4-SNAPSHOT.jar:/x1/jenkins/jenkins-slave/workspace/CXF-2.5-deploy/cxf-2.5.x-fixes/tools/common/target/cxf-tools-common-2.5.4-SNAPSHOT.jar:<https://builds.apache.org/job/CXF-2.5-deploy/ws/.repository/javax/xml/soap/saaj-api/1.3.4/saaj-api-1.3.4.jar>:/x1/jenkins/jenkins-slave/workspace/CXF-2.5-deploy/cxf-2.5.x-fixes/rt/databinding/jaxb/target/cxf-rt-databinding-jaxb-2.5.4-SNAPSHOT.jar:/x1/jenkins/jenkins-slave/workspace/CXF-2.5-deploy/cxf-2.5.x-fixes/rt/bindings/xml/target/cxf-rt-bindings-xml-2.5.4-SNAPSHOT.jar:/x1/jenkins/jenkins-slave/workspace/CXF-2.5-deploy/cxf-2.5.x-fixes/rt/frontend/simple/target/cxf-rt-frontend-simple-2.5.4-SNAPSHOT.jar:/x1/jenkins/jenkins-slave/workspace/CXF-2.5-deploy/cxf-2.5.x-fixes/rt/transports/http/target/cxf-rt-transports-http-2.5.4-SNAPSHOT.jar:/x1/jenkins/jenkins-slave/workspace/CXF-2.5-deploy/cxf-2.5.x-fixes/rt/transports/common/target/cxf-rt-transports-common-2.5.4-SNAPSHOT.jar:<https://builds.apache.org/job/CXF-2.5-deploy/ws/.repository/org/springframework/spring-web/3.0.6.RELEASE/spring-web-3.0.6.RELEASE.jar>:<https://builds.apache.org/job/CXF-2.5-deploy/ws/.repository/aopalliance/aopalliance/1.0/aopalliance-1.0.jar>:<https://builds.apache.org/job/CXF-2.5-deploy/ws/.repository/org/springframework/spring-beans/3.0.6.RELEASE/spring-beans-3.0.6.RELEASE.jar>:<https://builds.apache.org/job/CXF-2.5-deploy/ws/.repository/org/springframework/spring-core/3.0.6.RELEASE/spring-core-3.0.6.RELEASE.jar>:<https://builds.apache.org/job/CXF-2.5-deploy/ws/.repository/org/springframework/spring-asm/3.0.6.RELEASE/spring-asm-3.0.6.RELEASE.jar>:<https://builds.apache.org/job/CXF-2.5-deploy/ws/.repository/commons-logging/commons-logging/1.1.1/commons-logging-1.1.1.jar>:<https://builds.apache.org/job/CXF-2.5-deploy/ws/.repository/org/springframework/spring-context/3.0.6.RELEASE/spring-context-3.0.6.RELEASE.jar>:<https://builds.apache.org/job/CXF-2.5-deploy/ws/.repository/org/springframework/spring-aop/3.0.6.RELEASE/spring-aop-3.0.6.RELEASE.jar>:<https://builds.apache.org/job/CXF-2.5-deploy/ws/.repository/org/springframework/spring-expression/3.0.6.RELEASE/spring-expression-3.0.6.RELEASE.jar>:/x1/jenkins/jenkins-slave/workspace/CXF-2.5-deploy/cxf-2.5.x-fixes/rt/ws/addr/target/cxf-rt-ws-addr-2.5.4-SNAPSHOT.jar:<https://builds.apache.org/job/CXF-2.5-deploy/ws/.repository/org/apache/geronimo/specs/geronimo-jaxws_2.2_spec/1.1/geronimo-jaxws_2.2_spec-1.1.jar>:<https://builds.apache.org/job/CXF-2.5-deploy/ws/.repository/org/apache/geronimo/specs/geronimo-ws-metadata_2.0_spec/1.1.3/geronimo-ws-metadata_2.0_spec-1.1.3.jar>:<https://builds.apache.org/job/CXF-2.5-deploy/ws/.repository/com/sun/xml/messaging/saaj/saaj-impl/1.3.12/saaj-impl-1.3.12.jar>:<https://builds.apache.org/job/CXF-2.5-deploy/ws/.repository/org/jvnet/mimepull/1.4/mimepull-1.4.jar>::/x1/jenkins/jenkins-slave/workspace/CXF-2.5-deploy/cxf-2.5.x-fixes/rt/frontend/jaxws/target/cxf-rt-frontend-jaxws-2.5.4-SNAPSHOT.jar:<https://builds.apache.org/job/CXF-2.5-deploy/ws/.repository/xml-resolver/xml-resolver/1.2/xml-resolver-1.2.jar>:<https://builds.apache.org/job/CXF-2.5-deploy/ws/.repository/asm/asm/3.3.1/asm-3.3.1.jar>:/x1/jenkins/jenkins-slave/workspace/CXF-2.5-deploy/cxf-2.5.x-fixes/api/target/cxf-api-2.5.4-SNAPSHOT.jar:/x1/jenkins/jenkins-slave/workspace/CXF-2.5-deploy/cxf-2.5.x-fixes/common/common/target/cxf-common-utilities-2.5.4-SNAPSHOT.jar:<https://builds.apache.org/job/CXF-2.5-deploy/ws/.repository/org/apache/ws/xmlschema/xmlschema-core/2.0.2/xmlschema-core-2.0.2.jar>:<https://builds.apache.org/job/CXF-2.5-deploy/ws/.repository/org/codehaus/woodstox/woodstox-core-asl/4.1.2/woodstox-core-asl-4.1.2.jar>:<https://builds.apache.org/job/CXF-2.5-deploy/ws/.repository/org/codehaus/woodstox/stax2-api/3.1.1/stax2-api-3.1.1.jar>:<https://builds.apache.org/job/CXF-2.5-deploy/ws/.repository/org/apache/geronimo/specs/geronimo-stax-api_1.0_spec/1.0.1/geronimo-stax-api_1.0_spec-1.0.1.jar>:<https://builds.apache.org/job/CXF-2.5-deploy/ws/.repository/org/apache/geronimo/specs/geronimo-annotation_1.0_spec/1.1.1/geronimo-annotation_1.0_spec-1.1.1.jar>:<https://builds.apache.org/job/CXF-2.5-deploy/ws/.repository/javax/xml/bind/jaxb-api/2.2.3/jaxb-api-2.2.3.jar>:<https://builds.apache.org/job/CXF-2.5-deploy/ws/.repository/org/apache/neethi/neethi/3.0.2/neethi-3.0.2.jar>:<https://builds.apache.org/job/CXF-2.5-deploy/ws/.repository/wsdl4j/wsdl4j/1.6.2/wsdl4j-1.6.2.jar>:<https://builds.apache.org/job/CXF-2.5-deploy/ws/.repository/org/apache/geronimo/specs/geronimo-activation_1.1_spec/1.1/geronimo-activation_1.1_spec-1.1.jar>:/x1/jenkins/jenkins-slave/workspace/CXF-2.5-deploy/cxf-2.5.x-fixes/rt/core/target/cxf-rt-core-2.5.4-SNAPSHOT.jar:<https://builds.apache.org/job/CXF-2.5-deploy/ws/.repository/com/sun/xml/bind/jaxb-impl/2.2.4-1/jaxb-impl-2.2.4-1.jar>:<https://builds.apache.org/job/CXF-2.5-deploy/ws/.repository/org/apache/geronimo/specs/geronimo-javamail_1.4_spec/1.7.1/geronimo-javamail_1.4_spec-1.7.1.jar>:/x1/jenkins/jenkins-slave/workspace/CXF-2.5-deploy/cxf-2.5.x-fixes/rt/bindings/soap/target/cxf-rt-bindings-soap-2.5.4-SNAPSHOT.jar:/x1/jenkins/jenkins-slave/workspace/CXF-2.5-deploy/cxf-2.5.x-fixes/tools/common/target/cxf-tools-common-2.5.4-SNAPSHOT.jar:<https://builds.apache.org/job/CXF-2.5-deploy/ws/.repository/javax/xml/soap/saaj-api/1.3.4/saaj-api-1.3.4.jar>:/x1/jenkins/jenkins-slave/workspace/CXF-2.5-deploy/cxf-2.5.x-fixes/rt/databinding/jaxb/target/cxf-rt-databinding-jaxb-2.5.4-SNAPSHOT.jar:/x1/jenkins/jenkins-slave/workspace/CXF-2.5-deploy/cxf-2.5.x-fixes/rt/bindings/xml/target/cxf-rt-bindings-xml-2.5.4-SNAPSHOT.jar:/x1/jenkins/jenkins-slave/workspace/CXF-2.5-deploy/cxf-2.5.x-fixes/rt/frontend/simple/target/cxf-rt-frontend-simple-2.5.4-SNAPSHOT.jar:/x1/jenkins/jenkins-slave/workspace/CXF-2.5-deploy/cxf-2.5.x-fixes/rt/transports/http/target/cxf-rt-transports-http-2.5.4-SNAPSHOT.jar:/x1/jenkins/jenkins-slave/workspace/CXF-2.5-deploy/cxf-2.5.x-fixes/rt/transports/common/target/cxf-rt-transports-common-2.5.4-SNAPSHOT.jar:<https://builds.apache.org/job/CXF-2.5-deploy/ws/.repository/org/springframework/spring-web/3.0.6.RELEASE/spring-web-3.0.6.RELEASE.jar>:<https://builds.apache.org/job/CXF-2.5-deploy/ws/.repository/aopalliance/aopalliance/1.0/aopalliance-1.0.jar>:<https://builds.apache.org/job/CXF-2.5-deploy/ws/.repository/org/springframework/spring-beans/3.0.6.RELEASE/spring-beans-3.0.6.RELEASE.jar>:<https://builds.apache.org/job/CXF-2.5-deploy/ws/.repository/org/springframework/spring-core/3.0.6.RELEASE/spring-core-3.0.6.RELEASE.jar>:<https://builds.apache.org/job/CXF-2.5-deploy/ws/.repository/org/springframework/spring-asm/3.0.6.RELEASE/spring-asm-3.0.6.RELEASE.jar>:<https://builds.apache.org/job/CXF-2.5-deploy/ws/.repository/commons-logging/commons-logging/1.1.1/commons-logging-1.1.1.jar>:<https://builds.apache.org/job/CXF-2.5-deploy/ws/.repository/org/springframework/spring-context/3.0.6.RELEASE/spring-context-3.0.6.RELEASE.jar>:<https://builds.apache.org/job/CXF-2.5-deploy/ws/.repository/org/springframework/spring-aop/3.0.6.RELEASE/spring-aop-3.0.6.RELEASE.jar>:<https://builds.apache.org/job/CXF-2.5-deploy/ws/.repository/org/springframework/spring-expression/3.0.6.RELEASE/spring-expression-3.0.6.RELEASE.jar>:/x1/jenkins/jenkins-slave/workspace/CXF-2.5-deploy/cxf-2.5.x-fixes/rt/ws/addr/target/cxf-rt-ws-addr-2.5.4-SNAPSHOT.jar:<https://builds.apache.org/job/CXF-2.5-deploy/ws/.repository/org/apache/geronimo/specs/geronimo-jaxws_2.2_spec/1.1/geronimo-jaxws_2.2_spec-1.1.jar>:<https://builds.apache.org/job/CXF-2.5-deploy/ws/.repository/org/apache/geronimo/specs/geronimo-ws-metadata_2.0_spec/1.1.3/geronimo-ws-metadata_2.0_spec-1.1.3.jar>:<https://builds.apache.org/job/CXF-2.5-deploy/ws/.repository/com/sun/xml/messaging/saaj/saaj-impl/1.3.12/saaj-impl-1.3.12.jar>:<https://builds.apache.org/job/CXF-2.5-deploy/ws/.repository/org/jvnet/mimepull/1.4/mimepull-1.4.jar>: -o /x1/jenkins/jenkins-slave/workspace/CXF-2.5-deploy/cxf-2.5.x-fixes/systests/wsdl_maven/java2ws/target/generated/wsdl/HelloWorld.wsdl -wsdl -verbose org.apache.cxf.systests.java2ws.HelloWorld
java2ws - Apache CXF 2.5.4-SNAPSHOT

May 5, 2012 7:35:04 AM org.apache.cxf.service.factory.ReflectionServiceFactoryBean buildServiceFromClass
INFO: Creating Service {http://java2ws.systests.cxf.apache.org/}HelloWorldService from class org.apache.cxf.systests.java2ws.HelloWorld
[debug] execute contextualize
[INFO] [resources:testResources {execution: default-testResources}]
[INFO] Using 'UTF-8' encoding to copy filtered resources.
[INFO] skip non existing resourceDirectory /x1/jenkins/jenkins-slave/workspace/CXF-2.5-deploy/cxf-2.5.x-fixes/systests/wsdl_maven/java2ws/src/test/java
[INFO] skip non existing resourceDirectory /x1/jenkins/jenkins-slave/workspace/CXF-2.5-deploy/cxf-2.5.x-fixes/systests/wsdl_maven/java2ws/src/test/resources
[INFO] skip non existing resourceDirectory /x1/jenkins/jenkins-slave/workspace/CXF-2.5-deploy/cxf-2.5.x-fixes/systests/wsdl_maven/java2ws/target/generated/src/test/resources
[INFO] Copying 3 resources
[INFO] [compiler:testCompile {execution: default-testCompile}]
[INFO] No sources to compile
[INFO] [surefire:test {execution: default-test}]
[INFO] Tests are skipped.
[INFO] [jar:jar {execution: default-jar}]
[INFO] Building jar: /x1/jenkins/jenkins-slave/workspace/CXF-2.5-deploy/cxf-2.5.x-fixes/systests/wsdl_maven/java2ws/target/cxf-systests-java2ws-2.5.4-SNAPSHOT.jar
[INFO] [source:jar-no-fork {execution: attach-sources}]
[INFO] org already added, skipping
[INFO] org/apache already added, skipping
[INFO] org/apache/cxf already added, skipping
[INFO] org/apache/cxf/systests already added, skipping
[INFO] org/apache/cxf/systests/java2ws already added, skipping
[INFO] META-INF already added, skipping
[INFO] META-INF/DEPENDENCIES already added, skipping
[INFO] META-INF/NOTICE already added, skipping
[INFO] META-INF/LICENSE already added, skipping
[INFO] Building jar: /x1/jenkins/jenkins-slave/workspace/CXF-2.5-deploy/cxf-2.5.x-fixes/systests/wsdl_maven/java2ws/target/cxf-systests-java2ws-2.5.4-SNAPSHOT-sources.jar
[INFO] org already added, skipping
[INFO] org/apache already added, skipping
[INFO] org/apache/cxf already added, skipping
[INFO] org/apache/cxf/systests already added, skipping
[INFO] org/apache/cxf/systests/java2ws already added, skipping
[INFO] META-INF already added, skipping
[INFO] META-INF/DEPENDENCIES already added, skipping
[INFO] META-INF/NOTICE already added, skipping
[INFO] META-INF/LICENSE already added, skipping
[INFO] [javadoc:jar {execution: attach-javadocs}]
[INFO] Building jar: /x1/jenkins/jenkins-slave/workspace/CXF-2.5-deploy/cxf-2.5.x-fixes/systests/wsdl_maven/java2ws/target/cxf-systests-java2ws-2.5.4-SNAPSHOT-javadoc.jar
[INFO] [install:install {execution: default-install}]
[INFO] Installing /x1/jenkins/jenkins-slave/workspace/CXF-2.5-deploy/cxf-2.5.x-fixes/systests/wsdl_maven/java2ws/target/cxf-systests-java2ws-2.5.4-SNAPSHOT.jar to <https://builds.apache.org/job/CXF-2.5-deploy/ws/.repository/org/apache/cxf/systests/wsdl_maven/cxf-systests-java2ws/2.5.4-SNAPSHOT/cxf-systests-java2ws-2.5.4-SNAPSHOT.jar>
[INFO] Installing /x1/jenkins/jenkins-slave/workspace/CXF-2.5-deploy/cxf-2.5.x-fixes/systests/wsdl_maven/java2ws/target/generated/wsdl/HelloWorld.wsdl to <https://builds.apache.org/job/CXF-2.5-deploy/ws/.repository/org/apache/cxf/systests/wsdl_maven/cxf-systests-java2ws/2.5.4-SNAPSHOT/cxf-systests-java2ws-2.5.4-SNAPSHOT.wsdl>
[INFO] Installing /x1/jenkins/jenkins-slave/workspace/CXF-2.5-deploy/cxf-2.5.x-fixes/systests/wsdl_maven/java2ws/target/cxf-systests-java2ws-2.5.4-SNAPSHOT-sources.jar to <https://builds.apache.org/job/CXF-2.5-deploy/ws/.repository/org/apache/cxf/systests/wsdl_maven/cxf-systests-java2ws/2.5.4-SNAPSHOT/cxf-systests-java2ws-2.5.4-SNAPSHOT-sources.jar>
[INFO] Installing /x1/jenkins/jenkins-slave/workspace/CXF-2.5-deploy/cxf-2.5.x-fixes/systests/wsdl_maven/java2ws/target/cxf-systests-java2ws-2.5.4-SNAPSHOT-javadoc.jar to <https://builds.apache.org/job/CXF-2.5-deploy/ws/.repository/org/apache/cxf/systests/wsdl_maven/cxf-systests-java2ws/2.5.4-SNAPSHOT/cxf-systests-java2ws-2.5.4-SNAPSHOT-javadoc.jar>
[INFO] [deploy:deploy {execution: default-deploy}]
[INFO] Retrieving previous build number from apache.snapshots.https
[WARNING] *** CHECKSUM FAILED - Checksum failed on download: local = 'd69389d80ba7d79cb55e5708fb31b57d56b00799'; remote = '064924db5f5970aaffbb65c0409ecb14f25fe870' - RETRYING
[WARNING] *** CHECKSUM FAILED - Checksum failed on download: local = 'd69389d80ba7d79cb55e5708fb31b57d56b00799'; remote = '064924db5f5970aaffbb65c0409ecb14f25fe870' - IGNORING
Uploading: https://repository.apache.org/content/repositories/snapshots/org/apache/cxf/systests/wsdl_maven/cxf-systests-java2ws/2.5.4-SNAPSHOT/cxf-systests-java2ws-2.5.4-20120505.072355-16.jar
9K uploaded  (cxf-systests-java2ws-2.5.4-20120505.072355-16.jar)
[INFO] Uploading project information for cxf-systests-java2ws 2.5.4-20120505.072355-16
[INFO] Retrieving previous metadata from apache.snapshots.https
[INFO] Uploading repository metadata for: 'artifact org.apache.cxf.systests.wsdl_maven:cxf-systests-java2ws'
[INFO] Retrieving previous metadata from apache.snapshots.https
[WARNING] *** CHECKSUM FAILED - Checksum failed on download: local = 'd69389d80ba7d79cb55e5708fb31b57d56b00799'; remote = '064924db5f5970aaffbb65c0409ecb14f25fe870' - RETRYING
[WARNING] *** CHECKSUM FAILED - Checksum failed on download: local = 'd69389d80ba7d79cb55e5708fb31b57d56b00799'; remote = '064924db5f5970aaffbb65c0409ecb14f25fe870' - IGNORING
[INFO] Uploading repository metadata for: 'snapshot org.apache.cxf.systests.wsdl_maven:cxf-systests-java2ws:2.5.4-SNAPSHOT'
[INFO] Retrieving previous build number from apache.snapshots.https
Uploading: https://repository.apache.org/content/repositories/snapshots/org/apache/cxf/systests/wsdl_maven/cxf-systests-java2ws/2.5.4-SNAPSHOT/cxf-systests-java2ws-2.5.4-20120505.072355-16.wsdl
2K uploaded  (cxf-systests-java2ws-2.5.4-20120505.072355-16.wsdl)
[INFO] Retrieving previous build number from apache.snapshots.https
Uploading: https://repository.apache.org/content/repositories/snapshots/org/apache/cxf/systests/wsdl_maven/cxf-systests-java2ws/2.5.4-SNAPSHOT/cxf-systests-java2ws-2.5.4-20120505.072355-16-sources.jar
8K uploaded  (cxf-systests-java2ws-2.5.4-20120505.072355-16-sources.jar)
[INFO] Retrieving previous build number from apache.snapshots.https
Uploading: https://repository.apache.org/content/repositories/snapshots/org/apache/cxf/systests/wsdl_maven/cxf-systests-java2ws/2.5.4-SNAPSHOT/cxf-systests-java2ws-2.5.4-20120505.072355-16-javadoc.jar
25K uploaded  (cxf-systests-java2ws-2.5.4-20120505.072355-16-javadoc.jar)
[INFO] ------------------------------------------------------------------------
[INFO] Building Test for generating code from wsdl in repo
[INFO]    task-segment: [deploy]
[INFO] ------------------------------------------------------------------------
[INFO] [cxf-xml2fastinfoset:xml2fastinfoset {execution: xml2fastinfoset}]
[INFO] [cxf-codegen:wsdl2java {execution: generate-java-sources}]
[INFO] org.apache.cxf.systests.wsdl_maven:cxf-systests-java2ws:wsdl:2.5.4-SNAPSHOT:compile resolved to /x1/jenkins/jenkins-slave/workspace/CXF-2.5-deploy/cxf-2.5.x-fixes/systests/wsdl_maven/java2ws/target/generated/wsdl/HelloWorld.wsdl
[INFO] Resolved WSDL artifact to file /x1/jenkins/jenkins-slave/workspace/CXF-2.5-deploy/cxf-2.5.x-fixes/systests/wsdl_maven/java2ws/target/generated/wsdl/HelloWorld.wsdl
[INFO] Running code generation in fork mode...
[INFO] Building jar: /tmp/cxf-tmp-669411/cxf-codegen1617043462272455461.jar
[WARNING] May 5, 2012 7:35:11 AM org.apache.cxf.tools.wsdlto.databinding.jaxb.JAXBDataBinding checkEncoding
[WARNING] WARNING: Version 2.2.4 of JAXB XJC does not support setting an encoding.  Using default file encoding of ANSI_X3.4-1968.
[INFO] [cxf-codegen:wsdl2js {execution: generate-js-sources}]
[INFO] org.apache.cxf.systests.wsdl_maven:cxf-systests-java2ws:wsdl:2.5.4-SNAPSHOT:compile resolved to /x1/jenkins/jenkins-slave/workspace/CXF-2.5-deploy/cxf-2.5.x-fixes/systests/wsdl_maven/java2ws/target/generated/wsdl/HelloWorld.wsdl
[INFO] Resolved WSDL artifact to file /x1/jenkins/jenkins-slave/workspace/CXF-2.5-deploy/cxf-2.5.x-fixes/systests/wsdl_maven/java2ws/target/generated/wsdl/HelloWorld.wsdl
[INFO] Running code generation in fork mode...
[INFO] Building jar: /tmp/cxf-tmp-669411/cxf-codegen2255669788642381646.jar
[INFO] [remote-resources:process {execution: default}]
[debug] execute contextualize
[INFO] [resources:resources {execution: default-resources}]
[INFO] Using 'UTF-8' encoding to copy filtered resources.
[INFO] skip non existing resourceDirectory /x1/jenkins/jenkins-slave/workspace/CXF-2.5-deploy/cxf-2.5.x-fixes/systests/wsdl_maven/codegen/src/main/java
[INFO] Copying 1 resource
[INFO] skip non existing resourceDirectory /x1/jenkins/jenkins-slave/workspace/CXF-2.5-deploy/cxf-2.5.x-fixes/systests/wsdl_maven/codegen/src/main/resources-filtered
[INFO] skip non existing resourceDirectory /x1/jenkins/jenkins-slave/workspace/CXF-2.5-deploy/cxf-2.5.x-fixes/systests/wsdl_maven/codegen/target/generated/src/main/resources
[INFO] Copying 3 resources
[INFO] [compiler:compile {execution: default-compile}]
[INFO] Compiling 8 source files to /x1/jenkins/jenkins-slave/workspace/CXF-2.5-deploy/cxf-2.5.x-fixes/systests/wsdl_maven/codegen/target/classes
[debug] execute contextualize
[INFO] [resources:testResources {execution: default-testResources}]
[INFO] Using 'UTF-8' encoding to copy filtered resources.
[INFO] skip non existing resourceDirectory /x1/jenkins/jenkins-slave/workspace/CXF-2.5-deploy/cxf-2.5.x-fixes/systests/wsdl_maven/codegen/src/test/java
[INFO] skip non existing resourceDirectory /x1/jenkins/jenkins-slave/workspace/CXF-2.5-deploy/cxf-2.5.x-fixes/systests/wsdl_maven/codegen/src/test/resources
[INFO] skip non existing resourceDirectory /x1/jenkins/jenkins-slave/workspace/CXF-2.5-deploy/cxf-2.5.x-fixes/systests/wsdl_maven/codegen/target/generated/src/test/resources
[INFO] Copying 3 resources
[INFO] [compiler:testCompile {execution: default-testCompile}]
[INFO] No sources to compile
[INFO] [surefire:test {execution: default-test}]
[INFO] Tests are skipped.
[INFO] [jar:jar {execution: default-jar}]
[INFO] Building jar: /x1/jenkins/jenkins-slave/workspace/CXF-2.5-deploy/cxf-2.5.x-fixes/systests/wsdl_maven/codegen/target/cxf-systests-codegen-2.5.4-SNAPSHOT.jar
[INFO] [source:jar-no-fork {execution: attach-sources}]
[INFO] META-INF already added, skipping
[INFO] META-INF/DEPENDENCIES already added, skipping
[INFO] META-INF/NOTICE already added, skipping
[INFO] META-INF/LICENSE already added, skipping
[INFO] Building jar: /x1/jenkins/jenkins-slave/workspace/CXF-2.5-deploy/cxf-2.5.x-fixes/systests/wsdl_maven/codegen/target/cxf-systests-codegen-2.5.4-SNAPSHOT-sources.jar
[INFO] META-INF already added, skipping
[INFO] META-INF/DEPENDENCIES already added, skipping
[INFO] META-INF/NOTICE already added, skipping
[INFO] META-INF/LICENSE already added, skipping
[INFO] [javadoc:jar {execution: attach-javadocs}]
[INFO] Building jar: /x1/jenkins/jenkins-slave/workspace/CXF-2.5-deploy/cxf-2.5.x-fixes/systests/wsdl_maven/codegen/target/cxf-systests-codegen-2.5.4-SNAPSHOT-javadoc.jar
[INFO] [invoker:install {execution: integration-test}]
[INFO] Installing /x1/jenkins/jenkins-slave/workspace/CXF-2.5-deploy/cxf-2.5.x-fixes/systests/wsdl_maven/java2ws/pom.xml to /x1/jenkins/jenkins-slave/workspace/CXF-2.5-deploy/cxf-2.5.x-fixes/systests/wsdl_maven/codegen/target/local-repo/org/apache/cxf/systests/wsdl_maven/cxf-systests-java2ws/2.5.4-SNAPSHOT/cxf-systests-java2ws-2.5.4-SNAPSHOT.pom
[INFO] Installing /x1/jenkins/jenkins-slave/workspace/CXF-2.5-deploy/cxf-2.5.x-fixes/systests/wsdl_maven/java2ws/target/cxf-systests-java2ws-2.5.4-SNAPSHOT.jar to /x1/jenkins/jenkins-slave/workspace/CXF-2.5-deploy/cxf-2.5.x-fixes/systests/wsdl_maven/codegen/target/local-repo/org/apache/cxf/systests/wsdl_maven/cxf-systests-java2ws/2.5.4-SNAPSHOT/cxf-systests-java2ws-2.5.4-20120505.072355-16.jar
[INFO] Installing /x1/jenkins/jenkins-slave/workspace/CXF-2.5-deploy/cxf-2.5.x-fixes/systests/wsdl_maven/java2ws/target/generated/wsdl/HelloWorld.wsdl to /x1/jenkins/jenkins-slave/workspace/CXF-2.5-deploy/cxf-2.5.x-fixes/systests/wsdl_maven/codegen/target/local-repo/org/apache/cxf/systests/wsdl_maven/cxf-systests-java2ws/2.5.4-SNAPSHOT/cxf-systests-java2ws-2.5.4-20120505.072355-16.wsdl
[INFO] Installing /x1/jenkins/jenkins-slave/workspace/CXF-2.5-deploy/cxf-2.5.x-fixes/systests/wsdl_maven/java2ws/target/cxf-systests-java2ws-2.5.4-SNAPSHOT-sources.jar to /x1/jenkins/jenkins-slave/workspace/CXF-2.5-deploy/cxf-2.5.x-fixes/systests/wsdl_maven/codegen/target/local-repo/org/apache/cxf/systests/wsdl_maven/cxf-systests-java2ws/2.5.4-SNAPSHOT/cxf-systests-java2ws-2.5.4-20120505.072355-16-sources.jar
[INFO] Installing /x1/jenkins/jenkins-slave/workspace/CXF-2.5-deploy/cxf-2.5.x-fixes/systests/wsdl_maven/java2ws/target/cxf-systests-java2ws-2.5.4-SNAPSHOT-javadoc.jar to /x1/jenkins/jenkins-slave/workspace/CXF-2.5-deploy/cxf-2.5.x-fixes/systests/wsdl_maven/codegen/target/local-repo/org/apache/cxf/systests/wsdl_maven/cxf-systests-java2ws/2.5.4-SNAPSHOT/cxf-systests-java2ws-2.5.4-20120505.072355-16-javadoc.jar
[INFO] Installing /x1/jenkins/jenkins-slave/workspace/CXF-2.5-deploy/cxf-2.5.x-fixes/parent/pom.xml to /x1/jenkins/jenkins-slave/workspace/CXF-2.5-deploy/cxf-2.5.x-fixes/systests/wsdl_maven/codegen/target/local-repo/org/apache/cxf/cxf-parent/2.5.4-SNAPSHOT/cxf-parent-2.5.4-20120505.072355-17.pom
[INFO] Installing /x1/jenkins/jenkins-slave/workspace/CXF-2.5-deploy/cxf-2.5.x-fixes/pom.xml to /x1/jenkins/jenkins-slave/workspace/CXF-2.5-deploy/cxf-2.5.x-fixes/systests/wsdl_maven/codegen/target/local-repo/org/apache/cxf/cxf/2.5.4-SNAPSHOT/cxf-2.5.4-20120505.072355-17.pom
[INFO] Installing /x1/jenkins/jenkins-slave/workspace/CXF-2.5-deploy/cxf-2.5.x-fixes/rt/frontend/jaxws/pom.xml to /x1/jenkins/jenkins-slave/workspace/CXF-2.5-deploy/cxf-2.5.x-fixes/systests/wsdl_maven/codegen/target/local-repo/org/apache/cxf/cxf-rt-frontend-jaxws/2.5.4-SNAPSHOT/cxf-rt-frontend-jaxws-2.5.4-SNAPSHOT.pom
[INFO] Installing /x1/jenkins/jenkins-slave/workspace/CXF-2.5-deploy/cxf-2.5.x-fixes/rt/frontend/jaxws/target/cxf-rt-frontend-jaxws-2.5.4-SNAPSHOT.jar to /x1/jenkins/jenkins-slave/workspace/CXF-2.5-deploy/cxf-2.5.x-fixes/systests/wsdl_maven/codegen/target/local-repo/org/apache/cxf/cxf-rt-frontend-jaxws/2.5.4-SNAPSHOT/cxf-rt-frontend-jaxws-2.5.4-20120505.072355-17.jar
[INFO] Installing /x1/jenkins/jenkins-slave/workspace/CXF-2.5-deploy/cxf-2.5.x-fixes/rt/frontend/jaxws/target/cxf-rt-frontend-jaxws-2.5.4-SNAPSHOT-sources.jar to /x1/jenkins/jenkins-slave/workspace/CXF-2.5-deploy/cxf-2.5.x-fixes/systests/wsdl_maven/codegen/target/local-repo/org/apache/cxf/cxf-rt-frontend-jaxws/2.5.4-SNAPSHOT/cxf-rt-frontend-jaxws-2.5.4-20120505.072355-17-sources.jar
[INFO] Installing /x1/jenkins/jenkins-slave/workspace/CXF-2.5-deploy/cxf-2.5.x-fixes/rt/frontend/jaxws/target/cxf-rt-frontend-jaxws-2.5.4-SNAPSHOT-javadoc.jar to /x1/jenkins/jenkins-slave/workspace/CXF-2.5-deploy/cxf-2.5.x-fixes/systests/wsdl_maven/codegen/target/local-repo/org/apache/cxf/cxf-rt-frontend-jaxws/2.5.4-SNAPSHOT/cxf-rt-frontend-jaxws-2.5.4-20120505.072355-17-javadoc.jar
[INFO] Installing /x1/jenkins/jenkins-slave/workspace/CXF-2.5-deploy/cxf-2.5.x-fixes/api/pom.xml to /x1/jenkins/jenkins-slave/workspace/CXF-2.5-deploy/cxf-2.5.x-fixes/systests/wsdl_maven/codegen/target/local-repo/org/apache/cxf/cxf-api/2.5.4-SNAPSHOT/cxf-api-2.5.4-SNAPSHOT.pom
[INFO] Installing /x1/jenkins/jenkins-slave/workspace/CXF-2.5-deploy/cxf-2.5.x-fixes/api/target/cxf-api-2.5.4-SNAPSHOT.jar to /x1/jenkins/jenkins-slave/workspace/CXF-2.5-deploy/cxf-2.5.x-fixes/systests/wsdl_maven/codegen/target/local-repo/org/apache/cxf/cxf-api/2.5.4-SNAPSHOT/cxf-api-2.5.4-20120505.072355-17.jar
[INFO] Installing /x1/jenkins/jenkins-slave/workspace/CXF-2.5-deploy/cxf-2.5.x-fixes/api/target/cxf-api-2.5.4-SNAPSHOT-sources.jar to /x1/jenkins/jenkins-slave/workspace/CXF-2.5-deploy/cxf-2.5.x-fixes/systests/wsdl_maven/codegen/target/local-repo/org/apache/cxf/cxf-api/2.5.4-SNAPSHOT/cxf-api-2.5.4-20120505.072355-17-sources.jar
[INFO] Installing /x1/jenkins/jenkins-slave/workspace/CXF-2.5-deploy/cxf-2.5.x-fixes/api/target/cxf-api-2.5.4-SNAPSHOT-javadoc.jar to /x1/jenkins/jenkins-slave/workspace/CXF-2.5-deploy/cxf-2.5.x-fixes/systests/wsdl_maven/codegen/target/local-repo/org/apache/cxf/cxf-api/2.5.4-SNAPSHOT/cxf-api-2.5.4-20120505.072355-17-javadoc.jar
[INFO] Installing /x1/jenkins/jenkins-slave/workspace/CXF-2.5-deploy/cxf-2.5.x-fixes/common/common/pom.xml to /x1/jenkins/jenkins-slave/workspace/CXF-2.5-deploy/cxf-2.5.x-fixes/systests/wsdl_maven/codegen/target/local-repo/org/apache/cxf/cxf-common-utilities/2.5.4-SNAPSHOT/cxf-common-utilities-2.5.4-SNAPSHOT.pom
[INFO] Installing /x1/jenkins/jenkins-slave/workspace/CXF-2.5-deploy/cxf-2.5.x-fixes/common/common/target/cxf-common-utilities-2.5.4-SNAPSHOT.jar to /x1/jenkins/jenkins-slave/workspace/CXF-2.5-deploy/cxf-2.5.x-fixes/systests/wsdl_maven/codegen/target/local-repo/org/apache/cxf/cxf-common-utilities/2.5.4-SNAPSHOT/cxf-common-utilities-2.5.4-20120505.072355-17.jar
[INFO] Installing /x1/jenkins/jenkins-slave/workspace/CXF-2.5-deploy/cxf-2.5.x-fixes/common/common/target/cxf-common-utilities-2.5.4-SNAPSHOT-sources.jar to /x1/jenkins/jenkins-slave/workspace/CXF-2.5-deploy/cxf-2.5.x-fixes/systests/wsdl_maven/codegen/target/local-repo/org/apache/cxf/cxf-common-utilities/2.5.4-SNAPSHOT/cxf-common-utilities-2.5.4-20120505.072355-17-sources.jar
[INFO] Installing /x1/jenkins/jenkins-slave/workspace/CXF-2.5-deploy/cxf-2.5.x-fixes/common/common/target/cxf-common-utilities-2.5.4-SNAPSHOT-javadoc.jar to /x1/jenkins/jenkins-slave/workspace/CXF-2.5-deploy/cxf-2.5.x-fixes/systests/wsdl_maven/codegen/target/local-repo/org/apache/cxf/cxf-common-utilities/2.5.4-SNAPSHOT/cxf-common-utilities-2.5.4-20120505.072355-17-javadoc.jar
[INFO] Installing /x1/jenkins/jenkins-slave/workspace/CXF-2.5-deploy/cxf-2.5.x-fixes/rt/core/pom.xml to /x1/jenkins/jenkins-slave/workspace/CXF-2.5-deploy/cxf-2.5.x-fixes/systests/wsdl_maven/codegen/target/local-repo/org/apache/cxf/cxf-rt-core/2.5.4-SNAPSHOT/cxf-rt-core-2.5.4-SNAPSHOT.pom
[INFO] Installing /x1/jenkins/jenkins-slave/workspace/CXF-2.5-deploy/cxf-2.5.x-fixes/rt/core/target/cxf-rt-core-2.5.4-SNAPSHOT.jar to /x1/jenkins/jenkins-slave/workspace/CXF-2.5-deploy/cxf-2.5.x-fixes/systests/wsdl_maven/codegen/target/local-repo/org/apache/cxf/cxf-rt-core/2.5.4-SNAPSHOT/cxf-rt-core-2.5.4-20120505.072355-17.jar
[INFO] Installing /x1/jenkins/jenkins-slave/workspace/CXF-2.5-deploy/cxf-2.5.x-fixes/rt/core/target/cxf-rt-core-2.5.4-SNAPSHOT-sources.jar to /x1/jenkins/jenkins-slave/workspace/CXF-2.5-deploy/cxf-2.5.x-fixes/systests/wsdl_maven/codegen/target/local-repo/org/apache/cxf/cxf-rt-core/2.5.4-SNAPSHOT/cxf-rt-core-2.5.4-20120505.072355-17-sources.jar
[INFO] Installing /x1/jenkins/jenkins-slave/workspace/CXF-2.5-deploy/cxf-2.5.x-fixes/rt/core/target/cxf-rt-core-2.5.4-SNAPSHOT-javadoc.jar to /x1/jenkins/jenkins-slave/workspace/CXF-2.5-deploy/cxf-2.5.x-fixes/systests/wsdl_maven/codegen/target/local-repo/org/apache/cxf/cxf-rt-core/2.5.4-SNAPSHOT/cxf-rt-core-2.5.4-20120505.072355-17-javadoc.jar
[INFO] Installing /x1/jenkins/jenkins-slave/workspace/CXF-2.5-deploy/cxf-2.5.x-fixes/rt/bindings/soap/pom.xml to /x1/jenkins/jenkins-slave/workspace/CXF-2.5-deploy/cxf-2.5.x-fixes/systests/wsdl_maven/codegen/target/local-repo/org/apache/cxf/cxf-rt-bindings-soap/2.5.4-SNAPSHOT/cxf-rt-bindings-soap-2.5.4-SNAPSHOT.pom
[INFO] Installing /x1/jenkins/jenkins-slave/workspace/CXF-2.5-deploy/cxf-2.5.x-fixes/rt/bindings/soap/target/cxf-rt-bindings-soap-2.5.4-SNAPSHOT.jar to /x1/jenkins/jenkins-slave/workspace/CXF-2.5-deploy/cxf-2.5.x-fixes/systests/wsdl_maven/codegen/target/local-repo/org/apache/cxf/cxf-rt-bindings-soap/2.5.4-SNAPSHOT/cxf-rt-bindings-soap-2.5.4-20120505.072355-17.jar
[INFO] Installing /x1/jenkins/jenkins-slave/workspace/CXF-2.5-deploy/cxf-2.5.x-fixes/rt/bindings/soap/target/cxf-rt-bindings-soap-2.5.4-SNAPSHOT-sources.jar to /x1/jenkins/jenkins-slave/workspace/CXF-2.5-deploy/cxf-2.5.x-fixes/systests/wsdl_maven/codegen/target/local-repo/org/apache/cxf/cxf-rt-bindings-soap/2.5.4-SNAPSHOT/cxf-rt-bindings-soap-2.5.4-20120505.072355-17-sources.jar
[INFO] Installing /x1/jenkins/jenkins-slave/workspace/CXF-2.5-deploy/cxf-2.5.x-fixes/rt/bindings/soap/target/cxf-rt-bindings-soap-2.5.4-SNAPSHOT-javadoc.jar to /x1/jenkins/jenkins-slave/workspace/CXF-2.5-deploy/cxf-2.5.x-fixes/systests/wsdl_maven/codegen/target/local-repo/org/apache/cxf/cxf-rt-bindings-soap/2.5.4-SNAPSHOT/cxf-rt-bindings-soap-2.5.4-20120505.072355-17-javadoc.jar
[INFO] Installing /x1/jenkins/jenkins-slave/workspace/CXF-2.5-deploy/cxf-2.5.x-fixes/tools/common/pom.xml to /x1/jenkins/jenkins-slave/workspace/CXF-2.5-deploy/cxf-2.5.x-fixes/systests/wsdl_maven/codegen/target/local-repo/org/apache/cxf/cxf-tools-common/2.5.4-SNAPSHOT/cxf-tools-common-2.5.4-SNAPSHOT.pom
[INFO] Installing /x1/jenkins/jenkins-slave/workspace/CXF-2.5-deploy/cxf-2.5.x-fixes/tools/common/target/cxf-tools-common-2.5.4-SNAPSHOT.jar to /x1/jenkins/jenkins-slave/workspace/CXF-2.5-deploy/cxf-2.5.x-fixes/systests/wsdl_maven/codegen/target/local-repo/org/apache/cxf/cxf-tools-common/2.5.4-SNAPSHOT/cxf-tools-common-2.5.4-20120505.072355-17.jar
[INFO] Installing /x1/jenkins/jenkins-slave/workspace/CXF-2.5-deploy/cxf-2.5.x-fixes/tools/common/target/cxf-tools-common-2.5.4-SNAPSHOT-sources.jar to /x1/jenkins/jenkins-slave/workspace/CXF-2.5-deploy/cxf-2.5.x-fixes/systests/wsdl_maven/codegen/target/local-repo/org/apache/cxf/cxf-tools-common/2.5.4-SNAPSHOT/cxf-tools-common-2.5.4-20120505.072355-17-sources.jar
[INFO] Installing /x1/jenkins/jenkins-slave/workspace/CXF-2.5-deploy/cxf-2.5.x-fixes/tools/common/target/cxf-tools-common-2.5.4-SNAPSHOT-javadoc.jar to /x1/jenkins/jenkins-slave/workspace/CXF-2.5-deploy/cxf-2.5.x-fixes/systests/wsdl_maven/codegen/target/local-repo/org/apache/cxf/cxf-tools-common/2.5.4-SNAPSHOT/cxf-tools-common-2.5.4-20120505.072355-17-javadoc.jar
[INFO] Installing /x1/jenkins/jenkins-slave/workspace/CXF-2.5-deploy/cxf-2.5.x-fixes/rt/databinding/jaxb/pom.xml to /x1/jenkins/jenkins-slave/workspace/CXF-2.5-deploy/cxf-2.5.x-fixes/systests/wsdl_maven/codegen/target/local-repo/org/apache/cxf/cxf-rt-databinding-jaxb/2.5.4-SNAPSHOT/cxf-rt-databinding-jaxb-2.5.4-SNAPSHOT.pom
[INFO] Installing /x1/jenkins/jenkins-slave/workspace/CXF-2.5-deploy/cxf-2.5.x-fixes/rt/databinding/jaxb/target/cxf-rt-databinding-jaxb-2.5.4-SNAPSHOT.jar to /x1/jenkins/jenkins-slave/workspace/CXF-2.5-deploy/cxf-2.5.x-fixes/systests/wsdl_maven/codegen/target/local-repo/org/apache/cxf/cxf-rt-databinding-jaxb/2.5.4-SNAPSHOT/cxf-rt-databinding-jaxb-2.5.4-20120505.072355-17.jar
[INFO] Installing /x1/jenkins/jenkins-slave/workspace/CXF-2.5-deploy/cxf-2.5.x-fixes/rt/databinding/jaxb/target/cxf-rt-databinding-jaxb-2.5.4-SNAPSHOT-sources.jar to /x1/jenkins/jenkins-slave/workspace/CXF-2.5-deploy/cxf-2.5.x-fixes/systests/wsdl_maven/codegen/target/local-repo/org/apache/cxf/cxf-rt-databinding-jaxb/2.5.4-SNAPSHOT/cxf-rt-databinding-jaxb-2.5.4-20120505.072355-17-sources.jar
[INFO] Installing /x1/jenkins/jenkins-slave/workspace/CXF-2.5-deploy/cxf-2.5.x-fixes/rt/databinding/jaxb/target/cxf-rt-databinding-jaxb-2.5.4-SNAPSHOT-javadoc.jar to /x1/jenkins/jenkins-slave/workspace/CXF-2.5-deploy/cxf-2.5.x-fixes/systests/wsdl_maven/codegen/target/local-repo/org/apache/cxf/cxf-rt-databinding-jaxb/2.5.4-SNAPSHOT/cxf-rt-databinding-jaxb-2.5.4-20120505.072355-17-javadoc.jar
[INFO] Installing /x1/jenkins/jenkins-slave/workspace/CXF-2.5-deploy/cxf-2.5.x-fixes/rt/bindings/xml/pom.xml to /x1/jenkins/jenkins-slave/workspace/CXF-2.5-deploy/cxf-2.5.x-fixes/systests/wsdl_maven/codegen/target/local-repo/org/apache/cxf/cxf-rt-bindings-xml/2.5.4-SNAPSHOT/cxf-rt-bindings-xml-2.5.4-SNAPSHOT.pom
[INFO] Installing /x1/jenkins/jenkins-slave/workspace/CXF-2.5-deploy/cxf-2.5.x-fixes/rt/bindings/xml/target/cxf-rt-bindings-xml-2.5.4-SNAPSHOT.jar to /x1/jenkins/jenkins-slave/workspace/CXF-2.5-deploy/cxf-2.5.x-fixes/systests/wsdl_maven/codegen/target/local-repo/org/apache/cxf/cxf-rt-bindings-xml/2.5.4-SNAPSHOT/cxf-rt-bindings-xml-2.5.4-20120505.072355-17.jar
[INFO] Installing /x1/jenkins/jenkins-slave/workspace/CXF-2.5-deploy/cxf-2.5.x-fixes/rt/bindings/xml/target/cxf-rt-bindings-xml-2.5.4-SNAPSHOT-sources.jar to /x1/jenkins/jenkins-slave/workspace/CXF-2.5-deploy/cxf-2.5.x-fixes/systests/wsdl_maven/codegen/target/local-repo/org/apache/cxf/cxf-rt-bindings-xml/2.5.4-SNAPSHOT/cxf-rt-bindings-xml-2.5.4-20120505.072355-17-sources.jar
[INFO] Installing /x1/jenkins/jenkins-slave/workspace/CXF-2.5-deploy/cxf-2.5.x-fixes/rt/bindings/xml/target/cxf-rt-bindings-xml-2.5.4-SNAPSHOT-javadoc.jar to /x1/jenkins/jenkins-slave/workspace/CXF-2.5-deploy/cxf-2.5.x-fixes/systests/wsdl_maven/codegen/target/local-repo/org/apache/cxf/cxf-rt-bindings-xml/2.5.4-SNAPSHOT/cxf-rt-bindings-xml-2.5.4-20120505.072355-17-javadoc.jar
[INFO] Installing /x1/jenkins/jenkins-slave/workspace/CXF-2.5-deploy/cxf-2.5.x-fixes/rt/frontend/simple/pom.xml to /x1/jenkins/jenkins-slave/workspace/CXF-2.5-deploy/cxf-2.5.x-fixes/systests/wsdl_maven/codegen/target/local-repo/org/apache/cxf/cxf-rt-frontend-simple/2.5.4-SNAPSHOT/cxf-rt-frontend-simple-2.5.4-SNAPSHOT.pom
[INFO] Installing /x1/jenkins/jenkins-slave/workspace/CXF-2.5-deploy/cxf-2.5.x-fixes/rt/frontend/simple/target/cxf-rt-frontend-simple-2.5.4-SNAPSHOT.jar to /x1/jenkins/jenkins-slave/workspace/CXF-2.5-deploy/cxf-2.5.x-fixes/systests/wsdl_maven/codegen/target/local-repo/org/apache/cxf/cxf-rt-frontend-simple/2.5.4-SNAPSHOT/cxf-rt-frontend-simple-2.5.4-20120505.072355-17.jar
[INFO] Installing /x1/jenkins/jenkins-slave/workspace/CXF-2.5-deploy/cxf-2.5.x-fixes/rt/frontend/simple/target/cxf-rt-frontend-simple-2.5.4-SNAPSHOT-sources.jar to /x1/jenkins/jenkins-slave/workspace/CXF-2.5-deploy/cxf-2.5.x-fixes/systests/wsdl_maven/codegen/target/local-repo/org/apache/cxf/cxf-rt-frontend-simple/2.5.4-SNAPSHOT/cxf-rt-frontend-simple-2.5.4-20120505.072355-17-sources.jar
[INFO] Installing /x1/jenkins/jenkins-slave/workspace/CXF-2.5-deploy/cxf-2.5.x-fixes/rt/frontend/simple/target/cxf-rt-frontend-simple-2.5.4-SNAPSHOT-javadoc.jar to /x1/jenkins/jenkins-slave/workspace/CXF-2.5-deploy/cxf-2.5.x-fixes/systests/wsdl_maven/codegen/target/local-repo/org/apache/cxf/cxf-rt-frontend-simple/2.5.4-SNAPSHOT/cxf-rt-frontend-simple-2.5.4-20120505.072355-17-javadoc.jar
[INFO] Installing /x1/jenkins/jenkins-slave/workspace/CXF-2.5-deploy/cxf-2.5.x-fixes/rt/transports/http/pom.xml to /x1/jenkins/jenkins-slave/workspace/CXF-2.5-deploy/cxf-2.5.x-fixes/systests/wsdl_maven/codegen/target/local-repo/org/apache/cxf/cxf-rt-transports-http/2.5.4-SNAPSHOT/cxf-rt-transports-http-2.5.4-SNAPSHOT.pom
[INFO] Installing /x1/jenkins/jenkins-slave/workspace/CXF-2.5-deploy/cxf-2.5.x-fixes/rt/transports/http/target/cxf-rt-transports-http-2.5.4-SNAPSHOT.jar to /x1/jenkins/jenkins-slave/workspace/CXF-2.5-deploy/cxf-2.5.x-fixes/systests/wsdl_maven/codegen/target/local-repo/org/apache/cxf/cxf-rt-transports-http/2.5.4-SNAPSHOT/cxf-rt-transports-http-2.5.4-20120505.072355-17.jar
[INFO] Installing /x1/jenkins/jenkins-slave/workspace/CXF-2.5-deploy/cxf-2.5.x-fixes/rt/transports/http/target/cxf-rt-transports-http-2.5.4-SNAPSHOT-sources.jar to /x1/jenkins/jenkins-slave/workspace/CXF-2.5-deploy/cxf-2.5.x-fixes/systests/wsdl_maven/codegen/target/local-repo/org/apache/cxf/cxf-rt-transports-http/2.5.4-SNAPSHOT/cxf-rt-transports-http-2.5.4-20120505.072355-17-sources.jar
[INFO] Installing /x1/jenkins/jenkins-slave/workspace/CXF-2.5-deploy/cxf-2.5.x-fixes/rt/transports/http/target/cxf-rt-transports-http-2.5.4-SNAPSHOT-javadoc.jar to /x1/jenkins/jenkins-slave/workspace/CXF-2.5-deploy/cxf-2.5.x-fixes/systests/wsdl_maven/codegen/target/local-repo/org/apache/cxf/cxf-rt-transports-http/2.5.4-SNAPSHOT/cxf-rt-transports-http-2.5.4-20120505.072355-17-javadoc.jar
[INFO] Installing /x1/jenkins/jenkins-slave/workspace/CXF-2.5-deploy/cxf-2.5.x-fixes/rt/transports/common/pom.xml to /x1/jenkins/jenkins-slave/workspace/CXF-2.5-deploy/cxf-2.5.x-fixes/systests/wsdl_maven/codegen/target/local-repo/org/apache/cxf/cxf-rt-transports-common/2.5.4-SNAPSHOT/cxf-rt-transports-common-2.5.4-SNAPSHOT.pom
[INFO] Installing /x1/jenkins/jenkins-slave/workspace/CXF-2.5-deploy/cxf-2.5.x-fixes/rt/transports/common/target/cxf-rt-transports-common-2.5.4-SNAPSHOT.jar to /x1/jenkins/jenkins-slave/workspace/CXF-2.5-deploy/cxf-2.5.x-fixes/systests/wsdl_maven/codegen/target/local-repo/org/apache/cxf/cxf-rt-transports-common/2.5.4-SNAPSHOT/cxf-rt-transports-common-2.5.4-20120505.072355-17.jar
[INFO] Installing /x1/jenkins/jenkins-slave/workspace/CXF-2.5-deploy/cxf-2.5.x-fixes/rt/transports/common/target/cxf-rt-transports-common-2.5.4-SNAPSHOT-sources.jar to /x1/jenkins/jenkins-slave/workspace/CXF-2.5-deploy/cxf-2.5.x-fixes/systests/wsdl_maven/codegen/target/local-repo/org/apache/cxf/cxf-rt-transports-common/2.5.4-SNAPSHOT/cxf-rt-transports-common-2.5.4-20120505.072355-17-sources.jar
[INFO] Installing /x1/jenkins/jenkins-slave/workspace/CXF-2.5-deploy/cxf-2.5.x-fixes/rt/transports/common/target/cxf-rt-transports-common-2.5.4-SNAPSHOT-javadoc.jar to /x1/jenkins/jenkins-slave/workspace/CXF-2.5-deploy/cxf-2.5.x-fixes/systests/wsdl_maven/codegen/target/local-repo/org/apache/cxf/cxf-rt-transports-common/2.5.4-SNAPSHOT/cxf-rt-transports-common-2.5.4-20120505.072355-17-javadoc.jar
[INFO] Installing /x1/jenkins/jenkins-slave/workspace/CXF-2.5-deploy/cxf-2.5.x-fixes/rt/ws/addr/pom.xml to /x1/jenkins/jenkins-slave/workspace/CXF-2.5-deploy/cxf-2.5.x-fixes/systests/wsdl_maven/codegen/target/local-repo/org/apache/cxf/cxf-rt-ws-addr/2.5.4-SNAPSHOT/cxf-rt-ws-addr-2.5.4-SNAPSHOT.pom
[INFO] Installing /x1/jenkins/jenkins-slave/workspace/CXF-2.5-deploy/cxf-2.5.x-fixes/rt/ws/addr/target/cxf-rt-ws-addr-2.5.4-SNAPSHOT.jar to /x1/jenkins/jenkins-slave/workspace/CXF-2.5-deploy/cxf-2.5.x-fixes/systests/wsdl_maven/codegen/target/local-repo/org/apache/cxf/cxf-rt-ws-addr/2.5.4-SNAPSHOT/cxf-rt-ws-addr-2.5.4-20120505.072355-17.jar
[INFO] Installing /x1/jenkins/jenkins-slave/workspace/CXF-2.5-deploy/cxf-2.5.x-fixes/rt/ws/addr/target/cxf-rt-ws-addr-2.5.4-SNAPSHOT-sources.jar to /x1/jenkins/jenkins-slave/workspace/CXF-2.5-deploy/cxf-2.5.x-fixes/systests/wsdl_maven/codegen/target/local-repo/org/apache/cxf/cxf-rt-ws-addr/2.5.4-SNAPSHOT/cxf-rt-ws-addr-2.5.4-20120505.072355-17-sources.jar
[INFO] Installing /x1/jenkins/jenkins-slave/workspace/CXF-2.5-deploy/cxf-2.5.x-fixes/rt/ws/addr/target/cxf-rt-ws-addr-2.5.4-SNAPSHOT-javadoc.jar to /x1/jenkins/jenkins-slave/workspace/CXF-2.5-deploy/cxf-2.5.x-fixes/systests/wsdl_maven/codegen/target/local-repo/org/apache/cxf/cxf-rt-ws-addr/2.5.4-SNAPSHOT/cxf-rt-ws-addr-2.5.4-20120505.072355-17-javadoc.jar
[INFO] Installing /x1/jenkins/jenkins-slave/workspace/CXF-2.5-deploy/cxf-2.5.x-fixes/systests/wsdl_maven/codegen/pom.xml to /x1/jenkins/jenkins-slave/workspace/CXF-2.5-deploy/cxf-2.5.x-fixes/systests/wsdl_maven/codegen/target/local-repo/org/apache/cxf/systests/wsdl_maven/cxf-systests-codegen/2.5.4-SNAPSHOT/cxf-systests-codegen-2.5.4-SNAPSHOT.pom
[INFO] Installing /x1/jenkins/jenkins-slave/workspace/CXF-2.5-deploy/cxf-2.5.x-fixes/systests/wsdl_maven/codegen/target/cxf-systests-codegen-2.5.4-SNAPSHOT.jar to /x1/jenkins/jenkins-slave/workspace/CXF-2.5-deploy/cxf-2.5.x-fixes/systests/wsdl_maven/codegen/target/local-repo/org/apache/cxf/systests/wsdl_maven/cxf-systests-codegen/2.5.4-SNAPSHOT/cxf-systests-codegen-2.5.4-SNAPSHOT.jar
[INFO] Installing /x1/jenkins/jenkins-slave/workspace/CXF-2.5-deploy/cxf-2.5.x-fixes/systests/wsdl_maven/codegen/target/cxf-systests-codegen-2.5.4-SNAPSHOT-sources.jar to /x1/jenkins/jenkins-slave/workspace/CXF-2.5-deploy/cxf-2.5.x-fixes/systests/wsdl_maven/codegen/target/local-repo/org/apache/cxf/systests/wsdl_maven/cxf-systests-codegen/2.5.4-SNAPSHOT/cxf-systests-codegen-2.5.4-SNAPSHOT-sources.jar
[INFO] Installing /x1/jenkins/jenkins-slave/workspace/CXF-2.5-deploy/cxf-2.5.x-fixes/systests/wsdl_maven/codegen/target/cxf-systests-codegen-2.5.4-SNAPSHOT-javadoc.jar to /x1/jenkins/jenkins-slave/workspace/CXF-2.5-deploy/cxf-2.5.x-fixes/systests/wsdl_maven/codegen/target/local-repo/org/apache/cxf/systests/wsdl_maven/cxf-systests-codegen/2.5.4-SNAPSHOT/cxf-systests-codegen-2.5.4-SNAPSHOT-javadoc.jar
[INFO] [invoker:integration-test {execution: integration-test}]
[INFO] Building: it-parent/pom.xml
[INFO] ..SUCCESS (2.0 s)
[INFO] Building: cxf-4004/pom.xml
[INFO] ..FAILED (3.8 s)
[INFO]   The build exited with code 1. See /x1/jenkins/jenkins-slave/workspace/CXF-2.5-deploy/cxf-2.5.x-fixes/systests/wsdl_maven/codegen/target/it/cxf-4004/build.log for details.
[INFO] [invoker:verify {execution: integration-test}]
[INFO] -------------------------------------------------
[INFO] Build Summary:
[INFO]   Passed: 1, Failed: 1, Errors: 0, Skipped: 0
[INFO] -------------------------------------------------
[ERROR] The following builds failed:
[ERROR] *  cxf-4004/pom.xml
[INFO] -------------------------------------------------
[INFO] ------------------------------------------------------------------------
[ERROR] BUILD FAILURE
[INFO] ------------------------------------------------------------------------
[INFO] : org.apache.maven.plugin.invoker.InvokerSession@d6df86
1 build failed.
[INFO] ------------------------------------------------------------------------
[INFO] For more information, run Maven with the -e switch
[INFO] ------------------------------------------------------------------------
[INFO] Total time: 11 minutes 38 seconds
[INFO] Finished at: Sat May 05 07:35:24 GMT 2012
[INFO] Final Memory: 341M/474M
[INFO] ------------------------------------------------------------------------
Build step 'Invoke top-level Maven targets' marked build as failure
[locks-and-latches] Releasing all the locks
[locks-and-latches] All the locks released

Mime
View raw message