cxf-notifications mailing list archives

Site index · List index
Message view « Date » · « Thread »
Top « Date » · « Thread »
From Apache Jenkins Server <jenk...@builds.apache.org>
Subject Build failed in Jenkins: CXF-2.5-deploy #110
Date Fri, 15 Jun 2012 08:27:22 GMT
See <https://builds.apache.org/job/CXF-2.5-deploy/110/changes>

Changes:

[dkulp] Blocking revisions 1348210,1348215,1348219,1348863,1348864,1349020,1349021,1349023,1349024,1349553,1349554,1350323,1350324
via  git from
https://svn.apache.org/repos/asf/cxf/branches/2.6.x-fixes

........
  r1348210 | dkulp | 2012-06-08 15:56:23 -0400 (Fri, 08 Jun 2012) | 2 lines
  
  Create 2.6.x-fixes branch
  
........
........
  r1348215 | dkulp | 2012-06-08 16:00:44 -0400 (Fri, 08 Jun 2012) | 2 lines
  
  Initialize merge tracking
  
........
........
  r1348219 | dkulp | 2012-06-08 16:01:47 -0400 (Fri, 08 Jun 2012) | 2 lines
  
  Set proper scm locations for new 2.6.x branch
  
........
........
  r1348863 | dkulp | 2012-06-11 10:22:44 -0400 (Mon, 11 Jun 2012) | 3 lines
  
  Recording revisions 1348845 via  git from
  https://svn.apache.org/repos/asf/cxf/trunk
  
........
........
  r1348864 | dkulp | 2012-06-11 10:22:46 -0400 (Mon, 11 Jun 2012) | 22 lines
  
  Blocking revisions 1348223,1348240,1348245 via  git from
  https://svn.apache.org/repos/asf/cxf/trunk
  
  ........
    r1348223 | dkulp | 2012-06-08 16:08:05 -0400 (Fri, 08 Jun 2012) | 2 lines
  
    Update trunk to 2.7.0-SNAPSHOT
  
  ........
  ........
    r1348240 | dkulp | 2012-06-08 16:53:05 -0400 (Fri, 08 Jun 2012) | 2 lines
  
    Remove the JDK 1.5 related profiles and settings from the build
  
  ........
  ........
    r1348245 | dkulp | 2012-06-08 17:14:09 -0400 (Fri, 08 Jun 2012) | 2 lines
  
    Remove some reflection that is no longer needed with Java6+
  
  ........
  
........
........
  r1349020 | dkulp | 2012-06-11 17:24:52 -0400 (Mon, 11 Jun 2012) | 10 lines
  
  Merged revisions 1348862 via  git cherry-pick from
  https://svn.apache.org/repos/asf/cxf/trunk
  
  ........
    r1348862 | dkulp | 2012-06-11 10:22:19 -0400 (Mon, 11 Jun 2012) | 2 lines
  
    Allow empty ranges
  
  ........
  
........
........
  r1349021 | dkulp | 2012-06-11 17:24:55 -0400 (Mon, 11 Jun 2012) | 10 lines
  
  Merged revisions 1348866 via  git cherry-pick from
  https://svn.apache.org/repos/asf/cxf/trunk
  
  ........
    r1348866 | dkulp | 2012-06-11 10:30:07 -0400 (Mon, 11 Jun 2012) | 2 lines
  
    Handle multi-line props
  
  ........
  
........
........
  r1349023 | dkulp | 2012-06-11 17:25:09 -0400 (Mon, 11 Jun 2012) | 3 lines
  
  Recording revisions 1348862,1348866,1349016 via  git from
  https://svn.apache.org/repos/asf/cxf/trunk
  
........
........
  r1349024 | dkulp | 2012-06-11 17:25:11 -0400 (Mon, 11 Jun 2012) | 10 lines
  
  Blocking revisions 1348933 via  git from
  https://svn.apache.org/repos/asf/cxf/trunk
  
  ........
    r1348933 | dkulp | 2012-06-11 12:49:07 -0400 (Mon, 11 Jun 2012) | 2 lines
  
    Update to latest gwt (since we now don't support Java 5)
  
  ........
  
........
........
  r1349553 | dkulp | 2012-06-12 17:40:43 -0400 (Tue, 12 Jun 2012) | 3 lines
  
  Recording revisions 1349549 via  git from
  https://svn.apache.org/repos/asf/cxf/trunk
  
........
........
  r1349554 | dkulp | 2012-06-12 17:40:45 -0400 (Tue, 12 Jun 2012) | 17 lines
  
  Blocking revisions 1349550,1349551 via  git from
  https://svn.apache.org/repos/asf/cxf/trunk
  
  ........
    r1349550 | dkulp | 2012-06-12 17:36:39 -0400 (Tue, 12 Jun 2012) | 2 lines
  
    Update to activemq 5.6.0 for testing
  
  ........
  ........
    r1349551 | dkulp | 2012-06-12 17:36:43 -0400 (Tue, 12 Jun 2012) | 3 lines
  
    Dropping support for j5 allows removing the old activemq stuff from the
    features.xml
  
  ........
  
........
........
  r1350323 | dkulp | 2012-06-14 12:39:58 -0400 (Thu, 14 Jun 2012) | 3 lines
  
  Recording revisions 1350318 via  git from
  https://svn.apache.org/repos/asf/cxf/trunk
  
........
........
  r1350324 | dkulp | 2012-06-14 12:39:59 -0400 (Thu, 14 Jun 2012) | 16 lines
  
  Blocking revisions 1349926,1349967 via  git from
  https://svn.apache.org/repos/asf/cxf/trunk
  
  ........
    r1349926 | dkulp | 2012-06-13 11:50:59 -0400 (Wed, 13 Jun 2012) | 2 lines
  
    [CXF-3799] Dropping Java5 allows updating to Jetty 8.x
  
  ........
  ........
    r1349967 | dkulp | 2012-06-13 13:37:00 -0400 (Wed, 13 Jun 2012) | 2 lines
  
    [CXF-4377] Update CXF servlets to also be Filters
  
  ........
  
........

[dkulp] Recording revisions 1349552,1350322 via  git from
https://svn.apache.org/repos/asf/cxf/branches/2.6.x-fixes

[dkulp] Merged revisions 1350322 via  git cherry-pick from
https://svn.apache.org/repos/asf/cxf/branches/2.6.x-fixes

........
  r1350322 | dkulp | 2012-06-14 12:39:53 -0400 (Thu, 14 Jun 2012) | 10 lines

  Merged revisions 1350318 via  git cherry-pick from
  https://svn.apache.org/repos/asf/cxf/trunk

  ........
    r1350318 | dkulp | 2012-06-14 12:32:58 -0400 (Thu, 14 Jun 2012) | 2 lines

    Add another class to check to see if spring is available and usable

  ........

........

[dkulp] Merged revisions 1349552 via  git cherry-pick from
https://svn.apache.org/repos/asf/cxf/branches/2.6.x-fixes

........
  r1349552 | dkulp | 2012-06-12 17:40:36 -0400 (Tue, 12 Jun 2012) | 10 lines

  Merged revisions 1349549 via  git cherry-pick from
  https://svn.apache.org/repos/asf/cxf/trunk

  ........
    r1349549 | dkulp | 2012-06-12 17:36:32 -0400 (Tue, 12 Jun 2012) | 2 lines

    Update to latest antrun plugin

  ........

........

[coheigea] Recording revisions 1350187,1350188 via  git from
https://svn.apache.org/repos/asf/cxf/branches/2.6.x-fixes

[coheigea] Merged revisions 1350187 via  git cherry-pick from
https://svn.apache.org/repos/asf/cxf/branches/2.6.x-fixes

........
  r1350187 | coheigea | 2012-06-14 11:55:57 +0100 (Thu, 14 Jun 2012) | 10 lines

  Merged revisions 1350186 via  git cherry-pick from
  https://svn.apache.org/repos/asf/cxf/trunk

  ........
    r1350186 | coheigea | 2012-06-14 11:52:02 +0100 (Thu, 14 Jun 2012) | 2 lines

    Minor spelling fixes to the sample READMEs

  ........

........

------------------------------------------
Started by an SCM change
Building remotely on ubuntu1 in workspace <https://builds.apache.org/job/CXF-2.5-deploy/ws/>
Updating http://svn.apache.org/repos/asf/cxf/branches/2.5.x-fixes
U         distribution/src/main/release/samples/oauth/README.TXT
U         distribution/src/main/release/samples/jaxws_dispatch_provider/README.txt
U         distribution/src/main/release/samples/jax_rs/basic_https/README.txt
U         distribution/src/main/release/samples/ws_security/ut/README.txt
U         distribution/src/main/release/samples/corba/bank/README.txt
U         services/sts/sts-core/src/main/java/org/apache/cxf/sts/operation/TokenIssueOperation.java
U         services/sts/sts-war/src/main/webapp/WEB-INF/cxf-encrypted-ut.xml
U         services/sts/systests/basic/src/test/java/org/apache/cxf/systest/sts/symmetric/SymmetricBindingTest.java
U         services/sts/systests/basic/src/test/resources/org/apache/cxf/systest/sts/deployment/cxf-encrypted-ut.xml
U         services/sts/systests/basic/src/test/resources/org/apache/cxf/systest/sts/symmetric/DoubleIt.wsdl
U         services/sts/systests/basic/src/test/resources/org/apache/cxf/systest/sts/symmetric/cxf-client.xml
U         services/sts/systests/basic/src/test/resources/org/apache/cxf/systest/sts/symmetric/cxf-service.xml
U         rt/frontend/jaxrs/src/test/java/org/apache/cxf/jaxrs/fortest/jaxb/packageinfo/package-info.java
U         rt/frontend/jaxrs/src/test/java/org/apache/cxf/jaxrs/provider/JAXBElementProviderTest.java
U         rt/frontend/jaxrs/src/test/java/org/apache/cxf/jaxrs/provider/XSLTJaxbProviderTest.java
U         rt/frontend/jaxrs/src/test/java/org/apache/cxf/jaxrs/provider/JSONProviderTest.java
U         rt/frontend/jaxrs/src/test/java/org/apache/cxf/jaxrs/model/wadl/WadlGeneratorTest.java
U         rt/frontend/jaxrs/src/main/java/org/apache/cxf/jaxrs/provider/JAXBElementProvider.java
U         rt/frontend/jaxrs/src/main/java/org/apache/cxf/jaxrs/provider/XSLTJaxbProvider.java
U         rt/frontend/jaxrs/src/main/java/org/apache/cxf/jaxrs/provider/JSONProvider.java
U         rt/core/src/main/resources/META-INF/cxf/org.apache.cxf.bus.factory
U         rt/ws/security/src/main/java/org/apache/cxf/ws/security/cache/EHCacheManagerHolder.java
U         rt/ws/security/src/main/java/org/apache/cxf/ws/security/tokenstore/SecurityToken.java
U         pom.xml
U         systests/jaxrs/src/test/java/org/apache/cxf/systest/jaxrs/JAXRSSoapBookTest.java
A         systests/jaxrs/src/test/resources/jaxrs_soap_rest/WEB-INF/template.xsl
U         systests/jaxrs/src/test/resources/jaxrs_soap_rest/WEB-INF/beans.xml
 U        .
At revision 1350488
[locks-and-latches] Checking to see if we really have the locks
[locks-and-latches] Have all the locks, build can start
Parsing POMs
[cxf-2.5.x-fixes] $ /home/hudson/tools/maven/apache-maven-2.2.1/bin/mvn -Dmaven.repo.local=<https://builds.apache.org/job/CXF-2.5-deploy/ws/.repository>
-B deploy -Pdeploy,everything,nochecks -Dmaven.test.skip.exec=true
[INFO] Scanning for projects...
[INFO] ------------------------------------------------------------------------
[ERROR] FATAL ERROR
[INFO] ------------------------------------------------------------------------
[INFO] Failed to resolve artifact.

GroupId: org.apache.cxf.samples
ArtifactId: cxf-samples
Version: 2.5.4-SNAPSHOT

Reason: Unable to download the artifact from any repository

  org.apache.cxf.samples:cxf-samples:pom:2.5.4-SNAPSHOT

from the specified remote repositories:
  central (http://repo1.maven.org/maven2)



[INFO] ------------------------------------------------------------------------
[INFO] Trace
org.apache.maven.reactor.MavenExecutionException: Cannot find parent: org.apache.cxf.samples:cxf-samples
for project: org.apache.cxf.samples:jax_rs_minimal_osgi:jar:2.5.4-SNAPSHOT for project org.apache.cxf.samples:jax_rs_minimal_osgi:jar:2.5.4-SNAPSHOT
	at org.apache.maven.DefaultMaven.getProjects(DefaultMaven.java:404)
	at org.apache.maven.DefaultMaven.doExecute(DefaultMaven.java:272)
	at org.apache.maven.DefaultMaven.execute(DefaultMaven.java:138)
	at org.apache.maven.cli.MavenCli.main(MavenCli.java:362)
	at org.apache.maven.cli.compat.CompatibleMain.main(CompatibleMain.java:60)
	at sun.reflect.NativeMethodAccessorImpl.invoke0(Native Method)
	at sun.reflect.NativeMethodAccessorImpl.invoke(NativeMethodAccessorImpl.java:39)
	at sun.reflect.DelegatingMethodAccessorImpl.invoke(DelegatingMethodAccessorImpl.java:25)
	at java.lang.reflect.Method.invoke(Method.java:592)
	at org.codehaus.classworlds.Launcher.launchEnhanced(Launcher.java:315)
	at org.codehaus.classworlds.Launcher.launch(Launcher.java:255)
	at org.codehaus.classworlds.Launcher.mainWithExitCode(Launcher.java:430)
	at org.codehaus.classworlds.Launcher.main(Launcher.java:375)
Caused by: org.apache.maven.project.ProjectBuildingException: Cannot find parent: org.apache.cxf.samples:cxf-samples
for project: org.apache.cxf.samples:jax_rs_minimal_osgi:jar:2.5.4-SNAPSHOT for project org.apache.cxf.samples:jax_rs_minimal_osgi:jar:2.5.4-SNAPSHOT
	at org.apache.maven.project.DefaultMavenProjectBuilder.assembleLineage(DefaultMavenProjectBuilder.java:1396)
	at org.apache.maven.project.DefaultMavenProjectBuilder.buildInternal(DefaultMavenProjectBuilder.java:823)
	at org.apache.maven.project.DefaultMavenProjectBuilder.buildFromSourceFileInternal(DefaultMavenProjectBuilder.java:508)
	at org.apache.maven.project.DefaultMavenProjectBuilder.build(DefaultMavenProjectBuilder.java:200)
	at org.apache.maven.DefaultMaven.getProject(DefaultMaven.java:604)
	at org.apache.maven.DefaultMaven.collectProjects(DefaultMaven.java:487)
	at org.apache.maven.DefaultMaven.collectProjects(DefaultMaven.java:560)
	at org.apache.maven.DefaultMaven.collectProjects(DefaultMaven.java:560)
	at org.apache.maven.DefaultMaven.collectProjects(DefaultMaven.java:560)
	at org.apache.maven.DefaultMaven.getProjects(DefaultMaven.java:391)
	... 12 more
Caused by: org.apache.maven.project.ProjectBuildingException: POM 'org.apache.cxf.samples:cxf-samples'
not found in repository: Unable to download the artifact from any repository

  org.apache.cxf.samples:cxf-samples:pom:2.5.4-SNAPSHOT

from the specified remote repositories:
  central (http://repo1.maven.org/maven2)

 for project org.apache.cxf.samples:cxf-samples
	at org.apache.maven.project.DefaultMavenProjectBuilder.findModelFromRepository(DefaultMavenProjectBuilder.java:605)
	at org.apache.maven.project.DefaultMavenProjectBuilder.assembleLineage(DefaultMavenProjectBuilder.java:1392)
	... 21 more
Caused by: org.apache.maven.artifact.resolver.ArtifactNotFoundException: Unable to download
the artifact from any repository

  org.apache.cxf.samples:cxf-samples:pom:2.5.4-SNAPSHOT

from the specified remote repositories:
  central (http://repo1.maven.org/maven2)


	at org.apache.maven.artifact.resolver.DefaultArtifactResolver.resolve(DefaultArtifactResolver.java:228)
	at org.apache.maven.artifact.resolver.DefaultArtifactResolver.resolve(DefaultArtifactResolver.java:90)
	at org.apache.maven.project.DefaultMavenProjectBuilder.findModelFromRepository(DefaultMavenProjectBuilder.java:558)
	... 22 more
Caused by: org.apache.maven.wagon.ResourceDoesNotExistException: Unable to download the artifact
from any repository
	at org.apache.maven.artifact.manager.DefaultWagonManager.getArtifact(DefaultWagonManager.java:404)
	at org.apache.maven.artifact.resolver.DefaultArtifactResolver.resolve(DefaultArtifactResolver.java:216)
	... 24 more
[INFO] ------------------------------------------------------------------------
[INFO] Total time: 3 seconds
[INFO] Finished at: Fri Jun 15 08:27:22 UTC 2012
[INFO] Final Memory: 22M/79M
[INFO] ------------------------------------------------------------------------
Build step 'Invoke top-level Maven targets' marked build as failure
[locks-and-latches] Releasing all the locks
[locks-and-latches] All the locks released
ERROR: Failed to parse POMs
hudson.util.IOException2: remote file operation failed: <https://builds.apache.org/job/CXF-2.5-deploy/ws/cxf-2.5.x-fixes>
at hudson.remoting.Channel@3bf7fa19:ubuntu1
	at hudson.FilePath.act(FilePath.java:835)
	at hudson.FilePath.act(FilePath.java:821)
	at hudson.maven.MavenModuleSetBuild$RunnerImpl.parsePoms(MavenModuleSetBuild.java:910)
	at hudson.maven.MavenModuleSetBuild$RunnerImpl.doRun(MavenModuleSetBuild.java:654)
	at hudson.model.AbstractBuild$AbstractRunner.run(AbstractBuild.java:480)
	at hudson.model.Run.run(Run.java:1434)
	at hudson.maven.MavenModuleSetBuild.run(MavenModuleSetBuild.java:477)
	at hudson.model.ResourceController.execute(ResourceController.java:88)
	at hudson.model.Executor.run(Executor.java:239)
Caused by: hudson.remoting.ProxyException: hudson.maven.MavenModuleSetBuild$MavenExecutionException:
org.apache.maven.project.ProjectBuildingException: Some problems were encountered while processing
the POMs:
[FATAL] Non-resolvable parent POM: Could not find artifact org.apache.cxf.samples:cxf-samples:pom:2.5.4-SNAPSHOT
and 'parent.relativePath' points at wrong local POM @ line 28, column 10

	at hudson.maven.MavenModuleSetBuild$PomParser.invoke(MavenModuleSetBuild.java:1278)
	at hudson.maven.MavenModuleSetBuild$PomParser.invoke(MavenModuleSetBuild.java:1045)
	at hudson.FilePath$FileCallableWrapper.call(FilePath.java:2177)
	at hudson.remoting.UserRequest.perform(UserRequest.java:118)
	at hudson.remoting.UserRequest.perform(UserRequest.java:48)
	at hudson.remoting.Request$2.run(Request.java:287)
	at hudson.remoting.InterceptingExecutorService$1.call(InterceptingExecutorService.java:72)
	at java.util.concurrent.FutureTask$Sync.innerRun(FutureTask.java:334)
	at java.util.concurrent.FutureTask.run(FutureTask.java:166)
	at java.util.concurrent.ThreadPoolExecutor.runWorker(ThreadPoolExecutor.java:1110)
	at java.util.concurrent.ThreadPoolExecutor$Worker.run(ThreadPoolExecutor.java:603)
	at java.lang.Thread.run(Thread.java:679)
Caused by: hudson.remoting.ProxyException: org.apache.maven.project.ProjectBuildingException:
Some problems were encountered while processing the POMs:
[FATAL] Non-resolvable parent POM: Could not find artifact org.apache.cxf.samples:cxf-samples:pom:2.5.4-SNAPSHOT
and 'parent.relativePath' points at wrong local POM @ line 28, column 10

	at org.apache.maven.project.DefaultProjectBuilder.build(DefaultProjectBuilder.java:363)
	at hudson.maven.MavenEmbedder.buildProjects(MavenEmbedder.java:361)
	at hudson.maven.MavenEmbedder.readProjects(MavenEmbedder.java:331)
	at hudson.maven.MavenEmbedder.readProject(MavenEmbedder.java:322)
	at hudson.maven.MavenModuleSetBuild$PomParser.readChilds(MavenModuleSetBuild.java:1332)
	at hudson.maven.MavenModuleSetBuild$PomParser.readChilds(MavenModuleSetBuild.java:1335)
	at hudson.maven.MavenModuleSetBuild$PomParser.readChilds(MavenModuleSetBuild.java:1335)
	at hudson.maven.MavenModuleSetBuild$PomParser.invoke(MavenModuleSetBuild.java:1239)
	... 11 more

Mime
View raw message