cxf-notifications mailing list archives

Site index · List index
Message view « Date » · « Thread »
Top « Date » · « Thread »
From Apache Jenkins Server <jenk...@builds.apache.org>
Subject Build failed in Jenkins: CXF-trunk-deploy » Apache CXF Runtime WS Security #1196
Date Sun, 14 Jul 2013 06:28:30 GMT
See <https://builds.apache.org/job/CXF-trunk-deploy/org.apache.cxf$cxf-rt-ws-security/1196/changes>

Changes:

[coheigea] Minor fix

[coheigea] More tests

[dkulp] Move the WSDLConstants into rt-wsdl, remove SOAPConstants.

------------------------------------------
[INFO]                                                                         
[INFO] ------------------------------------------------------------------------
[INFO] Building Apache CXF Runtime WS Security 3.0.0-SNAPSHOT
[INFO] ------------------------------------------------------------------------
Downloading: http://repository.apache.org/snapshots/org/apache/wss4j/wss4j-ws-security-dom/2.0-SNAPSHOT/maven-metadata.xml
Downloaded: http://repository.apache.org/snapshots/org/apache/wss4j/wss4j-ws-security-dom/2.0-SNAPSHOT/maven-metadata.xml
(373 B at 1.8 KB/sec)
Downloading: http://repository.apache.org/snapshots/org/apache/wss4j/wss4j-ws-security-dom/2.0-SNAPSHOT/wss4j-ws-security-dom-2.0-20130714.013726-137.pom
Downloaded: http://repository.apache.org/snapshots/org/apache/wss4j/wss4j-ws-security-dom/2.0-SNAPSHOT/wss4j-ws-security-dom-2.0-20130714.013726-137.pom
(11 KB at 57.1 KB/sec)
Downloading: http://repository.apache.org/snapshots/org/apache/wss4j/wss4j-ws-security-common/2.0-SNAPSHOT/maven-metadata.xml
Downloaded: http://repository.apache.org/snapshots/org/apache/wss4j/wss4j-ws-security-common/2.0-SNAPSHOT/maven-metadata.xml
(376 B at 2.1 KB/sec)
Downloading: http://repository.apache.org/snapshots/org/apache/wss4j/wss4j-ws-security-common/2.0-SNAPSHOT/wss4j-ws-security-common-2.0-20130714.013726-139.pom
Downloaded: http://repository.apache.org/snapshots/org/apache/wss4j/wss4j-ws-security-common/2.0-SNAPSHOT/wss4j-ws-security-common-2.0-20130714.013726-139.pom
(13 KB at 58.6 KB/sec)
Downloading: http://repository.apache.org/snapshots/org/apache/santuario/xmlsec/2.0.0-SNAPSHOT/maven-metadata.xml
Downloaded: http://repository.apache.org/snapshots/org/apache/santuario/xmlsec/2.0.0-SNAPSHOT/maven-metadata.xml
(319 B at 0.3 KB/sec)
Downloading: http://repository.apache.org/snapshots/org/apache/wss4j/wss4j-ws-security-stax/2.0-SNAPSHOT/maven-metadata.xml
Downloaded: http://repository.apache.org/snapshots/org/apache/wss4j/wss4j-ws-security-stax/2.0-SNAPSHOT/maven-metadata.xml
(374 B at 0.6 KB/sec)
Downloading: http://repository.apache.org/snapshots/org/apache/wss4j/wss4j-ws-security-stax/2.0-SNAPSHOT/wss4j-ws-security-stax-2.0-20130714.013726-130.pom
Downloaded: http://repository.apache.org/snapshots/org/apache/wss4j/wss4j-ws-security-stax/2.0-SNAPSHOT/wss4j-ws-security-stax-2.0-20130714.013726-130.pom
(9 KB at 60.8 KB/sec)
Downloading: http://repository.apache.org/snapshots/org/apache/wss4j/wss4j-bindings-wss10/2.0-SNAPSHOT/maven-metadata.xml
Downloaded: http://repository.apache.org/snapshots/org/apache/wss4j/wss4j-bindings-wss10/2.0-SNAPSHOT/maven-metadata.xml
(372 B at 0.6 KB/sec)
Downloading: http://repository.apache.org/snapshots/org/apache/wss4j/wss4j-bindings-wss10/2.0-SNAPSHOT/wss4j-bindings-wss10-2.0-20130714.013726-141.pom
Downloaded: http://repository.apache.org/snapshots/org/apache/wss4j/wss4j-bindings-wss10/2.0-SNAPSHOT/wss4j-bindings-wss10-2.0-20130714.013726-141.pom
(5 KB at 5.8 KB/sec)
Downloading: http://repository.apache.org/snapshots/org/apache/wss4j/wss4j-bindings-wsu10/2.0-SNAPSHOT/maven-metadata.xml
Downloaded: http://repository.apache.org/snapshots/org/apache/wss4j/wss4j-bindings-wsu10/2.0-SNAPSHOT/maven-metadata.xml
(372 B at 0.7 KB/sec)
Downloading: http://repository.apache.org/snapshots/org/apache/wss4j/wss4j-bindings-wsu10/2.0-SNAPSHOT/wss4j-bindings-wsu10-2.0-20130714.013726-141.pom
Downloaded: http://repository.apache.org/snapshots/org/apache/wss4j/wss4j-bindings-wsu10/2.0-SNAPSHOT/wss4j-bindings-wsu10-2.0-20130714.013726-141.pom
(4 KB at 27.5 KB/sec)
Downloading: http://repository.apache.org/snapshots/org/apache/wss4j/wss4j-bindings-wss11/2.0-SNAPSHOT/maven-metadata.xml
Downloaded: http://repository.apache.org/snapshots/org/apache/wss4j/wss4j-bindings-wss11/2.0-SNAPSHOT/maven-metadata.xml
(372 B at 0.7 KB/sec)
Downloading: http://repository.apache.org/snapshots/org/apache/wss4j/wss4j-bindings-wss11/2.0-SNAPSHOT/wss4j-bindings-wss11-2.0-20130714.013726-141.pom
Downloaded: http://repository.apache.org/snapshots/org/apache/wss4j/wss4j-bindings-wss11/2.0-SNAPSHOT/wss4j-bindings-wss11-2.0-20130714.013726-141.pom
(7 KB at 48.8 KB/sec)
Downloading: http://repository.apache.org/snapshots/org/apache/wss4j/wss4j-bindings-wssc/2.0-SNAPSHOT/maven-metadata.xml
Downloaded: http://repository.apache.org/snapshots/org/apache/wss4j/wss4j-bindings-wssc/2.0-SNAPSHOT/maven-metadata.xml
(371 B at 2.1 KB/sec)
Downloading: http://repository.apache.org/snapshots/org/apache/wss4j/wss4j-bindings-wssc/2.0-SNAPSHOT/wss4j-bindings-wssc-2.0-20130714.013726-141.pom
Downloaded: http://repository.apache.org/snapshots/org/apache/wss4j/wss4j-bindings-wssc/2.0-SNAPSHOT/wss4j-bindings-wssc-2.0-20130714.013726-141.pom
(6 KB at 2.2 KB/sec)
Downloading: http://repository.apache.org/snapshots/org/apache/wss4j/wss4j-ws-security-policy-stax/2.0-SNAPSHOT/maven-metadata.xml
Downloaded: http://repository.apache.org/snapshots/org/apache/wss4j/wss4j-ws-security-policy-stax/2.0-SNAPSHOT/maven-metadata.xml
(381 B at 0.7 KB/sec)
Downloading: http://repository.apache.org/snapshots/org/apache/wss4j/wss4j-ws-security-policy-stax/2.0-SNAPSHOT/wss4j-ws-security-policy-stax-2.0-20130714.013726-129.pom
Downloaded: http://repository.apache.org/snapshots/org/apache/wss4j/wss4j-ws-security-policy-stax/2.0-SNAPSHOT/wss4j-ws-security-policy-stax-2.0-20130714.013726-129.pom
(4 KB at 16.6 KB/sec)
Downloading: http://repository.apache.org/snapshots/org/apache/wss4j/wss4j-ws-security-dom/2.0-SNAPSHOT/wss4j-ws-security-dom-2.0-20130714.013726-137.jar
Downloading: http://repository.apache.org/snapshots/org/apache/wss4j/wss4j-ws-security-common/2.0-SNAPSHOT/wss4j-ws-security-common-2.0-20130714.013726-139.jar
Downloading: http://repository.apache.org/snapshots/org/apache/wss4j/wss4j-ws-security-stax/2.0-SNAPSHOT/wss4j-ws-security-stax-2.0-20130714.013726-130.jar
Downloading: http://repository.apache.org/snapshots/org/apache/wss4j/wss4j-bindings-wss10/2.0-SNAPSHOT/wss4j-bindings-wss10-2.0-20130714.013726-141.jar
Downloading: http://repository.apache.org/snapshots/org/apache/wss4j/wss4j-bindings-wsu10/2.0-SNAPSHOT/wss4j-bindings-wsu10-2.0-20130714.013726-141.jar
Downloaded: http://repository.apache.org/snapshots/org/apache/wss4j/wss4j-bindings-wsu10/2.0-SNAPSHOT/wss4j-bindings-wsu10-2.0-20130714.013726-141.jar
(25 KB at 83.5 KB/sec)
Downloading: http://repository.apache.org/snapshots/org/apache/wss4j/wss4j-bindings-wss11/2.0-SNAPSHOT/wss4j-bindings-wss11-2.0-20130714.013726-141.jar
Downloaded: http://repository.apache.org/snapshots/org/apache/wss4j/wss4j-bindings-wss10/2.0-SNAPSHOT/wss4j-bindings-wss10-2.0-20130714.013726-141.jar
(35 KB at 103.0 KB/sec)
Downloading: http://repository.apache.org/snapshots/org/apache/wss4j/wss4j-bindings-wssc/2.0-SNAPSHOT/wss4j-bindings-wssc-2.0-20130714.013726-141.jar
Downloaded: http://repository.apache.org/snapshots/org/apache/wss4j/wss4j-bindings-wss11/2.0-SNAPSHOT/wss4j-bindings-wss11-2.0-20130714.013726-141.jar
(33 KB at 189.1 KB/sec)
Downloading: http://repository.apache.org/snapshots/org/apache/wss4j/wss4j-ws-security-dom/2.0-SNAPSHOT/wss4j-ws-security-dom-2.0-20130714.013726-137-tests.jar
Downloaded: http://repository.apache.org/snapshots/org/apache/wss4j/wss4j-ws-security-common/2.0-SNAPSHOT/wss4j-ws-security-common-2.0-20130714.013726-139.jar
(191 KB at 352.7 KB/sec)
Downloading: http://repository.apache.org/snapshots/org/apache/wss4j/wss4j-ws-security-policy-stax/2.0-SNAPSHOT/wss4j-ws-security-policy-stax-2.0-20130714.013726-129.jar
Downloaded: http://repository.apache.org/snapshots/org/apache/wss4j/wss4j-bindings-wssc/2.0-SNAPSHOT/wss4j-bindings-wssc-2.0-20130714.013726-141.jar
(60 KB at 258.4 KB/sec)
Downloaded: http://repository.apache.org/snapshots/org/apache/wss4j/wss4j-ws-security-dom/2.0-SNAPSHOT/wss4j-ws-security-dom-2.0-20130714.013726-137.jar
(296 KB at 516.6 KB/sec)
Downloaded: http://repository.apache.org/snapshots/org/apache/wss4j/wss4j-ws-security-stax/2.0-SNAPSHOT/wss4j-ws-security-stax-2.0-20130714.013726-130.jar
(325 KB at 481.6 KB/sec)
Downloaded: http://repository.apache.org/snapshots/org/apache/wss4j/wss4j-ws-security-policy-stax/2.0-SNAPSHOT/wss4j-ws-security-policy-stax-2.0-20130714.013726-129.jar
(111 KB at 390.2 KB/sec)
Downloaded: http://repository.apache.org/snapshots/org/apache/wss4j/wss4j-ws-security-dom/2.0-SNAPSHOT/wss4j-ws-security-dom-2.0-20130714.013726-137-tests.jar
(380 KB at 878.4 KB/sec)
[INFO] 
[INFO] --- maven-clean-plugin:2.5:clean (default-clean) @ cxf-rt-ws-security ---
[INFO] 
[INFO] --- maven-bundle-plugin:2.3.7:cleanVersions (versions) @ cxf-rt-ws-security ---
[INFO] 
[INFO] --- cxf-xml2fastinfoset-plugin:2.5.0:xml2fastinfoset (xml2fastinfoset) @ cxf-rt-ws-security
---
[INFO] 
[INFO] --- cxf-xjc-plugin:2.6.1:xsdtojava (generate-sources) @ cxf-rt-ws-security ---
[INFO] 
[INFO] --- maven-remote-resources-plugin:1.3:process (default) @ cxf-rt-ws-security ---
[INFO] [INFO] Using 'UTF-8' encoding to copy filtered resources.

[INFO] --- maven-resources-plugin:2.6:resources (default-resources) @ cxf-rt-ws-security ---
[INFO] Copying 3 resources
[INFO] Copying 2 resources
[INFO] skip non existing resourceDirectory <https://builds.apache.org/job/CXF-trunk-deploy/org.apache.cxf$cxf-rt-ws-security/ws/src/main/resources-filtered>
[INFO] skip non existing resourceDirectory <https://builds.apache.org/job/CXF-trunk-deploy/org.apache.cxf$cxf-rt-ws-security/ws/target/generated/src/main/resources>
[INFO] Copying 3 resources
[INFO] [INFO] Changes detected - recompiling the module!
[INFO] Compiling 208 source files to <https://builds.apache.org/job/CXF-trunk-deploy/org.apache.cxf$cxf-rt-ws-security/ws/target/classes>

[INFO] --- maven-compiler-plugin:3.1:compile (default-compile) @ cxf-rt-ws-security ---
[INFO] -------------------------------------------------------------
[ERROR] COMPILATION ERROR : 
[INFO] -------------------------------------------------------------
[ERROR] <https://builds.apache.org/job/CXF-trunk-deploy/org.apache.cxf$cxf-rt-ws-security/ws/src/main/java/org/apache/cxf/ws/security/wss4j/policyhandlers/AbstractStaxBindingHandler.java>:[920,27]
cannot find symbol
symbol  : method setRequired(boolean)
location: class org.apache.xml.security.stax.ext.SecurePart
[ERROR] <https://builds.apache.org/job/CXF-trunk-deploy/org.apache.cxf$cxf-rt-ws-security/ws/src/main/java/org/apache/cxf/ws/security/wss4j/policyhandlers/AbstractStaxBindingHandler.java>:[973,27]
cannot find symbol
symbol  : method setRequired(boolean)
location: class org.apache.xml.security.stax.ext.SecurePart
[ERROR] <https://builds.apache.org/job/CXF-trunk-deploy/org.apache.cxf$cxf-rt-ws-security/ws/src/main/java/org/apache/cxf/ws/security/wss4j/policyhandlers/StaxSymmetricBindingHandler.java>:[420,21]
cannot find symbol
symbol  : method isRequired()
location: class org.apache.xml.security.stax.ext.SecurePart
[ERROR] <https://builds.apache.org/job/CXF-trunk-deploy/org.apache.cxf$cxf-rt-ws-security/ws/src/main/java/org/apache/cxf/ws/security/wss4j/policyhandlers/StaxSymmetricBindingHandler.java>:[483,42]
cannot find symbol
symbol  : method getSha1Identifier()
location: interface org.apache.xml.security.stax.securityToken.SecurityToken
[ERROR] <https://builds.apache.org/job/CXF-trunk-deploy/org.apache.cxf$cxf-rt-ws-security/ws/src/main/java/org/apache/cxf/ws/security/wss4j/policyhandlers/StaxSymmetricBindingHandler.java>:[513,33]
cannot find symbol
symbol  : method getSha1Identifier()
location: interface org.apache.xml.security.stax.securityToken.SecurityToken
[ERROR] <https://builds.apache.org/job/CXF-trunk-deploy/org.apache.cxf$cxf-rt-ws-security/ws/src/main/java/org/apache/cxf/ws/security/wss4j/policyhandlers/StaxSymmetricBindingHandler.java>:[600,34]
cannot find symbol
symbol  : method setSha1Identifier(java.lang.String)
location: class org.apache.xml.security.stax.impl.securityToken.GenericOutboundSecurityToken
[ERROR] <https://builds.apache.org/job/CXF-trunk-deploy/org.apache.cxf$cxf-rt-ws-security/ws/src/main/java/org/apache/cxf/ws/security/wss4j/policyhandlers/StaxAsymmetricBindingHandler.java>:[394,21]
cannot find symbol
symbol  : method isRequired()
location: class org.apache.xml.security.stax.ext.SecurePart
[INFO] 7 errors 
[INFO] -------------------------------------------------------------

Mime
View raw message