cxf-notifications mailing list archives

Site index · List index
Message view « Date » · « Thread »
Top « Date » · « Thread »
From Apache Jenkins Server <jenk...@builds.apache.org>
Subject Build failed in Jenkins: CXF-2.6-deploy #273
Date Fri, 23 Aug 2013 06:54:50 GMT
See <https://builds.apache.org/job/CXF-2.6-deploy/273/changes>

Changes:

[coheigea] Blocking revisions 1516509 via  git from
https://svn.apache.org/repos/asf/cxf/branches/2.7.x-fixes

[coheigea] Recording revisions 1516510 via  git from
https://svn.apache.org/repos/asf/cxf/branches/2.7.x-fixes

[coheigea] Blocking revisions 1516255,1516394,1516399 via  git from
https://svn.apache.org/repos/asf/cxf/branches/2.7.x-fixes

[coheigea] Recording revisions 1516256,1516257,1516395 via  git from
https://svn.apache.org/repos/asf/cxf/branches/2.7.x-fixes

------------------------------------------
[...truncated 21035 lines...]
Uploaded: https://repository.apache.org/content/repositories/snapshots/org/apache/cxf/systests/cxf-systests-ws-specs/2.6.10-SNAPSHOT/maven-metadata.xml
(2 KB at 13.2 KB/sec)
[INFO]                                                                         
[INFO] ------------------------------------------------------------------------
[INFO] Building Apache CXF WS-RM Specifications System Tests 2.6.10-SNAPSHOT
[INFO] ------------------------------------------------------------------------
[INFO] 
[INFO] --- maven-bundle-plugin:2.4.0:cleanVersions (versions) @ cxf-systests-ws-rm ---
[INFO] 
[INFO] --- cxf-xml2fastinfoset-plugin:2.5.0:xml2fastinfoset (xml2fastinfoset) @ cxf-systests-ws-rm
---
[INFO] 
[INFO] --- maven-remote-resources-plugin:1.3:process (default) @ cxf-systests-ws-rm ---
[INFO] 
[INFO] --- maven-resources-plugin:2.6:resources (default-resources) @ cxf-systests-ws-rm ---
[INFO] Using 'UTF-8' encoding to copy filtered resources.
[INFO] skip non existing resourceDirectory /x1/jenkins/jenkins-slave/workspace/CXF-2.6-deploy/cxf-2.6.x-fixes/systests/ws-rm/src/main/java
[INFO] skip non existing resourceDirectory /x1/jenkins/jenkins-slave/workspace/CXF-2.6-deploy/cxf-2.6.x-fixes/systests/ws-rm/src/main/resources
[INFO] skip non existing resourceDirectory /x1/jenkins/jenkins-slave/workspace/CXF-2.6-deploy/cxf-2.6.x-fixes/systests/ws-rm/src/main/resources-filtered
[INFO] skip non existing resourceDirectory /x1/jenkins/jenkins-slave/workspace/CXF-2.6-deploy/cxf-2.6.x-fixes/systests/ws-rm/target/generated/src/main/resources
[INFO] Copying 3 resources
[INFO] 
[INFO] --- maven-compiler-plugin:3.1:compile (default-compile) @ cxf-systests-ws-rm ---
[INFO] No sources to compile
[INFO] 
[INFO] --- maven-bundle-plugin:2.4.0:manifest (bundle-manifest) @ cxf-systests-ws-rm ---
in default pack? 
[WARNING] Manifest org.apache.cxf.systests:cxf-systests-ws-rm:jar:2.6.10-SNAPSHOT : Unused
Export-Package instructions: [org.apache.cxf.*] 
[WARNING] Manifest org.apache.cxf.systests:cxf-systests-ws-rm:jar:2.6.10-SNAPSHOT : The default
package '.' is not permitted by the Import-Package syntax. 
 This can be caused by compile errors in Eclipse because Eclipse creates 
valid class files regardless of compile errors.
The following package(s) import from the default package null
[INFO] 
[INFO] --- maven-resources-plugin:2.6:testResources (default-testResources) @ cxf-systests-ws-rm
---
[INFO] Using 'UTF-8' encoding to copy filtered resources.
[INFO] Copying 37 resources
[INFO] skip non existing resourceDirectory /x1/jenkins/jenkins-slave/workspace/CXF-2.6-deploy/cxf-2.6.x-fixes/systests/ws-rm/src/test/resources
[INFO] skip non existing resourceDirectory /x1/jenkins/jenkins-slave/workspace/CXF-2.6-deploy/cxf-2.6.x-fixes/systests/ws-rm/target/generated/src/test/resources
[INFO] Copying 3 resources
[INFO] 
[INFO] --- maven-compiler-plugin:3.1:testCompile (default-testCompile) @ cxf-systests-ws-rm
---
[INFO] Changes detected - recompiling the module!
[INFO] Compiling 32 source files to /x1/jenkins/jenkins-slave/workspace/CXF-2.6-deploy/cxf-2.6.x-fixes/systests/ws-rm/target/test-classes
[INFO] -------------------------------------------------------------
[ERROR] COMPILATION ERROR : 
[INFO] -------------------------------------------------------------
[ERROR] /x1/jenkins/jenkins-slave/workspace/CXF-2.6-deploy/cxf-2.6.x-fixes/systests/ws-rm/src/test/java/org/apache/cxf/systest/ws/rm/RobustServiceWithFaultTest.java:[66,28]
cannot find symbol
symbol  : method getConfiguration()
location: class org.apache.cxf.ws.rm.RMManager
[ERROR] /x1/jenkins/jenkins-slave/workspace/CXF-2.6-deploy/cxf-2.6.x-fixes/systests/ws-rm/src/test/java/org/apache/cxf/systest/ws/rm/RobustServiceWithFaultTest.java:[100,15]
cannot find symbol
symbol  : method getConfiguration()
location: class org.apache.cxf.ws.rm.RMManager
[ERROR] /x1/jenkins/jenkins-slave/workspace/CXF-2.6-deploy/cxf-2.6.x-fixes/systests/ws-rm/src/test/java/org/apache/cxf/systest/ws/rm/RobustServiceWithFaultTest.java:[177,9]
method does not override a method from its superclass
[INFO] 3 errors 
[INFO] -------------------------------------------------------------
[INFO] ------------------------------------------------------------------------
[INFO] Reactor Summary:
[INFO] 
[INFO] Apache CXF ........................................ SUCCESS [21.612s]
[INFO] Apache CXF Parent ................................. SUCCESS [5.699s]
[INFO] Apache CXF API .................................... SUCCESS [49.099s]
[INFO] Apache CXF Woodstox/MSV Schema Validation ......... SUCCESS [5.110s]
[INFO] Apache CXF XML Schema Validation with Xerces ...... SUCCESS [3.763s]
[INFO] Apache CXF Common ................................. SUCCESS [0.726s]
[INFO] Apache CXF Runtime Core ........................... SUCCESS [10.662s]
[INFO] Apache CXF Command Line Tools Common .............. SUCCESS [8.014s]
[INFO] Apache CXF Runtime JAXB DataBinding ............... SUCCESS [6.060s]
[INFO] Apache CXF Runtime SOAP Binding ................... SUCCESS [8.505s]
[INFO] Apache CXF Command Line Tools Validator ........... SUCCESS [6.333s]
[INFO] Apache CXF Command Line Tools WSDLTo Core ......... SUCCESS [5.096s]
[INFO] Apache CXF Command Line Tools WSDLTo JAXWS Frontend  SUCCESS [7.017s]
[INFO] Apache CXF Runtime JavaScript Client Generator Projects  SUCCESS [0.955s]
[INFO] Apache CXF Runtime JavaScript Client Generator .... SUCCESS [5.439s]
[INFO] Apache CXF Command Line Tools WSDL to JavaScript Front End  SUCCESS [4.659s]
[INFO] Apache CXF Command Line Tools WSDLTo JAXB Databinding  SUCCESS [4.690s]
[INFO] Apache CXF Maven Plugins .......................... SUCCESS [1.065s]
[INFO] Apache CXF WSDL Validator Maven2 Plugin ........... SUCCESS [7.402s]
[INFO] Apache CXF Code Generation Maven2 Plugins ......... SUCCESS [8.118s]
[INFO] Apache CXF Test Utilities ......................... SUCCESS [35.150s]
[INFO] Apache CXF Runtime Management ..................... SUCCESS [5.978s]
[INFO] Apache CXF Runtime JMS Transport .................. SUCCESS [7.969s]
[INFO] Apache CXF Runtime XML Binding .................... SUCCESS [5.260s]
[INFO] Apache CXF Runtime Local Transport ................ SUCCESS [3.971s]
[INFO] Apache CXF Runtime WS Policy ...................... SUCCESS [8.320s]
[INFO] Apache CXF Runtime HTTP Transport ................. SUCCESS [9.536s]
[INFO] Apache CXF Runtime HTTP Jetty Transport ........... SUCCESS [8.965s]
[INFO] Apache CXF Runtime Simple Frontend ................ SUCCESS [5.416s]
[INFO] Apache CXF Runtime WS Addressing .................. SUCCESS [5.412s]
[INFO] Apache CXF Runtime JAX-WS Frontend ................ SUCCESS [14.885s]
[INFO] Apache CXF Runtime XmlBeans DataBinding ........... SUCCESS [6.586s]
[INFO] Apache CXF Command Line Tools WSDLTo Test ......... SUCCESS [3.841s]
[INFO] Apache CXF Command Line Tools WSDLTo Misctools .... SUCCESS [4.865s]
[INFO] Apache CXF Command Line Tools ..................... SUCCESS [1.169s]
[INFO] Apache CXF Command Line Tools WSDLTo .............. SUCCESS [0.847s]
[INFO] Apache CXF Runtime Aegis Databinding .............. SUCCESS [10.114s]
[INFO] Apache CXF Command Line Tools JavaTo WS ........... SUCCESS [8.113s]
[INFO] Apache CXF Command Line Tools JavaTo .............. SUCCESS [1.985s]
[INFO] Apache CXF Runtime JAX-RS Frontend ................ SUCCESS [12.327s]
[INFO] Apache CXF Command Line Tools WADLTo JAXRS Frontend  SUCCESS [6.905s]
[INFO] Apache CXF Command Line Tools WADLTo .............. SUCCESS [2.444s]
[INFO] Apache CXF Runtime CORBA Binding .................. SUCCESS [9.582s]
[INFO] Apache CXF Command Line Tools CORBA ............... SUCCESS [9.829s]
[INFO] Apache CXF Runtime SDO DataBinding ................ SUCCESS [10.065s]
[INFO] Apache CXF Runtime JiBX DataBinding ............... SUCCESS [8.132s]
[INFO] Apache CXF Runtime Object Binding ................. SUCCESS [5.089s]
[INFO] Apache CXF Runtime Colocated Binding .............. SUCCESS [6.227s]
[INFO] Apache CXF Runtime ................................ SUCCESS [1.192s]
[INFO] Apache CXF Runtime Bindings ....................... SUCCESS [2.108s]
[INFO] Apache CXF Runtime Clustering ..................... SUCCESS [5.698s]
[INFO] Apache CXF Runtime JavaScript Frontend ............ SUCCESS [5.817s]
[INFO] Apache CXF Runtime WS Reliable Messaging .......... SUCCESS [12.338s]
[INFO] Apache CXF Runtime WS MetadataExchange ............ SUCCESS [5.497s]
[INFO] Apache CXF Runtime WS Security .................... SUCCESS [19.289s]
[INFO] Apache CXF JAX-RS Extensions: Providers ........... SUCCESS [8.797s]
[INFO] Apache CXF JAX-RS Extensions: Search .............. SUCCESS [8.671s]
[INFO] Apache CXF RS XML Security ........................ SUCCESS [6.580s]
[INFO] Apache CXF RS SSO SAML ............................ SUCCESS [6.905s]
[INFO] Apache CXF Runtime RS Security OAuth Parent ....... SUCCESS [1.680s]
[INFO] Apache CXF Runtime OAuth 1.0a ..................... SUCCESS [6.839s]
[INFO] Apache CXF Runtime OAuth 2.0 ...................... SUCCESS [7.730s]
[INFO] Apache CXF RS Cross-Origin Resource Sharing ....... SUCCESS [5.562s]
[INFO] Apache CXF Runtime Web Management ................. SUCCESS [51.456s]
[INFO] Apache CXF Runtime JavaScript Client Generator Tests  SUCCESS [2.962s]
[INFO] Apache CXF JCA Connection ......................... SUCCESS [7.426s]
[INFO] Apache CXF Integration ............................ SUCCESS [2.892s]
[INFO] Apache CXF Java2WS Maven2 Plugin .................. SUCCESS [6.545s]
[INFO] Apache CXF WADL2Java Code Generation Maven2 Plugin  SUCCESS [5.079s]
[INFO] Apache CXF CORBA Tools Maven2 Plugins ............. SUCCESS [5.584s]
[INFO] Apache CXF Archetype - Simple JAX-WS Java First ... SUCCESS [8.086s]
[INFO] Apache CXF Archetype - Simple JAX-RS webapp ....... SUCCESS [3.950s]
[INFO] Apache CXF Maven Archetypes ....................... SUCCESS [2.370s]
[INFO] Apache CXF STS Core ............................... SUCCESS [13.674s]
[INFO] Apache CXF STS war deployment ..................... SUCCESS [10.891s]
[INFO] Apache CXF STS basic systests ..................... SUCCESS [5.856s]
[INFO] Apache CXF STS advanced systests .................. SUCCESS [7.640s]
[INFO] Apache CXF Services ............................... SUCCESS [2.158s]
[INFO] Apache CXF STS service ............................ SUCCESS [2.293s]
[INFO] Apache CXF STS systests ........................... SUCCESS [1.729s]
[INFO] Apache CXF WSN API ................................ SUCCESS [10.233s]
[INFO] Apache CXF WSN Core ............................... SUCCESS [7.905s]
[INFO] Apache CXF WSN OSGi ............................... SUCCESS [4.761s]
[INFO] Apache CXF WSN service ............................ SUCCESS [3.792s]
[INFO] Apache CXF Karaf Parent ........................... SUCCESS [2.721s]
[INFO] Apache CXF Karaf Features ......................... SUCCESS [4.269s]
[INFO] Apache CXF Karaf Commands ......................... SUCCESS [4.895s]
[INFO] Apache CXF Bundle Parent .......................... SUCCESS [2.191s]
[INFO] Apache CXF Bundle Jar ............................. SUCCESS [3:35.049s]
[INFO] Apache CXF Minimal Bundle Jar ..................... SUCCESS [2:38.361s]
[INFO] Apache CXF JAX-RS Bundle Jar ...................... SUCCESS [1:06.726s]
[INFO] Apache CXF Compatibility Bundle Jar ............... SUCCESS [2:11.420s]
[INFO] Apache CXF Container Integration System Tests ..... SUCCESS [2.986s]
[INFO] Apache CXF Container Integration Test Webapp ...... SUCCESS [6.518s]
[INFO] Apache CXF Uncategorized System Tests ............. SUCCESS [13.651s]
[INFO] Apache CXF Transport System Tests ................. SUCCESS [5.341s]
[INFO] Apache CXF Transport System Tests JMS ............. SUCCESS [6.754s]
[INFO] Apache CXF JAX-WS System Tests .................... SUCCESS [6.406s]
[INFO] Apache CXF Databinding System Tests ............... SUCCESS [7.527s]
[INFO] Apache CXF JAX-RS System Tests .................... SUCCESS [12.283s]
[INFO] Apache CXF WS-* Specifications System Tests ....... SUCCESS [4.016s]
[INFO] Apache CXF WS-RM Specifications System Tests ...... FAILURE [1.188s]
[INFO] Apache CXF WS-Security System Tests ............... SKIPPED
[INFO] Apache CXF WS-Security Interop System Tests ....... SKIPPED
[INFO] Apache CXF JAX-RS System Advanced Security Tests .. SKIPPED
[INFO] Test for writing wsdl to repo ..................... SKIPPED
[INFO] Test for generating code from wsdl in repo ........ SKIPPED
[INFO] Apache CXF System Tests ........................... SKIPPED
[INFO] Apache CXF System Tests for Maven Plugins ......... SKIPPED
[INFO] Apache CXF Manifest Jar ........................... SKIPPED
[INFO] Apache CXF Samples ................................ SKIPPED
[INFO] Colocated Demo using Document/Literal Style ....... SKIPPED
[INFO] JavaScript Client Demo using Document/Literal Style  SKIPPED
[INFO] Generated JavaScript Sample using JAX-WS and JSR-181  SKIPPED
[INFO] Java First demo service using the JAXWSFactoryBeans  SKIPPED
[INFO] Java First demo using JMS ......................... SKIPPED
[INFO] JAX-RS Content Negotiation Demo ................... SKIPPED
[INFO] JAX-RS Basic Demo With HTTPS communications ....... SKIPPED
[INFO] JAX-RS Basic Demo ................................. SKIPPED
[INFO] CXF sample using a callback object ................ SKIPPED
[INFO] WSDL first demo using BARE Style in XML Binding (pure XML over HTTP)  SKIPPED
[INFO] JAX-WS Dispatch/Provider Demo ..................... SKIPPED
[INFO] WSDL first demo using Document/Literal Style and XMLBeans DataBinding  SKIPPED
[INFO] WSDL first demo using SOAP12 in Document/Literal Style  SKIPPED
[INFO] CXF Dynamic Client Sample ......................... SKIPPED
[INFO] JMS Transport Queue Demo using Document-Literal Style  SKIPPED
[INFO] WSDL first demo using the jms transport and jmsConfigFeature  SKIPPED
[INFO] RESTful Hello World Demo .......................... SKIPPED
[INFO] WSDL first demo using Document/Literal Style ...... SKIPPED
[INFO] CXF sample using the Aegis Binding without any webservice  SKIPPED
[INFO] Java First demo using JAX-WS APIs ................. SKIPPED
[INFO] WS-RM Demo ........................................ SKIPPED
[INFO] CXF Sample of Stream GZIP Interceptor ............. SKIPPED
[INFO] Spring HTTP Sample ................................ SKIPPED
[INFO] Spring HTTP Servlet demo with ruby support ........ SKIPPED
[INFO] Spring HTTP Servlet demo with groovy support ...... SKIPPED
[INFO] Hello world javascript demo ....................... SKIPPED
[INFO] CXF WS-Security UT Demo ........................... SKIPPED
[INFO] WS-Security UT Sign Demo .......................... SKIPPED
[INFO] CXF WS-Security Sign Encoding Demo ................ SKIPPED
[INFO] WS-Security UT Policy Demo ........................ SKIPPED
[INFO] MTOM Demo for SWA and XOP ......................... SKIPPED
[INFO] JAX-WS Asynchronous Demo using Document/Literal Style  SKIPPED
[INFO] Java First POJO Sample ............................ SKIPPED
[INFO] WS-Policy Demo .................................... SKIPPED
[INFO] Hello World Client Demo using JavaScript .......... SKIPPED
[INFO] WSDL first demo using HTTPS ....................... SKIPPED
[INFO] WS-Addressing Demo ................................ SKIPPED
[INFO] Sample using SOAP Headers ......................... SKIPPED
[INFO] SOAP/JMS Transport Specification Demo using Document-Literal Style  SKIPPED
[INFO] CXF sample using WRAPPED Style in XML Binding (pure XML over HTTP)  SKIPPED
[INFO] CXF sample using code first POJO's and the Aegis Binding  SKIPPED
[INFO] Sample of JAX-* Service Using an Aegis Client ..... SKIPPED
[INFO] JAX-WS Handler Demo ............................... SKIPPED
[INFO] WSDL first demo using RPC-Literal Style ........... SKIPPED
[INFO] JMS Transport Publish/Subscribe Demo using Document-Literal Style  SKIPPED
[INFO] JAX-RS Spring Security Demo ....................... SKIPPED
[INFO] LogBrowser ........................................ SKIPPED
[INFO] WS-Notification Demo .............................. SKIPPED
[INFO] CXF STS Demo ...................................... SKIPPED
[INFO] Bank sample using JAX-WS API's to talk via CORBA/IIOP  SKIPPED
[INFO] Bank sample using JAX-WS API's to talk via CORBA/IIOP  SKIPPED
[INFO] hello-world sample using JAX-WS API's to talk via CORBA/IIOP  SKIPPED
[INFO] OAuth 1.0a server ................................. SKIPPED
[INFO] OAuth 1.0a client ................................. SKIPPED
[INFO] JAX-RS Minimal OSGI Demo .......................... SKIPPED
[INFO] Apache CXF Distribution ........................... SKIPPED
[INFO] ------------------------------------------------------------------------
[INFO] BUILD FAILURE
[INFO] ------------------------------------------------------------------------
[INFO] Total time: 22:04.646s
[INFO] Finished at: Fri Aug 23 06:54:49 GMT 2013
[INFO] Final Memory: 120M/240M
[INFO] ------------------------------------------------------------------------
[ERROR] Failed to execute goal org.apache.maven.plugins:maven-compiler-plugin:3.1:testCompile
(default-testCompile) on project cxf-systests-ws-rm: Compilation failure: Compilation failure:
[ERROR] /x1/jenkins/jenkins-slave/workspace/CXF-2.6-deploy/cxf-2.6.x-fixes/systests/ws-rm/src/test/java/org/apache/cxf/systest/ws/rm/RobustServiceWithFaultTest.java:[66,28]
cannot find symbol
[ERROR] symbol  : method getConfiguration()
[ERROR] location: class org.apache.cxf.ws.rm.RMManager
[ERROR] /x1/jenkins/jenkins-slave/workspace/CXF-2.6-deploy/cxf-2.6.x-fixes/systests/ws-rm/src/test/java/org/apache/cxf/systest/ws/rm/RobustServiceWithFaultTest.java:[100,15]
cannot find symbol
[ERROR] symbol  : method getConfiguration()
[ERROR] location: class org.apache.cxf.ws.rm.RMManager
[ERROR] /x1/jenkins/jenkins-slave/workspace/CXF-2.6-deploy/cxf-2.6.x-fixes/systests/ws-rm/src/test/java/org/apache/cxf/systest/ws/rm/RobustServiceWithFaultTest.java:[177,9]
method does not override a method from its superclass
[ERROR] -> [Help 1]
[ERROR] 
[ERROR] To see the full stack trace of the errors, re-run Maven with the -e switch.
[ERROR] Re-run Maven using the -X switch to enable full debug logging.
[ERROR] 
[ERROR] For more information about the errors and possible solutions, please read the following
articles:
[ERROR] [Help 1] http://cwiki.apache.org/confluence/display/MAVEN/MojoFailureException
[ERROR] 
[ERROR] After correcting the problems, you can resume the build with the command
[ERROR]   mvn <goals> -rf :cxf-systests-ws-rm
Build step 'Invoke top-level Maven targets' marked build as failure

Mime
View raw message