cxf-notifications mailing list archives

Site index · List index
Message view « Date » · « Thread »
Top « Date » · « Thread »
From Apache Jenkins Server <jenk...@builds.apache.org>
Subject Build failed in Jenkins: CXF-2.7-deploy » Apache CXF JAX-RS System Tests #159
Date Wed, 21 Aug 2013 06:42:12 GMT
See <https://builds.apache.org/job/CXF-2.7-deploy/org.apache.cxf.systests$cxf-systests-jaxrs/159/changes>

Changes:

[sergeyb] Merged revisions 1515922 via svnmerge from 
https://svn.apache.org/repos/asf/cxf/trunk

........
  r1515922 | sergeyb | 2013-08-20 22:00:10 +0300 (Tue, 20 Aug 2013) | 1 line
  
  [CXF-5212] Checking for superclass when looking for context setters, patch on behalf of
Thorsten Hoeger applied
........

[sergeyb] Merged revisions 1515823-1515824 via svnmerge from 
https://svn.apache.org/repos/asf/cxf/trunk

........
  r1515823 | sergeyb | 2013-08-20 16:38:29 +0300 (Tue, 20 Aug 2013) | 1 line
  
  [CXF-5204] Taking care of TypeVars wrapped in GenericEntity too
........
  r1515824 | sergeyb | 2013-08-20 16:46:00 +0300 (Tue, 20 Aug 2013) | 1 line
  
  Minor update to the test
........

[sergeyb] Merged revisions 1515807 via svnmerge from 
https://svn.apache.org/repos/asf/cxf/trunk

........
  r1515807 | sergeyb | 2013-08-20 15:55:06 +0300 (Tue, 20 Aug 2013) | 1 line
  
  [CXF-5214] Better support for BeanParams
........

[sergeyb] Merged revisions 1515796 via svnmerge from 
https://svn.apache.org/repos/asf/cxf/trunk

........
  r1515796 | sergeyb | 2013-08-20 15:21:40 +0300 (Tue, 20 Aug 2013) | 1 line
  
  [CXF-5204] Some more work to do with handling TypeVariable
........

------------------------------------------
Aug 21, 2013 6:30:05 AM org.apache.maven.cli.event.ExecutionEventLogger projectStarted
INFO:                                                                         
Aug 21, 2013 6:30:05 AM org.apache.maven.cli.event.ExecutionEventLogger projectStarted
INFO: ------------------------------------------------------------------------
Aug 21, 2013 6:30:05 AM org.apache.maven.cli.event.ExecutionEventLogger projectStarted
INFO: Building Apache CXF JAX-RS System Tests 2.7.7-SNAPSHOT
Aug 21, 2013 6:30:05 AM org.apache.maven.cli.event.ExecutionEventLogger projectStarted
INFO: ------------------------------------------------------------------------
Downloading: http://repo.maven.apache.org/maven2/org/eclipse/jetty/jetty-plus/8.1.12.v20130726/jetty-plus-8.1.12.v20130726.pom
Downloaded: http://repo.maven.apache.org/maven2/org/eclipse/jetty/jetty-plus/8.1.12.v20130726/jetty-plus-8.1.12.v20130726.pom
(4 KB at 218.8 KB/sec)
Downloading: http://repo.maven.apache.org/maven2/org/eclipse/jetty/jetty-jndi/8.1.12.v20130726/jetty-jndi-8.1.12.v20130726.pom
Downloaded: http://repo.maven.apache.org/maven2/org/eclipse/jetty/jetty-jndi/8.1.12.v20130726/jetty-jndi-8.1.12.v20130726.pom
(3 KB at 324.7 KB/sec)
Downloading: http://repo.maven.apache.org/maven2/org/eclipse/jetty/jetty-jsp/8.1.12.v20130726/jetty-jsp-8.1.12.v20130726.pom
Downloaded: http://repo.maven.apache.org/maven2/org/eclipse/jetty/jetty-jsp/8.1.12.v20130726/jetty-jsp-8.1.12.v20130726.pom
(3 KB at 222.7 KB/sec)
Downloading: http://repo.maven.apache.org/maven2/org/eclipse/jetty/jetty-plus/8.1.12.v20130726/jetty-plus-8.1.12.v20130726.jar
Downloading: http://repo.maven.apache.org/maven2/org/eclipse/jetty/jetty-jndi/8.1.12.v20130726/jetty-jndi-8.1.12.v20130726.jar
Downloading: http://repo.maven.apache.org/maven2/org/eclipse/jetty/jetty-jsp/8.1.12.v20130726/jetty-jsp-8.1.12.v20130726.jar
Downloaded: http://repo.maven.apache.org/maven2/org/eclipse/jetty/jetty-jndi/8.1.12.v20130726/jetty-jndi-8.1.12.v20130726.jar
(40 KB at 3005.3 KB/sec)
Downloaded: http://repo.maven.apache.org/maven2/org/eclipse/jetty/jetty-jsp/8.1.12.v20130726/jetty-jsp-8.1.12.v20130726.jar
(4 KB at 243.5 KB/sec)
Downloaded: http://repo.maven.apache.org/maven2/org/eclipse/jetty/jetty-plus/8.1.12.v20130726/jetty-plus-8.1.12.v20130726.jar
(84 KB at 3778.2 KB/sec)
Aug 21, 2013 6:30:07 AM org.apache.maven.cli.event.ExecutionEventLogger mojoStarted
INFO: 
Aug 21, 2013 6:30:07 AM org.apache.maven.cli.event.ExecutionEventLogger mojoStarted
INFO: --- maven-clean-plugin:2.5:clean (default-clean) @ cxf-systests-jaxrs ---
[INFO] Deleting <https://builds.apache.org/job/CXF-2.7-deploy/org.apache.cxf.systests$cxf-systests-jaxrs/ws/target>
Aug 21, 2013 6:30:08 AM org.apache.maven.cli.event.ExecutionEventLogger mojoStarted
INFO: 
Aug 21, 2013 6:30:08 AM org.apache.maven.cli.event.ExecutionEventLogger mojoStarted
INFO: --- maven-bundle-plugin:2.4.0:cleanVersions (versions) @ cxf-systests-jaxrs ---
Aug 21, 2013 6:30:08 AM org.apache.maven.cli.event.ExecutionEventLogger mojoStarted
INFO: 
Aug 21, 2013 6:30:08 AM org.apache.maven.cli.event.ExecutionEventLogger mojoStarted
INFO: --- cxf-xml2fastinfoset-plugin:2.5.1-SNAPSHOT:xml2fastinfoset (xml2fastinfoset) @ cxf-systests-jaxrs
---
Aug 21, 2013 6:30:08 AM org.apache.maven.cli.event.ExecutionEventLogger mojoStarted
INFO: 
Aug 21, 2013 6:30:08 AM org.apache.maven.cli.event.ExecutionEventLogger mojoStarted
INFO: --- jibx-maven-plugin:1.2.4.5:schema-codegen (generate-java-code-from-schema) @ cxf-systests-jaxrs
---
[INFO] Generating Java sources in target/generated/src/main/java from schemas available in
src/test/resources/jibx...
Loaded and validated 1 specified schema(s)
Generated 1 top-level classes in package org.apache.cxf.systest.jaxrs.codegen.jibx
Total classes in model: 1
Aug 21, 2013 6:30:11 AM org.apache.maven.cli.event.ExecutionEventLogger mojoStarted
INFO: 
Aug 21, 2013 6:30:11 AM org.apache.maven.cli.event.ExecutionEventLogger mojoStarted
INFO: --- cxf-wadl2java-plugin:2.7.7-SNAPSHOT:wadl2java (generate-sources) @ cxf-systests-jaxrs
---
Aug 21, 2013 6:30:14 AM org.apache.cxf.common.jaxb.JAXBUtils logGeneratedClassNames
INFO: Created classes: org.apache.cxf.systest.jaxrs.codegen.schema.Book, org.apache.cxf.systest.jaxrs.codegen.schema.Book2,
org.apache.cxf.systest.jaxrs.codegen.schema.Chapter, org.apache.cxf.systest.jaxrs.codegen.schema.ObjectFactory
Aug 21, 2013 6:30:15 AM org.apache.maven.cli.event.ExecutionEventLogger mojoStarted
INFO: 
Aug 21, 2013 6:30:15 AM org.apache.maven.cli.event.ExecutionEventLogger mojoStarted
INFO: --- maven-remote-resources-plugin:1.3:process (default) @ cxf-systests-jaxrs ---
Aug 21, 2013 6:30:16 AM org.apache.maven.cli.event.ExecutionEventLogger mojoStarted
INFO: 
Aug 21, 2013 6:30:16 AM org.apache.maven.cli.event.ExecutionEventLogger mojoStarted
INFO: --- maven-resources-plugin:2.6:resources (default-resources) @ cxf-systests-jaxrs ---
[INFO] Using 'UTF-8' encoding to copy filtered resources.
[INFO] skip non existing resourceDirectory <https://builds.apache.org/job/CXF-2.7-deploy/org.apache.cxf.systests$cxf-systests-jaxrs/ws/src/main/java>
[INFO] skip non existing resourceDirectory <https://builds.apache.org/job/CXF-2.7-deploy/org.apache.cxf.systests$cxf-systests-jaxrs/ws/src/main/resources>
[INFO] skip non existing resourceDirectory <https://builds.apache.org/job/CXF-2.7-deploy/org.apache.cxf.systests$cxf-systests-jaxrs/ws/src/main/resources-filtered>
[INFO] skip non existing resourceDirectory <https://builds.apache.org/job/CXF-2.7-deploy/org.apache.cxf.systests$cxf-systests-jaxrs/ws/target/generated/src/main/resources>
[INFO] Copying 3 resources
Aug 21, 2013 6:30:16 AM org.apache.maven.cli.event.ExecutionEventLogger mojoStarted
INFO: 
Aug 21, 2013 6:30:16 AM org.apache.maven.cli.event.ExecutionEventLogger mojoStarted
INFO: --- maven-compiler-plugin:3.1:compile (default-compile) @ cxf-systests-jaxrs ---
[INFO] Changes detected - recompiling the module!
[INFO] Compiling 7 source files to <https://builds.apache.org/job/CXF-2.7-deploy/org.apache.cxf.systests$cxf-systests-jaxrs/ws/target/classes>
Aug 21, 2013 6:30:17 AM org.apache.maven.cli.event.ExecutionEventLogger mojoStarted
INFO: 
Aug 21, 2013 6:30:17 AM org.apache.maven.cli.event.ExecutionEventLogger mojoStarted
INFO: --- maven-bundle-plugin:2.4.0:manifest (bundle-manifest) @ cxf-systests-jaxrs ---
in default pack? 
[WARNING] Manifest org.apache.cxf.systests:cxf-systests-jaxrs:jar:2.7.7-SNAPSHOT : The default
package '.' is not permitted by the Import-Package syntax. 
 This can be caused by compile errors in Eclipse because Eclipse creates 
valid class files regardless of compile errors.
The following package(s) import from the default package null
Aug 21, 2013 6:30:17 AM org.apache.maven.cli.event.ExecutionEventLogger mojoStarted
INFO: 
Aug 21, 2013 6:30:17 AM org.apache.maven.cli.event.ExecutionEventLogger mojoStarted
INFO: --- jibx-maven-plugin:1.2.4.5:bind (compile-binding) @ cxf-systests-jaxrs ---
[INFO] Running JiBX binding compiler (single-module mode) on 1 binding file(s)
Verification failure on class org.apache.cxf.systest.jaxrs.codegen.jibx.Book:
  VERIFIED_REJECTED
Repository.lookup() failed. FILE NOT FOUND?

Verification failure on class org.apache.cxf.systest.jaxrs.codegen.jibx.JiBX_bindingBook_access:
  VERIFIED_REJECTED
Repository.lookup() failed. FILE NOT FOUND?

Verification failure on class org.apache.cxf.systest.jaxrs.codegen.jibx.JiBX_bindingFactory:
  VERIFIED_REJECTED
Repository.lookup() failed. FILE NOT FOUND?

Aug 21, 2013 6:30:17 AM org.apache.maven.cli.event.ExecutionEventLogger mojoStarted
INFO: 
Aug 21, 2013 6:30:17 AM org.apache.maven.cli.event.ExecutionEventLogger mojoStarted
INFO: --- maven-resources-plugin:2.6:testResources (default-testResources) @ cxf-systests-jaxrs
---
[INFO] Using 'UTF-8' encoding to copy filtered resources.
[INFO] Copying 104 resources
[INFO] Copying 65 resources
[INFO] skip non existing resourceDirectory <https://builds.apache.org/job/CXF-2.7-deploy/org.apache.cxf.systests$cxf-systests-jaxrs/ws/target/generated/src/test/resources>
[INFO] Copying 3 resources
Aug 21, 2013 6:30:19 AM org.apache.maven.cli.event.ExecutionEventLogger mojoStarted
INFO: 
Aug 21, 2013 6:30:19 AM org.apache.maven.cli.event.ExecutionEventLogger mojoStarted
INFO: --- maven-compiler-plugin:3.1:testCompile (default-testCompile) @ cxf-systests-jaxrs
---
[INFO] Changes detected - recompiling the module!
[INFO] Compiling 188 source files to <https://builds.apache.org/job/CXF-2.7-deploy/org.apache.cxf.systests$cxf-systests-jaxrs/ws/target/test-classes>
[INFO] -------------------------------------------------------------
[WARNING] COMPILATION WARNING : 
[INFO] -------------------------------------------------------------
[WARNING] Note: <https://builds.apache.org/job/CXF-2.7-deploy/org.apache.cxf.systests$cxf-systests-jaxrs/ws/src/test/java/org/apache/cxf/systest/jaxrs/GenericRestServiceImpl.java>
uses unchecked or unsafe operations.
[WARNING] Note: Recompile with -Xlint:unchecked for details.
[INFO] 2 warnings 
[INFO] -------------------------------------------------------------
[INFO] -------------------------------------------------------------
[ERROR] COMPILATION ERROR : 
[INFO] -------------------------------------------------------------
[ERROR] <https://builds.apache.org/job/CXF-2.7-deploy/org.apache.cxf.systests$cxf-systests-jaxrs/ws/src/test/java/org/apache/cxf/systest/jaxrs/security/SecureBookStore.java>:[35,38]
cannot find symbol
symbol: class AbstractSecureBookStore
[ERROR] <https://builds.apache.org/job/CXF-2.7-deploy/org.apache.cxf.systests$cxf-systests-jaxrs/ws/src/test/java/org/apache/cxf/systest/jaxrs/security/SecureBookStore.java>:[72,14]
cannot find symbol
symbol  : variable securityContext
location: class org.apache.cxf.systest.jaxrs.security.SecureBookStore
[ERROR] <https://builds.apache.org/job/CXF-2.7-deploy/org.apache.cxf.systests$cxf-systests-jaxrs/ws/src/test/java/org/apache/cxf/systest/jaxrs/security/SecureBookStore.java>:[73,16]
cannot find symbol
symbol  : variable securityContext
location: class org.apache.cxf.systest.jaxrs.security.SecureBookStore
[ERROR] <https://builds.apache.org/job/CXF-2.7-deploy/org.apache.cxf.systests$cxf-systests-jaxrs/ws/src/test/java/org/apache/cxf/systest/jaxrs/security/SecureBookStore.java>:[74,17]
cannot find symbol
symbol  : variable securityContext
location: class org.apache.cxf.systest.jaxrs.security.SecureBookStore
[INFO] 4 errors 
[INFO] -------------------------------------------------------------

Mime
View raw message