cxf-notifications mailing list archives

Site index · List index
Message view « Date » · « Thread »
Top « Date » · « Thread »
From Apache Jenkins Server <jenk...@builds.apache.org>
Subject Build failed in Jenkins: CXF-2.6-deploy #272
Date Thu, 22 Aug 2013 07:13:23 GMT
See <https://builds.apache.org/job/CXF-2.6-deploy/272/changes>

Changes:

[dkulp] Blocking revisions 1516212,1516213 via  git from
https://svn.apache.org/repos/asf/cxf/branches/2.7.x-fixes

[dkulp] Recording revisions 1516209,1516210,1516211 via  git from
https://svn.apache.org/repos/asf/cxf/branches/2.7.x-fixes

[dkulp] Merged revisions 1516211 via  git cherry-pick from
https://svn.apache.org/repos/asf/cxf/branches/2.7.x-fixes

........
  r1516211 | dkulp | 2013-08-21 12:47:02 -0400 (Wed, 21 Aug 2013) | 10 lines

  Merged revisions 1516208 via  git cherry-pick from
  https://svn.apache.org/repos/asf/cxf/trunk

  ........
    r1516208 | dkulp | 2013-08-21 12:43:57 -0400 (Wed, 21 Aug 2013) | 2 lines

    [CXF-5225] Provide the Endpoint so conduit selectors can make a complete decision

  ........

........

[dkulp] Merged revisions 1516210 via  git cherry-pick from
https://svn.apache.org/repos/asf/cxf/branches/2.7.x-fixes

........
  r1516210 | dkulp | 2013-08-21 12:46:59 -0400 (Wed, 21 Aug 2013) | 10 lines

  Merged revisions 1516207 via  git cherry-pick from
  https://svn.apache.org/repos/asf/cxf/trunk

  ........
    r1516207 | dkulp | 2013-08-21 12:43:54 -0400 (Wed, 21 Aug 2013) | 2 lines

    Remove a bunch of tab characters

  ........

........

[dkulp] Merged revisions 1516209 via  git cherry-pick from
https://svn.apache.org/repos/asf/cxf/branches/2.7.x-fixes

........
  r1516209 | dkulp | 2013-08-21 12:46:54 -0400 (Wed, 21 Aug 2013) | 10 lines

  Merged revisions 1516206 via  git cherry-pick from
  https://svn.apache.org/repos/asf/cxf/trunk

  ........
    r1516206 | dkulp | 2013-08-21 12:43:49 -0400 (Wed, 21 Aug 2013) | 2 lines

    Use the latest released xjc-utils

  ........

........

[sergeyb] Merged revisions 1516158 via svnmerge from 
https://svn.apache.org/repos/asf/cxf/branches/2.7.x-fixes

................
  r1516158 | sergeyb | 2013-08-21 16:26:18 +0300 (Wed, 21 Aug 2013) | 13 lines
  
  Merged revisions 1516152-1516153 via svnmerge from 
  https://svn.apache.org/repos/asf/cxf/trunk
  
  ........
    r1516152 | sergeyb | 2013-08-21 16:17:30 +0300 (Wed, 21 Aug 2013) | 1 line
    
    [CXF-5212] Adding missing test file, sorry
  ........
    r1516153 | sergeyb | 2013-08-21 16:18:57 +0300 (Wed, 21 Aug 2013) | 1 line
    
    [CXF-5198] Getting expressions with camel case supported when SearchBean is used
  ........
................

------------------------------------------
[...truncated 17806 lines...]
Uploaded: https://repository.apache.org/content/repositories/snapshots/org/apache/cxf/systests/cxf-systests-ws-specs/2.6.10-SNAPSHOT/maven-metadata.xml
(2 KB at 3.7 KB/sec)
[INFO]                                                                         
[INFO] ------------------------------------------------------------------------
[INFO] Building Apache CXF WS-RM Specifications System Tests 2.6.10-SNAPSHOT
[INFO] ------------------------------------------------------------------------
[INFO] 
[INFO] --- maven-bundle-plugin:2.4.0:cleanVersions (versions) @ cxf-systests-ws-rm ---
[INFO] 
[INFO] --- cxf-xml2fastinfoset-plugin:2.5.0:xml2fastinfoset (xml2fastinfoset) @ cxf-systests-ws-rm
---
[INFO] 
[INFO] --- maven-remote-resources-plugin:1.3:process (default) @ cxf-systests-ws-rm ---
[INFO] 
[INFO] --- maven-resources-plugin:2.6:resources (default-resources) @ cxf-systests-ws-rm ---
[INFO] Using 'UTF-8' encoding to copy filtered resources.
[INFO] skip non existing resourceDirectory <https://builds.apache.org/job/CXF-2.6-deploy/ws/cxf-2.6.x-fixes/systests/ws-rm/src/main/java>
[INFO] skip non existing resourceDirectory <https://builds.apache.org/job/CXF-2.6-deploy/ws/cxf-2.6.x-fixes/systests/ws-rm/src/main/resources>
[INFO] skip non existing resourceDirectory <https://builds.apache.org/job/CXF-2.6-deploy/ws/cxf-2.6.x-fixes/systests/ws-rm/src/main/resources-filtered>
[INFO] skip non existing resourceDirectory <https://builds.apache.org/job/CXF-2.6-deploy/ws/cxf-2.6.x-fixes/systests/ws-rm/target/generated/src/main/resources>
[INFO] Copying 3 resources
[INFO] 
[INFO] --- maven-compiler-plugin:3.1:compile (default-compile) @ cxf-systests-ws-rm ---
[INFO] No sources to compile
[INFO] 
[INFO] --- maven-bundle-plugin:2.4.0:manifest (bundle-manifest) @ cxf-systests-ws-rm ---
in default pack? 
[WARNING] Manifest org.apache.cxf.systests:cxf-systests-ws-rm:jar:2.6.10-SNAPSHOT : Unused
Export-Package instructions: [org.apache.cxf.*] 
[WARNING] Manifest org.apache.cxf.systests:cxf-systests-ws-rm:jar:2.6.10-SNAPSHOT : The default
package '.' is not permitted by the Import-Package syntax. 
 This can be caused by compile errors in Eclipse because Eclipse creates 
valid class files regardless of compile errors.
The following package(s) import from the default package null
[INFO] 
[INFO] --- maven-resources-plugin:2.6:testResources (default-testResources) @ cxf-systests-ws-rm
---
[INFO] Using 'UTF-8' encoding to copy filtered resources.
[INFO] Copying 37 resources
[INFO] skip non existing resourceDirectory <https://builds.apache.org/job/CXF-2.6-deploy/ws/cxf-2.6.x-fixes/systests/ws-rm/src/test/resources>
[INFO] skip non existing resourceDirectory <https://builds.apache.org/job/CXF-2.6-deploy/ws/cxf-2.6.x-fixes/systests/ws-rm/target/generated/src/test/resources>
[INFO] Copying 3 resources
[INFO] 
[INFO] --- maven-compiler-plugin:3.1:testCompile (default-testCompile) @ cxf-systests-ws-rm
---
[INFO] Changes detected - recompiling the module!
[INFO] Compiling 32 source files to <https://builds.apache.org/job/CXF-2.6-deploy/ws/cxf-2.6.x-fixes/systests/ws-rm/target/test-classes>
[INFO] -------------------------------------------------------------
[ERROR] COMPILATION ERROR : 
[INFO] -------------------------------------------------------------
[ERROR] <https://builds.apache.org/job/CXF-2.6-deploy/ws/cxf-2.6.x-fixes/systests/ws-rm/src/test/java/org/apache/cxf/systest/ws/rm/RobustServiceWithFaultTest.java>:[66,28]
cannot find symbol
symbol  : method getConfiguration()
location: class org.apache.cxf.ws.rm.RMManager
[ERROR] <https://builds.apache.org/job/CXF-2.6-deploy/ws/cxf-2.6.x-fixes/systests/ws-rm/src/test/java/org/apache/cxf/systest/ws/rm/RobustServiceWithFaultTest.java>:[100,15]
cannot find symbol
symbol  : method getConfiguration()
location: class org.apache.cxf.ws.rm.RMManager
[ERROR] <https://builds.apache.org/job/CXF-2.6-deploy/ws/cxf-2.6.x-fixes/systests/ws-rm/src/test/java/org/apache/cxf/systest/ws/rm/RobustServiceWithFaultTest.java>:[177,9]
method does not override a method from its superclass
[INFO] 3 errors 
[INFO] -------------------------------------------------------------
[INFO] ------------------------------------------------------------------------
[INFO] Reactor Summary:
[INFO] 
[INFO] Apache CXF ........................................ SUCCESS [14.510s]
[INFO] Apache CXF Parent ................................. SUCCESS [7.527s]
[INFO] Apache CXF API .................................... SUCCESS [1:26.285s]
[INFO] Apache CXF Woodstox/MSV Schema Validation ......... SUCCESS [12.394s]
[INFO] Apache CXF XML Schema Validation with Xerces ...... SUCCESS [8.432s]
[INFO] Apache CXF Common ................................. SUCCESS [2.390s]
[INFO] Apache CXF Runtime Core ........................... SUCCESS [20.127s]
[INFO] Apache CXF Command Line Tools Common .............. SUCCESS [13.903s]
[INFO] Apache CXF Runtime JAXB DataBinding ............... SUCCESS [10.432s]
[INFO] Apache CXF Runtime SOAP Binding ................... SUCCESS [15.936s]
[INFO] Apache CXF Command Line Tools Validator ........... SUCCESS [8.733s]
[INFO] Apache CXF Command Line Tools WSDLTo Core ......... SUCCESS [9.227s]
[INFO] Apache CXF Command Line Tools WSDLTo JAXWS Frontend  SUCCESS [11.343s]
[INFO] Apache CXF Runtime JavaScript Client Generator Projects  SUCCESS [2.574s]
[INFO] Apache CXF Runtime JavaScript Client Generator .... SUCCESS [8.151s]
[INFO] Apache CXF Command Line Tools WSDL to JavaScript Front End  SUCCESS [7.705s]
[INFO] Apache CXF Command Line Tools WSDLTo JAXB Databinding  SUCCESS [7.660s]
[INFO] Apache CXF Maven Plugins .......................... SUCCESS [4.251s]
[INFO] Apache CXF WSDL Validator Maven2 Plugin ........... SUCCESS [9.141s]
[INFO] Apache CXF Code Generation Maven2 Plugins ......... SUCCESS [12.388s]
[INFO] Apache CXF Test Utilities ......................... SUCCESS [47.343s]
[INFO] Apache CXF Runtime Management ..................... SUCCESS [9.422s]
[INFO] Apache CXF Runtime JMS Transport .................. SUCCESS [11.986s]
[INFO] Apache CXF Runtime XML Binding .................... SUCCESS [8.135s]
[INFO] Apache CXF Runtime Local Transport ................ SUCCESS [8.337s]
[INFO] Apache CXF Runtime WS Policy ...................... SUCCESS [13.702s]
[INFO] Apache CXF Runtime HTTP Transport ................. SUCCESS [15.749s]
[INFO] Apache CXF Runtime HTTP Jetty Transport ........... SUCCESS [14.190s]
[INFO] Apache CXF Runtime Simple Frontend ................ SUCCESS [11.598s]
[INFO] Apache CXF Runtime WS Addressing .................. SUCCESS [9.559s]
[INFO] Apache CXF Runtime JAX-WS Frontend ................ SUCCESS [20.563s]
[INFO] Apache CXF Runtime XmlBeans DataBinding ........... SUCCESS [9.204s]
[INFO] Apache CXF Command Line Tools WSDLTo Test ......... SUCCESS [6.863s]
[INFO] Apache CXF Command Line Tools WSDLTo Misctools .... SUCCESS [8.648s]
[INFO] Apache CXF Command Line Tools ..................... SUCCESS [3.202s]
[INFO] Apache CXF Command Line Tools WSDLTo .............. SUCCESS [2.060s]
[INFO] Apache CXF Runtime Aegis Databinding .............. SUCCESS [15.401s]
[INFO] Apache CXF Command Line Tools JavaTo WS ........... SUCCESS [14.620s]
[INFO] Apache CXF Command Line Tools JavaTo .............. SUCCESS [2.794s]
[INFO] Apache CXF Runtime JAX-RS Frontend ................ SUCCESS [1:35.781s]
[INFO] Apache CXF Command Line Tools WADLTo JAXRS Frontend  SUCCESS [3:05.938s]
[INFO] Apache CXF Command Line Tools WADLTo .............. SUCCESS [1:10.085s]
[INFO] Apache CXF Runtime CORBA Binding .................. SUCCESS [32.347s]
[INFO] Apache CXF Command Line Tools CORBA ............... SUCCESS [24.821s]
[INFO] Apache CXF Runtime SDO DataBinding ................ SUCCESS [14.881s]
[INFO] Apache CXF Runtime JiBX DataBinding ............... SUCCESS [15.474s]
[INFO] Apache CXF Runtime Object Binding ................. SUCCESS [11.992s]
[INFO] Apache CXF Runtime Colocated Binding .............. SUCCESS [8.990s]
[INFO] Apache CXF Runtime ................................ SUCCESS [3.581s]
[INFO] Apache CXF Runtime Bindings ....................... SUCCESS [2.677s]
[INFO] Apache CXF Runtime Clustering ..................... SUCCESS [8.560s]
[INFO] Apache CXF Runtime JavaScript Frontend ............ SUCCESS [9.185s]
[INFO] Apache CXF Runtime WS Reliable Messaging .......... SUCCESS [16.774s]
[INFO] Apache CXF Runtime WS MetadataExchange ............ SUCCESS [8.970s]
[INFO] Apache CXF Runtime WS Security .................... SUCCESS [24.435s]
[INFO] Apache CXF JAX-RS Extensions: Providers ........... SUCCESS [10.072s]
[INFO] Apache CXF JAX-RS Extensions: Search .............. SUCCESS [11.042s]
[INFO] Apache CXF RS XML Security ........................ SUCCESS [9.282s]
[INFO] Apache CXF RS SSO SAML ............................ SUCCESS [8.172s]
[INFO] Apache CXF Runtime RS Security OAuth Parent ....... SUCCESS [2.262s]
[INFO] Apache CXF Runtime OAuth 1.0a ..................... SUCCESS [8.726s]
[INFO] Apache CXF Runtime OAuth 2.0 ...................... SUCCESS [11.806s]
[INFO] Apache CXF RS Cross-Origin Resource Sharing ....... SUCCESS [7.036s]
[INFO] Apache CXF Runtime Web Management ................. SUCCESS [1:17.261s]
[INFO] Apache CXF Runtime JavaScript Client Generator Tests  SUCCESS [4.918s]
[INFO] Apache CXF JCA Connection ......................... SUCCESS [10.169s]
[INFO] Apache CXF Integration ............................ SUCCESS [2.641s]
[INFO] Apache CXF Java2WS Maven2 Plugin .................. SUCCESS [7.997s]
[INFO] Apache CXF WADL2Java Code Generation Maven2 Plugin  SUCCESS [7.786s]
[INFO] Apache CXF CORBA Tools Maven2 Plugins ............. SUCCESS [9.304s]
[INFO] Apache CXF Archetype - Simple JAX-WS Java First ... SUCCESS [6.806s]
[INFO] Apache CXF Archetype - Simple JAX-RS webapp ....... SUCCESS [3.972s]
[INFO] Apache CXF Maven Archetypes ....................... SUCCESS [3.876s]
[INFO] Apache CXF STS Core ............................... SUCCESS [17.018s]
[INFO] Apache CXF STS war deployment ..................... SUCCESS [15.568s]
[INFO] Apache CXF STS basic systests ..................... SUCCESS [9.758s]
[INFO] Apache CXF STS advanced systests .................. SUCCESS [9.499s]
[INFO] Apache CXF Services ............................... SUCCESS [3.073s]
[INFO] Apache CXF STS service ............................ SUCCESS [2.223s]
[INFO] Apache CXF STS systests ........................... SUCCESS [3.179s]
[INFO] Apache CXF WSN API ................................ SUCCESS [16.811s]
[INFO] Apache CXF WSN Core ............................... SUCCESS [11.886s]
[INFO] Apache CXF WSN OSGi ............................... SUCCESS [7.363s]
[INFO] Apache CXF WSN service ............................ SUCCESS [1.952s]
[INFO] Apache CXF Karaf Parent ........................... SUCCESS [2.273s]
[INFO] Apache CXF Karaf Features ......................... SUCCESS [4.908s]
[INFO] Apache CXF Karaf Commands ......................... SUCCESS [7.671s]
[INFO] Apache CXF Bundle Parent .......................... SUCCESS [4.529s]
[INFO] Apache CXF Bundle Jar ............................. SUCCESS [4:43.680s]
[INFO] Apache CXF Minimal Bundle Jar ..................... SUCCESS [3:24.591s]
[INFO] Apache CXF JAX-RS Bundle Jar ...................... SUCCESS [1:39.743s]
[INFO] Apache CXF Compatibility Bundle Jar ............... SUCCESS [3:19.254s]
[INFO] Apache CXF Container Integration System Tests ..... SUCCESS [4.041s]
[INFO] Apache CXF Container Integration Test Webapp ...... SUCCESS [9.830s]
[INFO] Apache CXF Uncategorized System Tests ............. SUCCESS [14.571s]
[INFO] Apache CXF Transport System Tests ................. SUCCESS [12.066s]
[INFO] Apache CXF Transport System Tests JMS ............. SUCCESS [10.090s]
[INFO] Apache CXF JAX-WS System Tests .................... SUCCESS [8.322s]
[INFO] Apache CXF Databinding System Tests ............... SUCCESS [9.439s]
[INFO] Apache CXF JAX-RS System Tests .................... SUCCESS [17.156s]
[INFO] Apache CXF WS-* Specifications System Tests ....... SUCCESS [7.814s]
[INFO] Apache CXF WS-RM Specifications System Tests ...... FAILURE [1.042s]
[INFO] Apache CXF WS-Security System Tests ............... SKIPPED
[INFO] Apache CXF WS-Security Interop System Tests ....... SKIPPED
[INFO] Apache CXF JAX-RS System Advanced Security Tests .. SKIPPED
[INFO] Test for writing wsdl to repo ..................... SKIPPED
[INFO] Test for generating code from wsdl in repo ........ SKIPPED
[INFO] Apache CXF System Tests ........................... SKIPPED
[INFO] Apache CXF System Tests for Maven Plugins ......... SKIPPED
[INFO] Apache CXF Manifest Jar ........................... SKIPPED
[INFO] Apache CXF Samples ................................ SKIPPED
[INFO] Colocated Demo using Document/Literal Style ....... SKIPPED
[INFO] JavaScript Client Demo using Document/Literal Style  SKIPPED
[INFO] Generated JavaScript Sample using JAX-WS and JSR-181  SKIPPED
[INFO] Java First demo service using the JAXWSFactoryBeans  SKIPPED
[INFO] Java First demo using JMS ......................... SKIPPED
[INFO] JAX-RS Content Negotiation Demo ................... SKIPPED
[INFO] JAX-RS Basic Demo With HTTPS communications ....... SKIPPED
[INFO] JAX-RS Basic Demo ................................. SKIPPED
[INFO] CXF sample using a callback object ................ SKIPPED
[INFO] WSDL first demo using BARE Style in XML Binding (pure XML over HTTP)  SKIPPED
[INFO] JAX-WS Dispatch/Provider Demo ..................... SKIPPED
[INFO] WSDL first demo using Document/Literal Style and XMLBeans DataBinding  SKIPPED
[INFO] WSDL first demo using SOAP12 in Document/Literal Style  SKIPPED
[INFO] CXF Dynamic Client Sample ......................... SKIPPED
[INFO] JMS Transport Queue Demo using Document-Literal Style  SKIPPED
[INFO] WSDL first demo using the jms transport and jmsConfigFeature  SKIPPED
[INFO] RESTful Hello World Demo .......................... SKIPPED
[INFO] WSDL first demo using Document/Literal Style ...... SKIPPED
[INFO] CXF sample using the Aegis Binding without any webservice  SKIPPED
[INFO] Java First demo using JAX-WS APIs ................. SKIPPED
[INFO] WS-RM Demo ........................................ SKIPPED
[INFO] CXF Sample of Stream GZIP Interceptor ............. SKIPPED
[INFO] Spring HTTP Sample ................................ SKIPPED
[INFO] Spring HTTP Servlet demo with ruby support ........ SKIPPED
[INFO] Spring HTTP Servlet demo with groovy support ...... SKIPPED
[INFO] Hello world javascript demo ....................... SKIPPED
[INFO] CXF WS-Security UT Demo ........................... SKIPPED
[INFO] WS-Security UT Sign Demo .......................... SKIPPED
[INFO] CXF WS-Security Sign Encoding Demo ................ SKIPPED
[INFO] WS-Security UT Policy Demo ........................ SKIPPED
[INFO] MTOM Demo for SWA and XOP ......................... SKIPPED
[INFO] JAX-WS Asynchronous Demo using Document/Literal Style  SKIPPED
[INFO] Java First POJO Sample ............................ SKIPPED
[INFO] WS-Policy Demo .................................... SKIPPED
[INFO] Hello World Client Demo using JavaScript .......... SKIPPED
[INFO] WSDL first demo using HTTPS ....................... SKIPPED
[INFO] WS-Addressing Demo ................................ SKIPPED
[INFO] Sample using SOAP Headers ......................... SKIPPED
[INFO] SOAP/JMS Transport Specification Demo using Document-Literal Style  SKIPPED
[INFO] CXF sample using WRAPPED Style in XML Binding (pure XML over HTTP)  SKIPPED
[INFO] CXF sample using code first POJO's and the Aegis Binding  SKIPPED
[INFO] Sample of JAX-* Service Using an Aegis Client ..... SKIPPED
[INFO] JAX-WS Handler Demo ............................... SKIPPED
[INFO] WSDL first demo using RPC-Literal Style ........... SKIPPED
[INFO] JMS Transport Publish/Subscribe Demo using Document-Literal Style  SKIPPED
[INFO] JAX-RS Spring Security Demo ....................... SKIPPED
[INFO] LogBrowser ........................................ SKIPPED
[INFO] WS-Notification Demo .............................. SKIPPED
[INFO] CXF STS Demo ...................................... SKIPPED
[INFO] Bank sample using JAX-WS API's to talk via CORBA/IIOP  SKIPPED
[INFO] Bank sample using JAX-WS API's to talk via CORBA/IIOP  SKIPPED
[INFO] hello-world sample using JAX-WS API's to talk via CORBA/IIOP  SKIPPED
[INFO] OAuth 1.0a server ................................. SKIPPED
[INFO] OAuth 1.0a client ................................. SKIPPED
[INFO] JAX-RS Minimal OSGI Demo .......................... SKIPPED
[INFO] Apache CXF Distribution ........................... SKIPPED
[INFO] ------------------------------------------------------------------------
[INFO] BUILD FAILURE
[INFO] ------------------------------------------------------------------------
[INFO] Total time: 37:33.129s
[INFO] Finished at: Thu Aug 22 07:13:22 UTC 2013
[INFO] Final Memory: 114M/243M
[INFO] ------------------------------------------------------------------------
[ERROR] Failed to execute goal org.apache.maven.plugins:maven-compiler-plugin:3.1:testCompile
(default-testCompile) on project cxf-systests-ws-rm: Compilation failure: Compilation failure:
[ERROR] <https://builds.apache.org/job/CXF-2.6-deploy/ws/cxf-2.6.x-fixes/systests/ws-rm/src/test/java/org/apache/cxf/systest/ws/rm/RobustServiceWithFaultTest.java>:[66,28]
cannot find symbol
[ERROR] symbol  : method getConfiguration()
[ERROR] location: class org.apache.cxf.ws.rm.RMManager
[ERROR] <https://builds.apache.org/job/CXF-2.6-deploy/ws/cxf-2.6.x-fixes/systests/ws-rm/src/test/java/org/apache/cxf/systest/ws/rm/RobustServiceWithFaultTest.java>:[100,15]
cannot find symbol
[ERROR] symbol  : method getConfiguration()
[ERROR] location: class org.apache.cxf.ws.rm.RMManager
[ERROR] <https://builds.apache.org/job/CXF-2.6-deploy/ws/cxf-2.6.x-fixes/systests/ws-rm/src/test/java/org/apache/cxf/systest/ws/rm/RobustServiceWithFaultTest.java>:[177,9]
method does not override a method from its superclass
[ERROR] -> [Help 1]
[ERROR] 
[ERROR] To see the full stack trace of the errors, re-run Maven with the -e switch.
[ERROR] Re-run Maven using the -X switch to enable full debug logging.
[ERROR] 
[ERROR] For more information about the errors and possible solutions, please read the following
articles:
[ERROR] [Help 1] http://cwiki.apache.org/confluence/display/MAVEN/MojoFailureException
[ERROR] 
[ERROR] After correcting the problems, you can resume the build with the command
[ERROR]   mvn <goals> -rf :cxf-systests-ws-rm
Build step 'Invoke top-level Maven targets' marked build as failure

Mime
View raw message