cxf-notifications mailing list archives

Site index · List index
Message view « Date » · « Thread »
Top « Date » · « Thread »
From Apache Jenkins Server <jenk...@builds.apache.org>
Subject Build failed in Jenkins: CXF-2.7-deploy » Apache CXF WS-RM Specifications System Tests #160
Date Thu, 22 Aug 2013 07:10:51 GMT
See <https://builds.apache.org/job/CXF-2.7-deploy/org.apache.cxf.systests$cxf-systests-ws-rm/160/>

------------------------------------------
Aug 22, 2013 6:51:45 AM org.apache.maven.cli.event.ExecutionEventLogger projectStarted
INFO:                                                                         
Aug 22, 2013 6:51:45 AM org.apache.maven.cli.event.ExecutionEventLogger projectStarted
INFO: ------------------------------------------------------------------------
Aug 22, 2013 6:51:45 AM org.apache.maven.cli.event.ExecutionEventLogger projectStarted
INFO: Building Apache CXF WS-RM Specifications System Tests 2.7.7-SNAPSHOT
Aug 22, 2013 6:51:45 AM org.apache.maven.cli.event.ExecutionEventLogger projectStarted
INFO: ------------------------------------------------------------------------
Aug 22, 2013 6:51:45 AM org.apache.maven.cli.event.ExecutionEventLogger mojoStarted
INFO: 
Aug 22, 2013 6:51:45 AM org.apache.maven.cli.event.ExecutionEventLogger mojoStarted
INFO: --- maven-clean-plugin:2.5:clean (default-clean) @ cxf-systests-ws-rm ---
[INFO] Deleting <https://builds.apache.org/job/CXF-2.7-deploy/org.apache.cxf.systests$cxf-systests-ws-rm/ws/target>
Aug 22, 2013 6:51:45 AM org.apache.maven.cli.event.ExecutionEventLogger mojoStarted
INFO: 
Aug 22, 2013 6:51:45 AM org.apache.maven.cli.event.ExecutionEventLogger mojoStarted
INFO: --- maven-bundle-plugin:2.4.0:cleanVersions (versions) @ cxf-systests-ws-rm ---
Aug 22, 2013 6:51:45 AM org.apache.maven.cli.event.ExecutionEventLogger mojoStarted
INFO: 
Aug 22, 2013 6:51:45 AM org.apache.maven.cli.event.ExecutionEventLogger mojoStarted
INFO: --- maven-dependency-plugin:2.8:copy (create-endorsed-dir) @ cxf-systests-ws-rm ---
[INFO] Configured Artifact: org.apache.geronimo.specs:geronimo-jaxws_2.2_spec:?:jar
[INFO] Copying geronimo-jaxws_2.2_spec-1.1.jar to <https://builds.apache.org/job/CXF-2.7-deploy/org.apache.cxf.systests$cxf-systests-ws-rm/ws/target/endorsed/geronimo-jaxws_2.2_spec-1.1.jar>
Aug 22, 2013 6:51:45 AM org.apache.maven.cli.event.ExecutionEventLogger mojoStarted
INFO: 
Aug 22, 2013 6:51:45 AM org.apache.maven.cli.event.ExecutionEventLogger mojoStarted
INFO: --- cxf-xml2fastinfoset-plugin:2.5.1-SNAPSHOT:xml2fastinfoset (xml2fastinfoset) @ cxf-systests-ws-rm
---
Aug 22, 2013 6:51:45 AM org.apache.maven.cli.event.ExecutionEventLogger mojoStarted
INFO: 
Aug 22, 2013 6:51:45 AM org.apache.maven.cli.event.ExecutionEventLogger mojoStarted
INFO: --- maven-remote-resources-plugin:1.3:process (default) @ cxf-systests-ws-rm ---
Aug 22, 2013 6:51:46 AM org.apache.maven.cli.event.ExecutionEventLogger mojoStarted
INFO: 
Aug 22, 2013 6:51:46 AM org.apache.maven.cli.event.ExecutionEventLogger mojoStarted
INFO: --- maven-resources-plugin:2.6:resources (default-resources) @ cxf-systests-ws-rm ---
[INFO] Using 'UTF-8' encoding to copy filtered resources.
[INFO] skip non existing resourceDirectory <https://builds.apache.org/job/CXF-2.7-deploy/org.apache.cxf.systests$cxf-systests-ws-rm/ws/src/main/java>
[INFO] skip non existing resourceDirectory <https://builds.apache.org/job/CXF-2.7-deploy/org.apache.cxf.systests$cxf-systests-ws-rm/ws/src/main/resources>
[INFO] skip non existing resourceDirectory <https://builds.apache.org/job/CXF-2.7-deploy/org.apache.cxf.systests$cxf-systests-ws-rm/ws/src/main/resources-filtered>
[INFO] skip non existing resourceDirectory <https://builds.apache.org/job/CXF-2.7-deploy/org.apache.cxf.systests$cxf-systests-ws-rm/ws/target/generated/src/main/resources>
[INFO] Copying 3 resources
Aug 22, 2013 6:51:46 AM org.apache.maven.cli.event.ExecutionEventLogger mojoStarted
INFO: 
Aug 22, 2013 6:51:46 AM org.apache.maven.cli.event.ExecutionEventLogger mojoStarted
INFO: --- maven-compiler-plugin:3.1:compile (default-compile) @ cxf-systests-ws-rm ---
[INFO] No sources to compile
Aug 22, 2013 6:51:46 AM org.apache.maven.cli.event.ExecutionEventLogger mojoStarted
INFO: 
Aug 22, 2013 6:51:46 AM org.apache.maven.cli.event.ExecutionEventLogger mojoStarted
INFO: --- maven-bundle-plugin:2.4.0:manifest (bundle-manifest) @ cxf-systests-ws-rm ---
in default pack? 
[WARNING] Manifest org.apache.cxf.systests:cxf-systests-ws-rm:jar:2.7.7-SNAPSHOT : Unused
Export-Package instructions: [org.apache.cxf.*] 
[WARNING] Manifest org.apache.cxf.systests:cxf-systests-ws-rm:jar:2.7.7-SNAPSHOT : The default
package '.' is not permitted by the Import-Package syntax. 
 This can be caused by compile errors in Eclipse because Eclipse creates 
valid class files regardless of compile errors.
The following package(s) import from the default package null
Aug 22, 2013 6:51:46 AM org.apache.maven.cli.event.ExecutionEventLogger mojoStarted
INFO: 
Aug 22, 2013 6:51:46 AM org.apache.maven.cli.event.ExecutionEventLogger mojoStarted
INFO: --- maven-resources-plugin:2.6:testResources (default-testResources) @ cxf-systests-ws-rm
---
[INFO] Using 'UTF-8' encoding to copy filtered resources.
[INFO] Copying 37 resources
[INFO] skip non existing resourceDirectory <https://builds.apache.org/job/CXF-2.7-deploy/org.apache.cxf.systests$cxf-systests-ws-rm/ws/src/test/resources>
[INFO] skip non existing resourceDirectory <https://builds.apache.org/job/CXF-2.7-deploy/org.apache.cxf.systests$cxf-systests-ws-rm/ws/target/generated/src/test/resources>
[INFO] Copying 3 resources
Aug 22, 2013 6:51:46 AM org.apache.maven.cli.event.ExecutionEventLogger mojoStarted
INFO: 
Aug 22, 2013 6:51:46 AM org.apache.maven.cli.event.ExecutionEventLogger mojoStarted
INFO: --- maven-compiler-plugin:3.1:testCompile (default-testCompile) @ cxf-systests-ws-rm
---
[INFO] Changes detected - recompiling the module!
[INFO] Compiling 32 source files to <https://builds.apache.org/job/CXF-2.7-deploy/org.apache.cxf.systests$cxf-systests-ws-rm/ws/target/test-classes>
[INFO] -------------------------------------------------------------
[ERROR] COMPILATION ERROR : 
[INFO] -------------------------------------------------------------
[ERROR] <https://builds.apache.org/job/CXF-2.7-deploy/org.apache.cxf.systests$cxf-systests-ws-rm/ws/src/test/java/org/apache/cxf/systest/ws/rm/RobustServiceWithFaultTest.java>:[66,46]
cannot find symbol
symbol  : method getConfiguration()
location: class org.apache.cxf.ws.rm.RMManager
[ERROR] <https://builds.apache.org/job/CXF-2.7-deploy/org.apache.cxf.systests$cxf-systests-ws-rm/ws/src/test/java/org/apache/cxf/systest/ws/rm/RobustServiceWithFaultTest.java>:[100,16]
cannot find symbol
symbol  : method getConfiguration()
location: class org.apache.cxf.ws.rm.RMManager
[INFO] 2 errors 
[INFO] -------------------------------------------------------------

Mime
View raw message