cxf-notifications mailing list archives

Site index · List index
Message view « Date » · « Thread »
Top « Date » · « Thread »
From Apache Jenkins Server <jenk...@builds.apache.org>
Subject Build failed in Jenkins: CXF-xjc-utils #26
Date Tue, 19 Nov 2013 05:21:02 GMT
See <https://builds.apache.org/job/CXF-xjc-utils/26/changes>

Changes:

[dkulp] Add some svn:ignores

[dkulp] Seems to have some strange command line compiler problem (OK with eclipse compiler)

[dkulp] [CXF-5375] Add javadoc plugin.  
Patch from David Pytel

------------------------------------------
[...truncated 1855 lines...]
Downloading: https://repository.apache.org/content/repositories/snapshots/org/apache/cxf/xjcplugins/cxf-xjc-dv/maven-metadata.xml
Downloaded: https://repository.apache.org/content/repositories/snapshots/org/apache/cxf/xjcplugins/cxf-xjc-dv/maven-metadata.xml
(475 B at 1.8 KB/sec)
Uploading: https://repository.apache.org/content/repositories/snapshots/org/apache/cxf/xjcplugins/cxf-xjc-dv/2.6.3-SNAPSHOT/maven-metadata.xml
Uploaded: https://repository.apache.org/content/repositories/snapshots/org/apache/cxf/xjcplugins/cxf-xjc-dv/2.6.3-SNAPSHOT/maven-metadata.xml
(999 B at 2.8 KB/sec)
Uploading: https://repository.apache.org/content/repositories/snapshots/org/apache/cxf/xjcplugins/cxf-xjc-dv/maven-metadata.xml
Uploaded: https://repository.apache.org/content/repositories/snapshots/org/apache/cxf/xjcplugins/cxf-xjc-dv/maven-metadata.xml
(475 B at 1.1 KB/sec)
[INFO]                                                                         
[INFO] ------------------------------------------------------------------------
[INFO] Building Apache CXF XJC Default Value Plugin Tests 2.6.3-SNAPSHOT
[INFO] ------------------------------------------------------------------------
Downloading: http://repo.maven.apache.org/maven2/jaxme/jaxme2/0.5.1/jaxme2-0.5.1.pom
Downloaded: http://repo.maven.apache.org/maven2/jaxme/jaxme2/0.5.1/jaxme2-0.5.1.pom (145 B
at 0.8 KB/sec)
Downloading: http://repo.maven.apache.org/maven2/jaxme/jaxme2/0.5.1/jaxme2-0.5.1.jar
Downloaded: http://repo.maven.apache.org/maven2/jaxme/jaxme2/0.5.1/jaxme2-0.5.1.jar (362 KB
at 1092.9 KB/sec)
[INFO] 
[INFO] --- maven-clean-plugin:2.3:clean (default-clean) @ cxf-xjc-dv-test ---
[INFO] 
[INFO] --- maven-checkstyle-plugin:2.9.1:checkstyle (validate) @ cxf-xjc-dv-test ---
[INFO] Starting audit...
Audit done.

[INFO] 
[INFO] --- maven-pmd-plugin:3.0.1:pmd (pmd) @ cxf-xjc-dv-test ---
[INFO] 
[INFO] --- maven-pmd-plugin:3.0.1:check (validate) @ cxf-xjc-dv-test ---
[INFO] 
[INFO] 
[INFO] --- maven-remote-resources-plugin:1.1:process (default) @ cxf-xjc-dv-test ---
[INFO] 
[INFO] --- maven-resources-plugin:2.4:resources (default-resources) @ cxf-xjc-dv-test ---
[INFO] Using 'UTF-8' encoding to copy filtered resources.
[INFO] skip non existing resourceDirectory <https://builds.apache.org/job/CXF-xjc-utils/ws/xjc-utils-trunk/dv-test/src/main/resources>
[INFO] Copying 3 resources
[INFO] 
[INFO] --- maven-compiler-plugin:3.1:compile (default-compile) @ cxf-xjc-dv-test ---
[INFO] No sources to compile
[INFO] 
[INFO] --- cxf-xjc-plugin:2.6.3-SNAPSHOT:xsdtojava-tests (default) @ cxf-xjc-dv-test ---
[INFO] 
[INFO] --- maven-resources-plugin:2.4:testResources (default-testResources) @ cxf-xjc-dv-test
---
[INFO] Using 'UTF-8' encoding to copy filtered resources.
[INFO] Copying 1 resource
[INFO] Copying 3 resources
[INFO] 
[INFO] --- maven-compiler-plugin:3.1:testCompile (default-testCompile) @ cxf-xjc-dv-test ---
[INFO] Changes detected - recompiling the module!
[INFO] Compiling 7 source files to <https://builds.apache.org/job/CXF-xjc-utils/ws/xjc-utils-trunk/dv-test/target/test-classes>
[INFO] 
[INFO] --- maven-surefire-plugin:2.5:test (default-test) @ cxf-xjc-dv-test ---
[INFO] Surefire report directory: <https://builds.apache.org/job/CXF-xjc-utils/ws/xjc-utils-trunk/dv-test/target/surefire-reports>

-------------------------------------------------------
 T E S T S
-------------------------------------------------------
Running org.apache.cxf.xjc.dv.DefaultValueTest
Tests run: 1, Failures: 0, Errors: 0, Skipped: 0, Time elapsed: 0.094 sec

Results :

Tests run: 1, Failures: 0, Errors: 0, Skipped: 0

[JENKINS] Recording test results
[INFO] 
[INFO] --- maven-jar-plugin:2.2:jar (default-jar) @ cxf-xjc-dv-test ---
[INFO] Building jar: <https://builds.apache.org/job/CXF-xjc-utils/ws/xjc-utils-trunk/dv-test/target/cxf-xjc-dv-test-2.6.3-SNAPSHOT.jar>
[INFO] 
[INFO] --- maven-install-plugin:2.3:install (default-install) @ cxf-xjc-dv-test ---
[INFO] Installing <https://builds.apache.org/job/CXF-xjc-utils/ws/xjc-utils-trunk/dv-test/target/cxf-xjc-dv-test-2.6.3-SNAPSHOT.jar>
to <https://builds.apache.org/job/CXF-xjc-utils/ws/.repository/org/apache/cxf/xjcplugins/tests/cxf-xjc-dv-test/2.6.3-SNAPSHOT/cxf-xjc-dv-test-2.6.3-SNAPSHOT.jar>
[INFO] Installing <https://builds.apache.org/job/CXF-xjc-utils/ws/xjc-utils-trunk/dv-test/pom.xml>
to <https://builds.apache.org/job/CXF-xjc-utils/ws/.repository/org/apache/cxf/xjcplugins/tests/cxf-xjc-dv-test/2.6.3-SNAPSHOT/cxf-xjc-dv-test-2.6.3-SNAPSHOT.pom>
[INFO] 
[INFO] --- maven-deploy-plugin:2.4:deploy (default-deploy) @ cxf-xjc-dv-test ---
Downloading: https://repository.apache.org/content/repositories/snapshots/org/apache/cxf/xjcplugins/tests/cxf-xjc-dv-test/2.6.3-SNAPSHOT/maven-metadata.xml
Downloaded: https://repository.apache.org/content/repositories/snapshots/org/apache/cxf/xjcplugins/tests/cxf-xjc-dv-test/2.6.3-SNAPSHOT/maven-metadata.xml
(796 B at 1.1 KB/sec)
Uploading: https://repository.apache.org/content/repositories/snapshots/org/apache/cxf/xjcplugins/tests/cxf-xjc-dv-test/2.6.3-SNAPSHOT/cxf-xjc-dv-test-2.6.3-20131119.043526-7.jar
Uploaded: https://repository.apache.org/content/repositories/snapshots/org/apache/cxf/xjcplugins/tests/cxf-xjc-dv-test/2.6.3-SNAPSHOT/cxf-xjc-dv-test-2.6.3-20131119.043526-7.jar
(8 KB at 26.0 KB/sec)
Uploading: https://repository.apache.org/content/repositories/snapshots/org/apache/cxf/xjcplugins/tests/cxf-xjc-dv-test/2.6.3-SNAPSHOT/cxf-xjc-dv-test-2.6.3-20131119.043526-7.pom
Uploaded: https://repository.apache.org/content/repositories/snapshots/org/apache/cxf/xjcplugins/tests/cxf-xjc-dv-test/2.6.3-SNAPSHOT/cxf-xjc-dv-test-2.6.3-20131119.043526-7.pom
(4 KB at 9.7 KB/sec)
Downloading: https://repository.apache.org/content/repositories/snapshots/org/apache/cxf/xjcplugins/tests/cxf-xjc-dv-test/maven-metadata.xml
Downloaded: https://repository.apache.org/content/repositories/snapshots/org/apache/cxf/xjcplugins/tests/cxf-xjc-dv-test/maven-metadata.xml
(486 B at 1.9 KB/sec)
Uploading: https://repository.apache.org/content/repositories/snapshots/org/apache/cxf/xjcplugins/tests/cxf-xjc-dv-test/2.6.3-SNAPSHOT/maven-metadata.xml
Uploaded: https://repository.apache.org/content/repositories/snapshots/org/apache/cxf/xjcplugins/tests/cxf-xjc-dv-test/2.6.3-SNAPSHOT/maven-metadata.xml
(796 B at 2.3 KB/sec)
Uploading: https://repository.apache.org/content/repositories/snapshots/org/apache/cxf/xjcplugins/tests/cxf-xjc-dv-test/maven-metadata.xml
Uploaded: https://repository.apache.org/content/repositories/snapshots/org/apache/cxf/xjcplugins/tests/cxf-xjc-dv-test/maven-metadata.xml
(486 B at 1.3 KB/sec)
[INFO]                                                                         
[INFO] ------------------------------------------------------------------------
[INFO] Building Apache CXF XJC toString Plugin 2.6.3-SNAPSHOT
[INFO] ------------------------------------------------------------------------
[INFO] 
[INFO] --- maven-clean-plugin:2.3:clean (default-clean) @ cxf-xjc-ts ---
[INFO] 
[INFO] --- maven-checkstyle-plugin:2.9.1:checkstyle (validate) @ cxf-xjc-ts ---
[INFO] Starting audit...
Audit done.

[INFO] 
[INFO] --- maven-pmd-plugin:3.0.1:pmd (pmd) @ cxf-xjc-ts ---
[INFO] 
[INFO] --- maven-pmd-plugin:3.0.1:check (validate) @ cxf-xjc-ts ---
[INFO] 
[INFO] 
[INFO] --- maven-remote-resources-plugin:1.1:process (default) @ cxf-xjc-ts ---
[INFO] 
[INFO] --- maven-resources-plugin:2.4:resources (default-resources) @ cxf-xjc-ts ---
[INFO] Using 'UTF-8' encoding to copy filtered resources.
[INFO] Copying 1 resource
[INFO] Copying 3 resources
[INFO] 
[INFO] --- maven-compiler-plugin:3.1:compile (default-compile) @ cxf-xjc-ts ---
[INFO] Changes detected - recompiling the module!
[INFO] Compiling 2 source files to <https://builds.apache.org/job/CXF-xjc-utils/ws/xjc-utils-trunk/ts/target/classes>
[INFO] 
[INFO] --- maven-resources-plugin:2.4:testResources (default-testResources) @ cxf-xjc-ts ---
[INFO] Using 'UTF-8' encoding to copy filtered resources.
[INFO] skip non existing resourceDirectory <https://builds.apache.org/job/CXF-xjc-utils/ws/xjc-utils-trunk/ts/src/test/resources>
[INFO] Copying 3 resources
[INFO] 
[INFO] --- maven-compiler-plugin:3.1:testCompile (default-testCompile) @ cxf-xjc-ts ---
[INFO] Not compiling test sources
[INFO] 
[INFO] --- maven-surefire-plugin:2.5:test (default-test) @ cxf-xjc-ts ---
[INFO] Tests are skipped.
[INFO] 
[INFO] --- maven-jar-plugin:2.2:jar (default-jar) @ cxf-xjc-ts ---
[INFO] Building jar: <https://builds.apache.org/job/CXF-xjc-utils/ws/xjc-utils-trunk/ts/target/cxf-xjc-ts-2.6.3-SNAPSHOT.jar>
[INFO] 
[INFO] --- maven-install-plugin:2.3:install (default-install) @ cxf-xjc-ts ---
[INFO] Installing <https://builds.apache.org/job/CXF-xjc-utils/ws/xjc-utils-trunk/ts/target/cxf-xjc-ts-2.6.3-SNAPSHOT.jar>
to <https://builds.apache.org/job/CXF-xjc-utils/ws/.repository/org/apache/cxf/xjcplugins/cxf-xjc-ts/2.6.3-SNAPSHOT/cxf-xjc-ts-2.6.3-SNAPSHOT.jar>
[INFO] Installing <https://builds.apache.org/job/CXF-xjc-utils/ws/xjc-utils-trunk/ts/pom.xml>
to <https://builds.apache.org/job/CXF-xjc-utils/ws/.repository/org/apache/cxf/xjcplugins/cxf-xjc-ts/2.6.3-SNAPSHOT/cxf-xjc-ts-2.6.3-SNAPSHOT.pom>
[INFO] 
[INFO] --- maven-deploy-plugin:2.4:deploy (default-deploy) @ cxf-xjc-ts ---
Downloading: https://repository.apache.org/content/repositories/snapshots/org/apache/cxf/xjcplugins/cxf-xjc-ts/2.6.3-SNAPSHOT/maven-metadata.xml
[WARNING] Could not transfer metadata org.apache.cxf.xjcplugins:cxf-xjc-ts:2.6.3-SNAPSHOT/maven-metadata.xml
from/to apache.snapshots.https (https://repository.apache.org/content/repositories/snapshots):
Failed to transfer file: https://repository.apache.org/content/repositories/snapshots/org/apache/cxf/xjcplugins/cxf-xjc-ts/2.6.3-SNAPSHOT/maven-metadata.xml.
Return code is: 502, ReasonPhrase:Proxy Error.
[INFO] ------------------------------------------------------------------------
[INFO] Reactor Summary:
[INFO] 
[INFO] Apache CXF XJC Utils .............................. SUCCESS [24.966s]
[INFO] Apache CXF XSD2Java Plugin ........................ SUCCESS [13.027s]
[INFO] Apache CXF XJC Default Value Plugin ............... SUCCESS [5.541s]
[INFO] Apache CXF XJC Default Value Plugin Tests ......... SUCCESS [11.435s]
[INFO] Apache CXF XJC toString Plugin .................... FAILURE [10.770s]
[INFO] Apache CXF XJC toString Plugin Tests .............. SKIPPED
[INFO] Apache CXF XJC Boolean Getter Plugin .............. SKIPPED
[INFO] Apache CXF XJC Boolean Getter Plugin Tests ........ SKIPPED
[INFO] Apache CXF XJC WSDL Extension Plugin .............. SKIPPED
[INFO] Apache CXF XJC WSDL Extension Plugin Tests ........ SKIPPED
[INFO] Apache CXF XJC Plugin To Workaround JAXB Bug 671 .. SKIPPED
[INFO] Apache CXF XJC Property Listener Plugin ........... SKIPPED
[INFO] Apache CXF XJC JavaDoc Plugin ..................... SKIPPED
[INFO] Apache CXF XJC Runtime ............................ SKIPPED
[INFO] ------------------------------------------------------------------------
[INFO] BUILD FAILURE
[INFO] ------------------------------------------------------------------------
[INFO] Total time: 24:16.543s
[INFO] Finished at: Tue Nov 19 04:45:39 UTC 2013
[INFO] Final Memory: 29M/62M
[INFO] ------------------------------------------------------------------------
Waiting for Jenkins to finish collecting data
[ERROR] Failed to execute goal org.apache.maven.plugins:maven-deploy-plugin:2.4:deploy (default-deploy)
on project cxf-xjc-ts: Failed to retrieve remote metadata org.apache.cxf.xjcplugins:cxf-xjc-ts:2.6.3-SNAPSHOT/maven-metadata.xml:
Could not transfer metadata org.apache.cxf.xjcplugins:cxf-xjc-ts:2.6.3-SNAPSHOT/maven-metadata.xml
from/to apache.snapshots.https (https://repository.apache.org/content/repositories/snapshots):
Failed to transfer file: https://repository.apache.org/content/repositories/snapshots/org/apache/cxf/xjcplugins/cxf-xjc-ts/2.6.3-SNAPSHOT/maven-metadata.xml.
Return code is: 502, ReasonPhrase:Proxy Error. -> [Help 1]
org.apache.maven.lifecycle.LifecycleExecutionException: Failed to execute goal org.apache.maven.plugins:maven-deploy-plugin:2.4:deploy
(default-deploy) on project cxf-xjc-ts: Failed to retrieve remote metadata org.apache.cxf.xjcplugins:cxf-xjc-ts:2.6.3-SNAPSHOT/maven-metadata.xml:
Could not transfer metadata org.apache.cxf.xjcplugins:cxf-xjc-ts:2.6.3-SNAPSHOT/maven-metadata.xml
from/to apache.snapshots.https (https://repository.apache.org/content/repositories/snapshots):
Failed to transfer file: https://repository.apache.org/content/repositories/snapshots/org/apache/cxf/xjcplugins/cxf-xjc-ts/2.6.3-SNAPSHOT/maven-metadata.xml.
Return code is: 502, ReasonPhrase:Proxy Error.
	at org.apache.maven.lifecycle.internal.MojoExecutor.execute(MojoExecutor.java:217)
	at org.apache.maven.lifecycle.internal.MojoExecutor.execute(MojoExecutor.java:153)
	at org.apache.maven.lifecycle.internal.MojoExecutor.execute(MojoExecutor.java:145)
	at org.apache.maven.lifecycle.internal.LifecycleModuleBuilder.buildProject(LifecycleModuleBuilder.java:84)
	at org.apache.maven.lifecycle.internal.LifecycleModuleBuilder.buildProject(LifecycleModuleBuilder.java:59)
	at org.apache.maven.lifecycle.internal.LifecycleStarter.singleThreadedBuild(LifecycleStarter.java:183)
	at org.apache.maven.lifecycle.internal.LifecycleStarter.execute(LifecycleStarter.java:161)
	at org.apache.maven.DefaultMaven.doExecute(DefaultMaven.java:320)
	at org.apache.maven.DefaultMaven.execute(DefaultMaven.java:156)
	at org.jvnet.hudson.maven3.launcher.Maven3Launcher.main(Maven3Launcher.java:117)
	at sun.reflect.NativeMethodAccessorImpl.invoke0(Native Method)
	at sun.reflect.NativeMethodAccessorImpl.invoke(NativeMethodAccessorImpl.java:39)
	at sun.reflect.DelegatingMethodAccessorImpl.invoke(DelegatingMethodAccessorImpl.java:25)
	at java.lang.reflect.Method.invoke(Method.java:597)
	at org.codehaus.plexus.classworlds.launcher.Launcher.launchStandard(Launcher.java:329)
	at org.codehaus.plexus.classworlds.launcher.Launcher.launch(Launcher.java:239)
	at org.jvnet.hudson.maven3.agent.Maven3Main.launch(Maven3Main.java:178)
	at sun.reflect.NativeMethodAccessorImpl.invoke0(Native Method)
	at sun.reflect.NativeMethodAccessorImpl.invoke(NativeMethodAccessorImpl.java:39)
	at sun.reflect.DelegatingMethodAccessorImpl.invoke(DelegatingMethodAccessorImpl.java:25)
	at java.lang.reflect.Method.invoke(Method.java:597)
	at hudson.maven.Maven3Builder.call(Maven3Builder.java:134)
	at hudson.maven.Maven3Builder.call(Maven3Builder.java:69)
	at hudson.remoting.UserRequest.perform(UserRequest.java:118)
	at hudson.remoting.UserRequest.perform(UserRequest.java:48)
	at hudson.remoting.Request$2.run(Request.java:328)
	at hudson.remoting.InterceptingExecutorService$1.call(InterceptingExecutorService.java:72)
	at java.util.concurrent.FutureTask$Sync.innerRun(FutureTask.java:303)
	at java.util.concurrent.FutureTask.run(FutureTask.java:138)
	at java.util.concurrent.ThreadPoolExecutor$Worker.runTask(ThreadPoolExecutor.java:895)
	at java.util.concurrent.ThreadPoolExecutor$Worker.run(ThreadPoolExecutor.java:918)
	at java.lang.Thread.run(Thread.java:662)
Caused by: org.apache.maven.plugin.MojoExecutionException: Failed to retrieve remote metadata
org.apache.cxf.xjcplugins:cxf-xjc-ts:2.6.3-SNAPSHOT/maven-metadata.xml: Could not transfer
metadata org.apache.cxf.xjcplugins:cxf-xjc-ts:2.6.3-SNAPSHOT/maven-metadata.xml from/to apache.snapshots.https
(https://repository.apache.org/content/repositories/snapshots): Failed to transfer file: https://repository.apache.org/content/repositories/snapshots/org/apache/cxf/xjcplugins/cxf-xjc-ts/2.6.3-SNAPSHOT/maven-metadata.xml.
Return code is: 502, ReasonPhrase:Proxy Error.
	at org.apache.maven.plugin.deploy.DeployMojo.execute(DeployMojo.java:195)
	at org.apache.maven.plugin.DefaultBuildPluginManager.executeMojo(DefaultBuildPluginManager.java:101)
	at org.apache.maven.lifecycle.internal.MojoExecutor.execute(MojoExecutor.java:209)
	... 31 more
Caused by: org.apache.maven.artifact.deployer.ArtifactDeploymentException: Failed to retrieve
remote metadata org.apache.cxf.xjcplugins:cxf-xjc-ts:2.6.3-SNAPSHOT/maven-metadata.xml: Could
not transfer metadata org.apache.cxf.xjcplugins:cxf-xjc-ts:2.6.3-SNAPSHOT/maven-metadata.xml
from/to apache.snapshots.https (https://repository.apache.org/content/repositories/snapshots):
Failed to transfer file: https://repository.apache.org/content/repositories/snapshots/org/apache/cxf/xjcplugins/cxf-xjc-ts/2.6.3-SNAPSHOT/maven-metadata.xml.
Return code is: 502, ReasonPhrase:Proxy Error.
	at org.apache.maven.artifact.deployer.DefaultArtifactDeployer.deploy(DefaultArtifactDeployer.java:141)
	at org.apache.maven.plugin.deploy.DeployMojo.execute(DeployMojo.java:173)
	... 33 more
Caused by: org.sonatype.aether.deployment.DeploymentException: Failed to retrieve remote metadata
org.apache.cxf.xjcplugins:cxf-xjc-ts:2.6.3-SNAPSHOT/maven-metadata.xml: Could not transfer
metadata org.apache.cxf.xjcplugins:cxf-xjc-ts:2.6.3-SNAPSHOT/maven-metadata.xml from/to apache.snapshots.https
(https://repository.apache.org/content/repositories/snapshots): Failed to transfer file: https://repository.apache.org/content/repositories/snapshots/org/apache/cxf/xjcplugins/cxf-xjc-ts/2.6.3-SNAPSHOT/maven-metadata.xml.
Return code is: 502, ReasonPhrase:Proxy Error.
	at org.sonatype.aether.impl.internal.DefaultDeployer.upload(DefaultDeployer.java:403)
	at org.sonatype.aether.impl.internal.DefaultDeployer.deploy(DefaultDeployer.java:256)
	at org.sonatype.aether.impl.internal.DefaultDeployer.deploy(DefaultDeployer.java:211)
	at org.sonatype.aether.impl.internal.DefaultRepositorySystem.deploy(DefaultRepositorySystem.java:443)
	at org.apache.maven.artifact.deployer.DefaultArtifactDeployer.deploy(DefaultArtifactDeployer.java:137)
	... 34 more
Caused by: org.sonatype.aether.transfer.MetadataTransferException: Could not transfer metadata
org.apache.cxf.xjcplugins:cxf-xjc-ts:2.6.3-SNAPSHOT/maven-metadata.xml from/to apache.snapshots.https
(https://repository.apache.org/content/repositories/snapshots): Failed to transfer file: https://repository.apache.org/content/repositories/snapshots/org/apache/cxf/xjcplugins/cxf-xjc-ts/2.6.3-SNAPSHOT/maven-metadata.xml.
Return code is: 502, ReasonPhrase:Proxy Error.
	at org.sonatype.aether.connector.wagon.WagonRepositoryConnector$3.wrap(WagonRepositoryConnector.java:930)
	at org.sonatype.aether.connector.wagon.WagonRepositoryConnector$3.wrap(WagonRepositoryConnector.java:920)
	at org.sonatype.aether.connector.wagon.WagonRepositoryConnector$GetTask.run(WagonRepositoryConnector.java:669)
	at org.sonatype.aether.util.concurrency.RunnableErrorForwarder$1.run(RunnableErrorForwarder.java:60)
	... 3 more
Caused by: org.apache.maven.wagon.TransferFailedException: Failed to transfer file: https://repository.apache.org/content/repositories/snapshots/org/apache/cxf/xjcplugins/cxf-xjc-ts/2.6.3-SNAPSHOT/maven-metadata.xml.
Return code is: 502, ReasonPhrase:Proxy Error.
	at org.apache.maven.wagon.shared.http4.AbstractHttpClientWagon.fillInputData(AbstractHttpClientWagon.java:852)
	at org.apache.maven.wagon.StreamWagon.getInputStream(StreamWagon.java:116)
	at org.apache.maven.wagon.StreamWagon.getIfNewer(StreamWagon.java:88)
	at org.apache.maven.wagon.StreamWagon.get(StreamWagon.java:61)
	at org.sonatype.aether.connector.wagon.WagonRepositoryConnector$GetTask.run(WagonRepositoryConnector.java:601)
	... 4 more
[ERROR] 
[ERROR] Re-run Maven using the -X switch to enable full debug logging.
[ERROR] 
[ERROR] For more information about the errors and possible solutions, please read the following
articles:
[ERROR] [Help 1] http://cwiki.apache.org/confluence/display/MAVEN/MojoExecutionException
[ERROR] 
[ERROR] After correcting the problems, you can resume the build with the command
[ERROR]   mvn <goals> -rf :cxf-xjc-ts
[JENKINS] Archiving <https://builds.apache.org/job/CXF-xjc-utils/ws/xjc-utils-trunk/cxf-xjc-plugin/pom.xml>
to org.apache.cxf/cxf-xjc-plugin/2.6.3-SNAPSHOT/cxf-xjc-plugin-2.6.3-SNAPSHOT.pom
[JENKINS] Archiving <https://builds.apache.org/job/CXF-xjc-utils/ws/xjc-utils-trunk/cxf-xjc-plugin/target/cxf-xjc-plugin-2.6.3-SNAPSHOT.jar>
to org.apache.cxf/cxf-xjc-plugin/2.6.3-20131119.042700-8/cxf-xjc-plugin-2.6.3-20131119.042700-8.jar
[JENKINS] Archiving <https://builds.apache.org/job/CXF-xjc-utils/ws/xjc-utils-trunk/javadoc/pom.xml>
to org.apache.cxf.xjcplugins/cxf-xjc-javadoc/2.6.3-SNAPSHOT/cxf-xjc-javadoc-2.6.3-SNAPSHOT.pom
[JENKINS] Archiving <https://builds.apache.org/job/CXF-xjc-utils/ws/xjc-utils-trunk/dv/pom.xml>
to org.apache.cxf.xjcplugins/cxf-xjc-dv/2.6.3-SNAPSHOT/cxf-xjc-dv-2.6.3-SNAPSHOT.pom
[JENKINS] Archiving <https://builds.apache.org/job/CXF-xjc-utils/ws/xjc-utils-trunk/dv/target/cxf-xjc-dv-2.6.3-SNAPSHOT.jar>
to org.apache.cxf.xjcplugins/cxf-xjc-dv/2.6.3-20131119.043011-7/cxf-xjc-dv-2.6.3-20131119.043011-7.jar
[JENKINS] Archiving <https://builds.apache.org/job/CXF-xjc-utils/ws/xjc-utils-trunk/boolean-test/pom.xml>
to org.apache.cxf.xjcplugins.tests/cxf-xjc-boolean-test/2.6.3-SNAPSHOT/cxf-xjc-boolean-test-2.6.3-SNAPSHOT.pom
[JENKINS] Archiving <https://builds.apache.org/job/CXF-xjc-utils/ws/xjc-utils-trunk/dv-test/pom.xml>
to org.apache.cxf.xjcplugins.tests/cxf-xjc-dv-test/2.6.3-SNAPSHOT/cxf-xjc-dv-test-2.6.3-SNAPSHOT.pom
[JENKINS] Archiving <https://builds.apache.org/job/CXF-xjc-utils/ws/xjc-utils-trunk/dv-test/target/cxf-xjc-dv-test-2.6.3-SNAPSHOT.jar>
to org.apache.cxf.xjcplugins.tests/cxf-xjc-dv-test/2.6.3-20131119.043526-7/cxf-xjc-dv-test-2.6.3-20131119.043526-7.jar
[JENKINS] Archiving <https://builds.apache.org/job/CXF-xjc-utils/ws/xjc-utils-trunk/ts/pom.xml>
to org.apache.cxf.xjcplugins/cxf-xjc-ts/2.6.3-SNAPSHOT/cxf-xjc-ts-2.6.3-SNAPSHOT.pom
[JENKINS] Archiving <https://builds.apache.org/job/CXF-xjc-utils/ws/xjc-utils-trunk/ts/target/cxf-xjc-ts-2.6.3-SNAPSHOT.jar>
to org.apache.cxf.xjcplugins/cxf-xjc-ts/2.6.3-SNAPSHOT/cxf-xjc-ts-2.6.3-SNAPSHOT.jar
[JENKINS] Archiving <https://builds.apache.org/job/CXF-xjc-utils/ws/xjc-utils-trunk/wsdlextension-test/pom.xml>
to org.apache.cxf.xjcplugins.tests/cxf-xjc-wsdlextension-test/2.6.3-SNAPSHOT/cxf-xjc-wsdlextension-test-2.6.3-SNAPSHOT.pom
[JENKINS] Archiving <https://builds.apache.org/job/CXF-xjc-utils/ws/xjc-utils-trunk/ts-test/pom.xml>
to org.apache.cxf.xjcplugins.tests/cxf-xjc-ts-test/2.6.3-SNAPSHOT/cxf-xjc-ts-test-2.6.3-SNAPSHOT.pom
[JENKINS] Archiving <https://builds.apache.org/job/CXF-xjc-utils/ws/xjc-utils-trunk/boolean/pom.xml>
to org.apache.cxf.xjcplugins/cxf-xjc-boolean/2.6.3-SNAPSHOT/cxf-xjc-boolean-2.6.3-SNAPSHOT.pom
[JENKINS] Archiving <https://builds.apache.org/job/CXF-xjc-utils/ws/xjc-utils-trunk/property-listener/pom.xml>
to org.apache.cxf.xjcplugins/cxf-xjc-pl/2.6.3-SNAPSHOT/cxf-xjc-pl-2.6.3-SNAPSHOT.pom
[JENKINS] Archiving <https://builds.apache.org/job/CXF-xjc-utils/ws/xjc-utils-trunk/bug671/pom.xml>
to org.apache.cxf.xjcplugins/cxf-xjc-bug671/2.6.3-SNAPSHOT/cxf-xjc-bug671-2.6.3-SNAPSHOT.pom
[JENKINS] Archiving <https://builds.apache.org/job/CXF-xjc-utils/ws/xjc-utils-trunk/wsdlextension/pom.xml>
to org.apache.cxf.xjcplugins/cxf-xjc-wsdlextension/2.6.3-SNAPSHOT/cxf-xjc-wsdlextension-2.6.3-SNAPSHOT.pom
[JENKINS] Archiving <https://builds.apache.org/job/CXF-xjc-utils/ws/xjc-utils-trunk/pom.xml>
to org.apache.cxf.xjc-utils/xjc-utils/2.6.3-SNAPSHOT/xjc-utils-2.6.3-SNAPSHOT.pom
[JENKINS] Archiving <https://builds.apache.org/job/CXF-xjc-utils/ws/xjc-utils-trunk/runtime/pom.xml>
to org.apache.cxf.xjc-utils/cxf-xjc-runtime/2.6.3-SNAPSHOT/cxf-xjc-runtime-2.6.3-SNAPSHOT.pom
Build timed out (after 30 minutes). Marking the build as aborted.
Sending e-mails to: notifications@cxf.apache.org null@apache.org
channel stopped

Mime
View raw message