cxf-notifications mailing list archives

Site index · List index
Message view « Date » · « Thread »
Top « Date » · « Thread »
From Apache Jenkins Server <jenk...@builds.apache.org>
Subject Build failed in Jenkins: CXF-trunk-deploy » CXF STS Demo #1299
Date Mon, 02 Dec 2013 14:14:54 GMT
See <https://builds.apache.org/job/CXF-trunk-deploy/org.apache.cxf.samples$sts/1299/>

------------------------------------------
Dec 2, 2013 2:12:01 PM org.apache.maven.cli.event.ExecutionEventLogger projectStarted
INFO:                                                                         
Dec 2, 2013 2:12:01 PM org.apache.maven.cli.event.ExecutionEventLogger projectStarted
INFO: ------------------------------------------------------------------------
Dec 2, 2013 2:12:01 PM org.apache.maven.cli.event.ExecutionEventLogger projectStarted
INFO: Building CXF STS Demo 3.0.0-SNAPSHOT
Dec 2, 2013 2:12:01 PM org.apache.maven.cli.event.ExecutionEventLogger projectStarted
INFO: ------------------------------------------------------------------------
Dec 2, 2013 2:12:01 PM hudson.maven.util.ExecutionEventLogger mojoStarted
INFO: 
Dec 2, 2013 2:12:01 PM hudson.maven.util.ExecutionEventLogger mojoStarted
INFO: --- maven-clean-plugin:2.4.1:clean (default-clean) @ sts ---
Dec 2, 2013 2:12:01 PM hudson.maven.util.ExecutionEventLogger mojoStarted
INFO: 
Dec 2, 2013 2:12:01 PM hudson.maven.util.ExecutionEventLogger mojoStarted
INFO: --- cxf-codegen-plugin:3.0.0-SNAPSHOT:wsdl2java (generate-sources) @ sts ---
Dec 2, 2013 2:12:01 PM org.apache.cxf.tools.wsdlto.databinding.jaxb.JAXBDataBinding checkEncoding
WARNING: Version hudson-jaxb-ri-2.1-2 of JAXB XJC does not support setting an encoding.  Using
default file encoding of ANSI_X3.4-1968.
Dec 2, 2013 2:12:02 PM hudson.maven.util.ExecutionEventLogger mojoStarted
INFO: 
Dec 2, 2013 2:12:02 PM hudson.maven.util.ExecutionEventLogger mojoStarted
INFO: --- maven-resources-plugin:2.5:resources (default-resources) @ sts ---
[debug] execute contextualize
[INFO] Using 'UTF-8' encoding to copy filtered resources.
[INFO] Copying 6 resources
Dec 2, 2013 2:12:02 PM hudson.maven.util.ExecutionEventLogger mojoStarted
INFO: 
Dec 2, 2013 2:12:02 PM hudson.maven.util.ExecutionEventLogger mojoStarted
INFO: --- maven-compiler-plugin:2.5.1:compile (default-compile) @ sts ---
[INFO] Compiling 13 source files to <https://builds.apache.org/job/CXF-trunk-deploy/org.apache.cxf.samples$sts/ws/target/classes>
[INFO] -------------------------------------------------------------
[ERROR] COMPILATION ERROR : 
[INFO] -------------------------------------------------------------
[ERROR] <https://builds.apache.org/job/CXF-trunk-deploy/org.apache.cxf.samples$sts/ws/src/main/java/demo/wssec/sts/STSCallbackHandler.java>:[34,55]
cannot find symbol
symbol  : variable Usage
location: class org.apache.wss4j.common.ext.WSPasswordCallback
[ERROR] <https://builds.apache.org/job/CXF-trunk-deploy/org.apache.cxf.samples$sts/ws/src/main/java/demo/wssec/sts/STSCallbackHandler.java>:[35,58]
cannot find symbol
symbol  : variable Usage
location: class org.apache.wss4j.common.ext.WSPasswordCallback
[ERROR] <https://builds.apache.org/job/CXF-trunk-deploy/org.apache.cxf.samples$sts/ws/src/main/java/demo/wssec/sts/STSCallbackHandler.java>:[39,62]
cannot find symbol
symbol  : variable Usage
location: class org.apache.wss4j.common.ext.WSPasswordCallback
[ERROR] <https://builds.apache.org/job/CXF-trunk-deploy/org.apache.cxf.samples$sts/ws/src/main/java/demo/wssec/client/ClientCallbackHandler.java>:[34,55]
cannot find symbol
symbol  : variable Usage
location: class org.apache.wss4j.common.ext.WSPasswordCallback
[ERROR] <https://builds.apache.org/job/CXF-trunk-deploy/org.apache.cxf.samples$sts/ws/src/main/java/demo/wssec/client/ClientCallbackHandler.java>:[35,58]
cannot find symbol
symbol  : variable Usage
location: class org.apache.wss4j.common.ext.WSPasswordCallback
[ERROR] <https://builds.apache.org/job/CXF-trunk-deploy/org.apache.cxf.samples$sts/ws/src/main/java/demo/wssec/client/ClientCallbackHandler.java>:[39,62]
cannot find symbol
symbol  : variable Usage
location: class org.apache.wss4j.common.ext.WSPasswordCallback
[INFO] 6 errors 
[INFO] -------------------------------------------------------------

Mime
View raw message