cxf-notifications mailing list archives

Site index · List index
Message view « Date » · « Thread »
Top « Date » · « Thread »
From Apache Jenkins Server <jenk...@builds.apache.org>
Subject Build failed in Jenkins: CXF-trunk-deploy » Apache CXF Runtime WS Security #1303
Date Fri, 06 Dec 2013 15:12:43 GMT
See <https://builds.apache.org/job/CXF-trunk-deploy/org.apache.cxf$cxf-rt-ws-security/1303/>

------------------------------------------
[INFO]                                                                         
[INFO] ------------------------------------------------------------------------
[INFO] Building Apache CXF Runtime WS Security 3.0.0-SNAPSHOT
[INFO] ------------------------------------------------------------------------
Downloading: http://repository.apache.org/snapshots/org/apache/wss4j/wss4j-ws-security-dom/2.0-SNAPSHOT/maven-metadata.xml
Downloaded: http://repository.apache.org/snapshots/org/apache/wss4j/wss4j-ws-security-dom/2.0-SNAPSHOT/maven-metadata.xml
(2 KB at 2.5 KB/sec)
Downloading: http://repository.apache.org/snapshots/org/apache/wss4j/wss4j-parent/2.0-SNAPSHOT/maven-metadata.xml
Downloaded: http://repository.apache.org/snapshots/org/apache/wss4j/wss4j-parent/2.0-SNAPSHOT/maven-metadata.xml
(605 B at 3.2 KB/sec)
Downloading: http://repository.apache.org/snapshots/org/apache/wss4j/wss4j/2.0-SNAPSHOT/maven-metadata.xml
Downloaded: http://repository.apache.org/snapshots/org/apache/wss4j/wss4j/2.0-SNAPSHOT/maven-metadata.xml
(598 B at 4.6 KB/sec)
Downloading: http://repository.apache.org/snapshots/org/apache/wss4j/wss4j-ws-security-common/2.0-SNAPSHOT/maven-metadata.xml
Downloaded: http://repository.apache.org/snapshots/org/apache/wss4j/wss4j-ws-security-common/2.0-SNAPSHOT/maven-metadata.xml
(2 KB at 8.1 KB/sec)
Downloading: http://repository.apache.org/snapshots/org/apache/santuario/xmlsec/2.0.0-SNAPSHOT/maven-metadata.xml
Downloaded: http://repository.apache.org/snapshots/org/apache/santuario/xmlsec/2.0.0-SNAPSHOT/maven-metadata.xml
(996 B at 3.5 KB/sec)
Downloading: http://repository.apache.org/snapshots/org/apache/wss4j/wss4j-policy/2.0-SNAPSHOT/maven-metadata.xml
Downloaded: http://repository.apache.org/snapshots/org/apache/wss4j/wss4j-policy/2.0-SNAPSHOT/maven-metadata.xml
(992 B at 8.1 KB/sec)
Downloading: http://repository.apache.org/snapshots/org/apache/wss4j/wss4j-ws-security-stax/2.0-SNAPSHOT/maven-metadata.xml
Downloaded: http://repository.apache.org/snapshots/org/apache/wss4j/wss4j-ws-security-stax/2.0-SNAPSHOT/maven-metadata.xml
(2 KB at 8.3 KB/sec)
Downloading: http://repository.apache.org/snapshots/org/apache/wss4j/wss4j-bindings-wss10/2.0-SNAPSHOT/maven-metadata.xml
Downloaded: http://repository.apache.org/snapshots/org/apache/wss4j/wss4j-bindings-wss10/2.0-SNAPSHOT/maven-metadata.xml
(1000 B at 4.2 KB/sec)
Downloading: http://repository.apache.org/snapshots/org/apache/wss4j/wss4j-bindings-wsu10/2.0-SNAPSHOT/maven-metadata.xml
Downloaded: http://repository.apache.org/snapshots/org/apache/wss4j/wss4j-bindings-wsu10/2.0-SNAPSHOT/maven-metadata.xml
(1000 B at 9.6 KB/sec)
Downloading: http://repository.apache.org/snapshots/org/apache/wss4j/wss4j-bindings-wss11/2.0-SNAPSHOT/maven-metadata.xml
Downloaded: http://repository.apache.org/snapshots/org/apache/wss4j/wss4j-bindings-wss11/2.0-SNAPSHOT/maven-metadata.xml
(1000 B at 6.9 KB/sec)
Downloading: http://repository.apache.org/snapshots/org/apache/wss4j/wss4j-bindings-wssc/2.0-SNAPSHOT/maven-metadata.xml
Downloaded: http://repository.apache.org/snapshots/org/apache/wss4j/wss4j-bindings-wssc/2.0-SNAPSHOT/maven-metadata.xml
(999 B at 8.3 KB/sec)
Downloading: http://repository.apache.org/snapshots/org/apache/wss4j/wss4j-ws-security-policy-stax/2.0-SNAPSHOT/maven-metadata.xml
Downloaded: http://repository.apache.org/snapshots/org/apache/wss4j/wss4j-ws-security-policy-stax/2.0-SNAPSHOT/maven-metadata.xml
(1009 B at 2.2 KB/sec)
[INFO] 
[INFO] --- maven-clean-plugin:2.5:clean (default-clean) @ cxf-rt-ws-security ---
[INFO] 
[INFO] --- maven-bundle-plugin:2.4.0:cleanVersions (versions) @ cxf-rt-ws-security ---
[INFO] 
[INFO] --- cxf-xml2fastinfoset-plugin:2.6.0:xml2fastinfoset (xml2fastinfoset) @ cxf-rt-ws-security
---
[INFO] 
[INFO] --- cxf-xjc-plugin:2.7.0:xsdtojava (generate-sources) @ cxf-rt-ws-security ---
[INFO] 
[INFO] --- maven-remote-resources-plugin:1.3:process (default) @ cxf-rt-ws-security ---
[INFO] 
[INFO] --- maven-resources-plugin:2.6:resources (default-resources) @ cxf-rt-ws-security ---
[INFO] Using 'UTF-8' encoding to copy filtered resources.
[INFO] Copying 3 resources
[INFO] Copying 2 resources
[INFO] skip non existing resourceDirectory <https://builds.apache.org/job/CXF-trunk-deploy/org.apache.cxf$cxf-rt-ws-security/ws/src/main/resources-filtered>
[INFO] skip non existing resourceDirectory <https://builds.apache.org/job/CXF-trunk-deploy/org.apache.cxf$cxf-rt-ws-security/ws/target/generated/src/main/resources>
[INFO] Copying 3 resources
[INFO] 
[INFO] --- maven-compiler-plugin:3.1:compile (default-compile) @ cxf-rt-ws-security ---
[INFO] Changes detected - recompiling the module!
[INFO] Compiling 213 source files to <https://builds.apache.org/job/CXF-trunk-deploy/org.apache.cxf$cxf-rt-ws-security/ws/target/classes>
[INFO] -------------------------------------------------------------
[ERROR] COMPILATION ERROR : 
[INFO] -------------------------------------------------------------
[ERROR] <https://builds.apache.org/job/CXF-trunk-deploy/org.apache.cxf$cxf-rt-ws-security/ws/src/main/java/org/apache/cxf/ws/security/wss4j/WSS4JStaxOutInterceptor.java>:[140,26]
cannot find symbol
symbol  : method getOutAction()
location: class org.apache.wss4j.stax.ext.WSSSecurityProperties
[ERROR] <https://builds.apache.org/job/CXF-trunk-deploy/org.apache.cxf$cxf-rt-ws-security/ws/src/main/java/org/apache/cxf/ws/security/wss4j/WSS4JStaxOutInterceptor.java>:[140,61]
cannot find symbol
symbol  : method getOutAction()
location: class org.apache.wss4j.stax.ext.WSSSecurityProperties
[ERROR] <https://builds.apache.org/job/CXF-trunk-deploy/org.apache.cxf$cxf-rt-ws-security/ws/src/main/java/org/apache/cxf/ws/security/wss4j/WSS4JStaxInInterceptor.java>:[317,61]
cannot find symbol
symbol  : method getOutAction()
location: class org.apache.wss4j.stax.ext.WSSSecurityProperties
[ERROR] <https://builds.apache.org/job/CXF-trunk-deploy/org.apache.cxf$cxf-rt-ws-security/ws/src/main/java/org/apache/cxf/ws/security/wss4j/WSS4JStaxInInterceptor.java>:[318,65]
cannot find symbol
symbol  : method getOutAction()
location: class org.apache.wss4j.stax.ext.WSSSecurityProperties
[ERROR] <https://builds.apache.org/job/CXF-trunk-deploy/org.apache.cxf$cxf-rt-ws-security/ws/src/main/java/org/apache/cxf/ws/security/wss4j/WSS4JStaxInInterceptor.java>:[338,61]
cannot find symbol
symbol  : method getOutAction()
location: class org.apache.wss4j.stax.ext.WSSSecurityProperties
[ERROR] <https://builds.apache.org/job/CXF-trunk-deploy/org.apache.cxf$cxf-rt-ws-security/ws/src/main/java/org/apache/cxf/ws/security/wss4j/WSS4JStaxInInterceptor.java>:[339,65]
cannot find symbol
symbol  : method getOutAction()
location: class org.apache.wss4j.stax.ext.WSSSecurityProperties
[ERROR] <https://builds.apache.org/job/CXF-trunk-deploy/org.apache.cxf$cxf-rt-ws-security/ws/src/main/java/org/apache/cxf/ws/security/wss4j/WSS4JStaxInInterceptor.java>:[357,61]
cannot find symbol
symbol  : method getOutAction()
location: class org.apache.wss4j.stax.ext.WSSSecurityProperties
[ERROR] <https://builds.apache.org/job/CXF-trunk-deploy/org.apache.cxf$cxf-rt-ws-security/ws/src/main/java/org/apache/cxf/ws/security/wss4j/WSS4JStaxInInterceptor.java>:[358,65]
cannot find symbol
symbol  : method getOutAction()
location: class org.apache.wss4j.stax.ext.WSSSecurityProperties
[INFO] 8 errors 
[INFO] -------------------------------------------------------------

Mime
View raw message