cxf-notifications mailing list archives

Site index · List index
Message view « Date » · « Thread »
Top « Date » · « Thread »
From gmcdon...@apache.org
Subject Build failed in Jenkins: cxf-trunk #1298
Date Wed, 11 May 2016 17:50:02 GMT
See <https://analysis.apache.org/jenkins/job/cxf-trunk/1298/changes>

Changes:

[reta] CXF-6896: CDI integration: duplicate service / feature / provider beans

[reta] Fixing spring-boot module build files (pom.xml)

[reta] Fixing many checkstyle violations for the sample projects

[ay] add the index info in the error text to help error analysis

------------------------------------------
[...truncated 8653 lines...]
[INFO] Apache CXF STS war deployment ...................... SUCCESS [  9.755 s]
[INFO] Apache CXF STS basic systests ...................... SUCCESS [ 23.825 s]
[INFO] Apache CXF STS advanced systests ................... SUCCESS [  9.434 s]
[INFO] Apache CXF STS test OSGi deployment ................ SUCCESS [  2.349 s]
[INFO] Apache CXF STS test Karaf Features ................. SUCCESS [  0.537 s]
[INFO] Apache CXF Karaf Parent ............................ SUCCESS [  0.342 s]
[INFO] Apache CXF Karaf Features .......................... SUCCESS [  5.974 s]
[INFO] Apache CXF Karaf Commands .......................... SUCCESS [  3.373 s]
[INFO] Apache CXF STS Integration Tests ................... SUCCESS [  8.065 s]
[INFO] Apache CXF Services ................................ SUCCESS [  0.237 s]
[INFO] Apache CXF STS service ............................. SUCCESS [  0.154 s]
[INFO] Apache CXF STS systests ............................ SUCCESS [  0.469 s]
[INFO] Apache CXF WSN API ................................. SUCCESS [ 16.323 s]
[INFO] Apache CXF WSN Core ................................ SUCCESS [  5.205 s]
[INFO] Apache CXF WSN OSGi ................................ SUCCESS [  1.950 s]
[INFO] Apache CXF WSN service ............................. SUCCESS [  0.169 s]
[INFO] Apache CXF WS-Discovery API ........................ SUCCESS [  8.742 s]
[INFO] Apache CXF WS-Discovery Service .................... SUCCESS [  1.166 s]
[INFO] Apache CXF WS-Discovery ............................ SUCCESS [  0.169 s]
[INFO] Apache CXF XKMS Common ............................. SUCCESS [ 11.525 s]
[INFO] Apache CXF XKMS X509 Handlers ...................... SUCCESS [  6.461 s]
[INFO] Apache CXF XKMS Service ............................ SUCCESS [  1.808 s]
[INFO] Apache CXF XKMS Client ............................. SUCCESS [  4.499 s]
[INFO] Apache CXF XKMS Karaf Features ..................... SUCCESS [  0.530 s]
[INFO] Apache CXF XKMS OSGi deployment .................... SUCCESS [  3.364 s]
[INFO] Apache CXF XKMS LDAP repository .................... SUCCESS [  1.962 s]
[INFO] Apache CXF XKMS Service war deployment ............. SUCCESS [ 13.357 s]
[INFO] Apache CXF XKMS Integration Tests .................. SUCCESS [  5.612 s]
[INFO] Apache CXF XKMS .................................... SUCCESS [  0.200 s]
[INFO] Apache CXF Bundle Parent ........................... SUCCESS [  2.616 s]
[INFO] Apache CXF Compatibility Bundle Jar ................ SUCCESS [  2.221 s]
[INFO] Apache CXF :: OSGi :: Integration Tests ............ SUCCESS [ 22.399 s]
[INFO] Apache CXF :: OSGi :: Integration Tests pure felix . SUCCESS [ 17.276 s]
[INFO] cxf-repository ..................................... SUCCESS [ 11.514 s]
[INFO] Apache CXF OSGi parent ............................. SUCCESS [  0.272 s]
[INFO] Apache CXF Container Integration System Tests ...... SUCCESS [  0.468 s]
[INFO] Apache CXF Container Integration Test Webapp ....... SUCCESS [  9.744 s]
[INFO] Apache CXF Container Integration Test Grizzly ...... SUCCESS [  9.056 s]
[INFO] Apache CXF Uncategorized System Tests .............. SUCCESS [ 54.827 s]
[INFO] Apache CXF Transport System Tests .................. SUCCESS [ 15.413 s]
[INFO] Apache CXF Transport SSL3 System Tests ............. SUCCESS [  4.102 s]
[INFO] Apache CXF Transport System Tests JMS .............. SUCCESS [  9.820 s]
[INFO] Apache CXF Undertow Transport System Tests ......... SUCCESS [ 13.259 s]
[INFO] Apache CXF JAX-WS System Tests ..................... SUCCESS [ 27.291 s]
[INFO] Apache CXF Databinding System Tests ................ SUCCESS [ 31.227 s]
[INFO] Apache CXF JAX-RS System Tests ..................... SUCCESS [01:02 min]
[INFO] Apache CXF WS-* Specifications System Tests ........ SUCCESS [ 12.657 s]
[INFO] Apache CXF WS-RM Specifications System Tests ....... SUCCESS [  3.312 s]
[INFO] Apache CXF WS-Security System Tests ................ SUCCESS [ 23.474 s]
[INFO] Apache CXF WS-Security Interop System Tests ........ SUCCESS [  9.061 s]
[INFO] Apache CXF Kerberos Integration System Tests ....... SUCCESS [ 14.093 s]
[INFO] Apache CXF JAX-RS System Advanced Security Tests ... SUCCESS [ 16.819 s]
[INFO] Test for writing wsdl to repo ...................... SUCCESS [  9.073 s]
[INFO] Test for generating code from wsdl in repo ......... SUCCESS [  7.595 s]
[INFO] Apache CXF System Tests ............................ SUCCESS [  1.314 s]
[INFO] Apache CXF System Tests for Maven Plugins .......... SUCCESS [  0.121 s]
[INFO] Apache CXF CDI Integration System Tests ............ SUCCESS [  7.664 s]
[INFO] Apache CXF Servlet Container Initializer Integration System Tests SUCCESS [  3.475
s]
[INFO] Apache CXF Distributed Tracing Integration System Tests SKIPPED
[INFO] Apache CXF JiBX Integration System Tests ........... SUCCESS [  0.622 s]
[INFO] Apache CXF JAX-RS JiBX System Tests ................ SUCCESS [ 10.450 s]
[INFO] Apache CXF Data Binding JiBX System Tests .......... SUCCESS [ 11.444 s]
[INFO] ------------------------------------------------------------------------
[INFO] BUILD FAILURE
[INFO] ------------------------------------------------------------------------
[INFO] Total time: 25:30 min
[INFO] Finished at: 2016-05-11T17:49:39+00:00
[INFO] Final Memory: 285M/629M
[INFO] ------------------------------------------------------------------------
Waiting for Jenkins to finish collecting data
[ERROR] Failed to execute goal org.apache.maven.plugins:maven-compiler-plugin:3.3:compile
(default-compile) on project cxf-integration-tracing-htrace: Compilation failure: Compilation
failure:
[ERROR] <https://analysis.apache.org/jenkins/job/cxf-trunk/ws/integration/tracing/tracing-htrace/src/main/java/org/apache/cxf/jaxrs/tracing/htrace/HTraceTracerContext.java>:[26,25]
cannot find symbol
[ERROR] symbol:   class Sampler
[ERROR] location: package org.apache.htrace
[ERROR] <https://analysis.apache.org/jenkins/job/cxf-trunk/ws/integration/tracing/tracing-htrace/src/main/java/org/apache/cxf/jaxrs/tracing/htrace/HTraceTracerContext.java>:[27,25]
cannot find symbol
[ERROR] symbol:   class Trace
[ERROR] location: package org.apache.htrace
[ERROR] <https://analysis.apache.org/jenkins/job/cxf-trunk/ws/integration/tracing/tracing-htrace/src/main/java/org/apache/cxf/jaxrs/tracing/htrace/HTraceTracerContext.java>:[28,25]
cannot find symbol
[ERROR] symbol:   class TraceScope
[ERROR] location: package org.apache.htrace
[ERROR] <https://analysis.apache.org/jenkins/job/cxf-trunk/ws/integration/tracing/tracing-htrace/src/main/java/org/apache/cxf/jaxrs/tracing/htrace/HTraceTracerContext.java>:[29,34]
package org.apache.htrace.wrappers does not exist
[ERROR] <https://analysis.apache.org/jenkins/job/cxf-trunk/ws/integration/tracing/tracing-htrace/src/main/java/org/apache/cxf/jaxrs/tracing/htrace/HTraceTracerContext.java>:[32,19]
cannot find symbol
[ERROR] symbol:   class Sampler
[ERROR] location: class org.apache.cxf.jaxrs.tracing.htrace.HTraceTracerContext
[ERROR] <https://analysis.apache.org/jenkins/job/cxf-trunk/ws/integration/tracing/tracing-htrace/src/main/java/org/apache/cxf/jaxrs/tracing/htrace/HTraceTracerContext.java>:[34,38]
cannot find symbol
[ERROR] symbol:   class Sampler
[ERROR] location: class org.apache.cxf.jaxrs.tracing.htrace.HTraceTracerContext
[ERROR] <https://analysis.apache.org/jenkins/job/cxf-trunk/ws/integration/tracing/tracing-htrace/src/main/java/org/apache/cxf/jaxrs/tracing/htrace/HTraceTracerContext.java>:[40,12]
cannot find symbol
[ERROR] symbol:   class TraceScope
[ERROR] location: class org.apache.cxf.jaxrs.tracing.htrace.HTraceTracerContext
[ERROR] <https://analysis.apache.org/jenkins/job/cxf-trunk/ws/integration/tracing/tracing-htrace/src/main/java/org/apache/cxf/jaxrs/tracing/htrace/HTraceContextProvider.java>:[26,25]
cannot find symbol
[ERROR] symbol:   class Sampler
[ERROR] location: package org.apache.htrace
[ERROR] <https://analysis.apache.org/jenkins/job/cxf-trunk/ws/integration/tracing/tracing-htrace/src/main/java/org/apache/cxf/jaxrs/tracing/htrace/HTraceContextProvider.java>:[27,30]
package org.apache.htrace.impl does not exist
[ERROR] <https://analysis.apache.org/jenkins/job/cxf-trunk/ws/integration/tracing/tracing-htrace/src/main/java/org/apache/cxf/jaxrs/tracing/htrace/HTraceContextProvider.java>:[31,13]
cannot find symbol
[ERROR] symbol:   class Sampler
[ERROR] location: class org.apache.cxf.jaxrs.tracing.htrace.HTraceContextProvider
[ERROR] <https://analysis.apache.org/jenkins/job/cxf-trunk/ws/integration/tracing/tracing-htrace/src/main/java/org/apache/cxf/jaxrs/tracing/htrace/HTraceContextProvider.java>:[33,40]
cannot find symbol
[ERROR] symbol:   class Sampler
[ERROR] location: class org.apache.cxf.jaxrs.tracing.htrace.HTraceContextProvider
[ERROR] <https://analysis.apache.org/jenkins/job/cxf-trunk/ws/integration/tracing/tracing-htrace/src/main/java/org/apache/cxf/jaxrs/tracing/htrace/HTraceFeature.java>:[27,25]
cannot find symbol
[ERROR] symbol:   class HTraceConfiguration
[ERROR] location: package org.apache.htrace
[ERROR] <https://analysis.apache.org/jenkins/job/cxf-trunk/ws/integration/tracing/tracing-htrace/src/main/java/org/apache/cxf/jaxrs/tracing/htrace/HTraceFeature.java>:[28,25]
cannot find symbol
[ERROR] symbol:   class Sampler
[ERROR] location: package org.apache.htrace
[ERROR] <https://analysis.apache.org/jenkins/job/cxf-trunk/ws/integration/tracing/tracing-htrace/src/main/java/org/apache/cxf/jaxrs/tracing/htrace/HTraceFeature.java>:[29,25]
cannot find symbol
[ERROR] symbol:   class SamplerBuilder
[ERROR] location: package org.apache.htrace
[ERROR] <https://analysis.apache.org/jenkins/job/cxf-trunk/ws/integration/tracing/tracing-htrace/src/main/java/org/apache/cxf/jaxrs/tracing/htrace/HTraceFeature.java>:[30,25]
cannot find symbol
[ERROR] symbol:   class SpanReceiver
[ERROR] location: package org.apache.htrace
[ERROR] <https://analysis.apache.org/jenkins/job/cxf-trunk/ws/integration/tracing/tracing-htrace/src/main/java/org/apache/cxf/jaxrs/tracing/htrace/HTraceFeature.java>:[31,25]
cannot find symbol
[ERROR] symbol:   class SpanReceiverBuilder
[ERROR] location: package org.apache.htrace
[ERROR] <https://analysis.apache.org/jenkins/job/cxf-trunk/ws/integration/tracing/tracing-htrace/src/main/java/org/apache/cxf/jaxrs/tracing/htrace/HTraceFeature.java>:[32,25]
cannot find symbol
[ERROR] symbol:   class Trace
[ERROR] location: package org.apache.htrace
[ERROR] <https://analysis.apache.org/jenkins/job/cxf-trunk/ws/integration/tracing/tracing-htrace/src/main/java/org/apache/cxf/jaxrs/tracing/htrace/HTraceFeature.java>:[35,13]
cannot find symbol
[ERROR] symbol:   class HTraceConfiguration
[ERROR] location: class org.apache.cxf.jaxrs.tracing.htrace.HTraceFeature
[ERROR] <https://analysis.apache.org/jenkins/job/cxf-trunk/ws/integration/tracing/tracing-htrace/src/main/java/org/apache/cxf/jaxrs/tracing/htrace/HTraceFeature.java>:[41,32]
cannot find symbol
[ERROR] symbol:   class HTraceConfiguration
[ERROR] location: class org.apache.cxf.jaxrs.tracing.htrace.HTraceFeature
[ERROR] <https://analysis.apache.org/jenkins/job/cxf-trunk/ws/integration/tracing/tracing-htrace/src/main/java/org/apache/cxf/jaxrs/tracing/htrace/HTraceFeature.java>:[64,40]
cannot find symbol
[ERROR] symbol:   class HTraceConfiguration
[ERROR] location: class org.apache.cxf.jaxrs.tracing.htrace.HTraceFeature
[ERROR] <https://analysis.apache.org/jenkins/job/cxf-trunk/ws/integration/tracing/tracing-htrace/src/main/java/org/apache/cxf/jaxrs/tracing/htrace/HTraceFeature.java>:[68,12]
cannot find symbol
[ERROR] symbol:   class HTraceConfiguration
[ERROR] location: class org.apache.cxf.jaxrs.tracing.htrace.HTraceFeature
[ERROR] <https://analysis.apache.org/jenkins/job/cxf-trunk/ws/integration/tracing/tracing-htrace/src/main/java/org/apache/cxf/jaxrs/tracing/htrace/HTraceProvider.java>:[33,25]
cannot find symbol
[ERROR] symbol:   class Sampler
[ERROR] location: package org.apache.htrace
[ERROR] <https://analysis.apache.org/jenkins/job/cxf-trunk/ws/integration/tracing/tracing-htrace/src/main/java/org/apache/cxf/jaxrs/tracing/htrace/HTraceProvider.java>:[34,25]
cannot find symbol
[ERROR] symbol:   class Trace
[ERROR] location: package org.apache.htrace
[ERROR] <https://analysis.apache.org/jenkins/job/cxf-trunk/ws/integration/tracing/tracing-htrace/src/main/java/org/apache/cxf/jaxrs/tracing/htrace/HTraceProvider.java>:[35,25]
cannot find symbol
[ERROR] symbol:   class TraceInfo
[ERROR] location: package org.apache.htrace
[ERROR] <https://analysis.apache.org/jenkins/job/cxf-trunk/ws/integration/tracing/tracing-htrace/src/main/java/org/apache/cxf/jaxrs/tracing/htrace/HTraceProvider.java>:[36,25]
cannot find symbol
[ERROR] symbol:   class TraceScope
[ERROR] location: package org.apache.htrace
[ERROR] <https://analysis.apache.org/jenkins/job/cxf-trunk/ws/integration/tracing/tracing-htrace/src/main/java/org/apache/cxf/jaxrs/tracing/htrace/HTraceProvider.java>:[37,25]
cannot find symbol
[ERROR] symbol:   class Tracer
[ERROR] location: package org.apache.htrace
[ERROR] <https://analysis.apache.org/jenkins/job/cxf-trunk/ws/integration/tracing/tracing-htrace/src/main/java/org/apache/cxf/jaxrs/tracing/htrace/HTraceProvider.java>:[38,30]
package org.apache.htrace.impl does not exist
[ERROR] <https://analysis.apache.org/jenkins/job/cxf-trunk/ws/integration/tracing/tracing-htrace/src/main/java/org/apache/cxf/jaxrs/tracing/htrace/HTraceProvider.java>:[48,19]
cannot find symbol
[ERROR] symbol:   class Sampler
[ERROR] location: class org.apache.cxf.jaxrs.tracing.htrace.HTraceProvider
[ERROR] <https://analysis.apache.org/jenkins/job/cxf-trunk/ws/integration/tracing/tracing-htrace/src/main/java/org/apache/cxf/jaxrs/tracing/htrace/HTraceProvider.java>:[54,33]
cannot find symbol
[ERROR] symbol:   class Sampler
[ERROR] location: class org.apache.cxf.jaxrs.tracing.htrace.HTraceProvider
[ERROR] <https://analysis.apache.org/jenkins/job/cxf-trunk/ws/integration/tracing/tracing-htrace/src/main/java/org/apache/cxf/jaxrs/tracing/htrace/HTraceProvider.java>:[41,1]
cannot find symbol
[ERROR] symbol:   static HEADER_TRACE_ID
[ERROR] location: class
[ERROR] <https://analysis.apache.org/jenkins/job/cxf-trunk/ws/integration/tracing/tracing-htrace/src/main/java/org/apache/cxf/jaxrs/tracing/htrace/HTraceTracerContext.java>:[31,8]
org.apache.cxf.jaxrs.tracing.htrace.HTraceTracerContext is not abstract and does not override
abstract method <T>continueSpan(org.apache.cxf.tracing.Traceable<T>) in org.apache.cxf.tracing.TracerContext
[ERROR] <https://analysis.apache.org/jenkins/job/cxf-trunk/ws/integration/tracing/tracing-htrace/src/main/java/org/apache/cxf/jaxrs/tracing/htrace/HTraceTracerContext.java>:[41,16]
cannot find symbol
[ERROR] symbol:   variable Trace
[ERROR] location: class org.apache.cxf.jaxrs.tracing.htrace.HTraceTracerContext
[ERROR] <https://analysis.apache.org/jenkins/job/cxf-trunk/ws/integration/tracing/tracing-htrace/src/main/java/org/apache/cxf/jaxrs/tracing/htrace/HTraceTracerContext.java>:[55,13]
cannot find symbol
[ERROR] symbol:   variable Trace
[ERROR] location: class org.apache.cxf.jaxrs.tracing.htrace.HTraceTracerContext
[ERROR] <https://analysis.apache.org/jenkins/job/cxf-trunk/ws/integration/tracing/tracing-htrace/src/main/java/org/apache/cxf/jaxrs/tracing/htrace/HTraceTracerContext.java>:[56,24]
cannot find symbol
[ERROR] symbol:   class TraceCallable
[ERROR] location: class org.apache.cxf.jaxrs.tracing.htrace.HTraceTracerContext
[ERROR] <https://analysis.apache.org/jenkins/job/cxf-trunk/ws/integration/tracing/tracing-htrace/src/main/java/org/apache/cxf/jaxrs/tracing/htrace/HTraceTracerContext.java>:[56,41]
cannot find symbol
[ERROR] symbol:   variable Trace
[ERROR] location: class org.apache.cxf.jaxrs.tracing.htrace.HTraceTracerContext
[ERROR] <https://analysis.apache.org/jenkins/job/cxf-trunk/ws/integration/tracing/tracing-htrace/src/main/java/org/apache/cxf/jaxrs/tracing/htrace/HTraceTracerContext.java>:[62,5]
method does not override or implement a method from a supertype
[ERROR] <https://analysis.apache.org/jenkins/job/cxf-trunk/ws/integration/tracing/tracing-htrace/src/main/java/org/apache/cxf/jaxrs/tracing/htrace/HTraceTracerContext.java>:[64,9]
cannot find symbol
[ERROR] symbol:   variable Trace
[ERROR] location: class org.apache.cxf.jaxrs.tracing.htrace.HTraceTracerContext
[ERROR] <https://analysis.apache.org/jenkins/job/cxf-trunk/ws/integration/tracing/tracing-htrace/src/main/java/org/apache/cxf/jaxrs/tracing/htrace/HTraceTracerContext.java>:[75,9]
cannot find symbol
[ERROR] symbol:   variable Trace
[ERROR] location: class org.apache.cxf.jaxrs.tracing.htrace.HTraceTracerContext
[ERROR] <https://analysis.apache.org/jenkins/job/cxf-trunk/ws/integration/tracing/tracing-htrace/src/main/java/org/apache/cxf/jaxrs/tracing/htrace/HTraceContextProvider.java>:[31,36]
cannot find symbol
[ERROR] symbol:   variable NeverSampler
[ERROR] location: class org.apache.cxf.jaxrs.tracing.htrace.HTraceContextProvider
[ERROR] <https://analysis.apache.org/jenkins/job/cxf-trunk/ws/integration/tracing/tracing-htrace/src/main/java/org/apache/cxf/jaxrs/tracing/htrace/HTraceFeature.java>:[38,14]
cannot find symbol
[ERROR] symbol:   variable HTraceConfiguration
[ERROR] location: class org.apache.cxf.jaxrs.tracing.htrace.HTraceFeature
[ERROR] <https://analysis.apache.org/jenkins/job/cxf-trunk/ws/integration/tracing/tracing-htrace/src/main/java/org/apache/cxf/jaxrs/tracing/htrace/HTraceFeature.java>:[51,15]
cannot find symbol
[ERROR] symbol:   class Sampler
[ERROR] location: class org.apache.cxf.jaxrs.tracing.htrace.HTraceFeature
[ERROR] <https://analysis.apache.org/jenkins/job/cxf-trunk/ws/integration/tracing/tracing-htrace/src/main/java/org/apache/cxf/jaxrs/tracing/htrace/HTraceFeature.java>:[51,42]
cannot find symbol
[ERROR] symbol:   class SamplerBuilder
[ERROR] location: class org.apache.cxf.jaxrs.tracing.htrace.HTraceFeature
[ERROR] <https://analysis.apache.org/jenkins/job/cxf-trunk/ws/integration/tracing/tracing-htrace/src/main/java/org/apache/cxf/jaxrs/tracing/htrace/HTraceFeature.java>:[52,15]
cannot find symbol
[ERROR] symbol:   class SpanReceiver
[ERROR] location: class org.apache.cxf.jaxrs.tracing.htrace.HTraceFeature
[ERROR] <https://analysis.apache.org/jenkins/job/cxf-trunk/ws/integration/tracing/tracing-htrace/src/main/java/org/apache/cxf/jaxrs/tracing/htrace/HTraceFeature.java>:[52,47]
cannot find symbol
[ERROR] symbol:   class SpanReceiverBuilder
[ERROR] location: class org.apache.cxf.jaxrs.tracing.htrace.HTraceFeature
[ERROR] <https://analysis.apache.org/jenkins/job/cxf-trunk/ws/integration/tracing/tracing-htrace/src/main/java/org/apache/cxf/jaxrs/tracing/htrace/HTraceFeature.java>:[55,13]
cannot find symbol
[ERROR] symbol:   variable Trace
[ERROR] location: class org.apache.cxf.jaxrs.tracing.htrace.HTraceFeature
[ERROR] <https://analysis.apache.org/jenkins/job/cxf-trunk/ws/integration/tracing/tracing-htrace/src/main/java/org/apache/cxf/jaxrs/tracing/htrace/HTraceProvider.java>:[51,14]
cannot find symbol
[ERROR] symbol:   variable NeverSampler
[ERROR] location: class org.apache.cxf.jaxrs.tracing.htrace.HTraceProvider
[ERROR] <https://analysis.apache.org/jenkins/job/cxf-trunk/ws/integration/tracing/tracing-htrace/src/main/java/org/apache/cxf/jaxrs/tracing/htrace/HTraceProvider.java>:[64,62]
cannot find symbol
[ERROR] symbol:   variable HEADER_TRACE_ID
[ERROR] location: class org.apache.cxf.jaxrs.tracing.htrace.HTraceProvider
[ERROR] <https://analysis.apache.org/jenkins/job/cxf-trunk/ws/integration/tracing/tracing-htrace/src/main/java/org/apache/cxf/jaxrs/tracing/htrace/HTraceProvider.java>:[65,19]
package Tracer does not exist
[ERROR] <https://analysis.apache.org/jenkins/job/cxf-trunk/ws/integration/tracing/tracing-htrace/src/main/java/org/apache/cxf/jaxrs/tracing/htrace/HTraceProvider.java>:[69,19]
package Tracer does not exist
[ERROR] <https://analysis.apache.org/jenkins/job/cxf-trunk/ws/integration/tracing/tracing-htrace/src/main/java/org/apache/cxf/jaxrs/tracing/htrace/HTraceProvider.java>:[71,30]
package Tracer does not exist
[ERROR] <https://analysis.apache.org/jenkins/job/cxf-trunk/ws/integration/tracing/tracing-htrace/src/main/java/org/apache/cxf/jaxrs/tracing/htrace/HTraceProvider.java>:[71,69]
package Tracer does not exist
[ERROR] <https://analysis.apache.org/jenkins/job/cxf-trunk/ws/integration/tracing/tracing-htrace/src/main/java/org/apache/cxf/jaxrs/tracing/htrace/HTraceProvider.java>:[73,18]
cannot find symbol
[ERROR] symbol:   class Sampler
[ERROR] location: class org.apache.cxf.jaxrs.tracing.htrace.HTraceProvider
[ERROR] <https://analysis.apache.org/jenkins/job/cxf-trunk/ws/integration/tracing/tracing-htrace/src/main/java/org/apache/cxf/jaxrs/tracing/htrace/HTraceProvider.java>:[73,27]
cannot find symbol
[ERROR] symbol:   class TraceInfo
[ERROR] location: class org.apache.cxf.jaxrs.tracing.htrace.HTraceProvider
[ERROR] <https://analysis.apache.org/jenkins/job/cxf-trunk/ws/integration/tracing/tracing-htrace/src/main/java/org/apache/cxf/jaxrs/tracing/htrace/HTraceProvider.java>:[73,52]
cannot find symbol
[ERROR] symbol:   class TraceInfo
[ERROR] location: class org.apache.cxf.jaxrs.tracing.htrace.HTraceProvider
[ERROR] <https://analysis.apache.org/jenkins/job/cxf-trunk/ws/integration/tracing/tracing-htrace/src/main/java/org/apache/cxf/jaxrs/tracing/htrace/HTraceProvider.java>:[72,52]
cannot find symbol
[ERROR] symbol:   variable Trace
[ERROR] location: class org.apache.cxf.jaxrs.tracing.htrace.HTraceProvider
[ERROR] <https://analysis.apache.org/jenkins/job/cxf-trunk/ws/integration/tracing/tracing-htrace/src/main/java/org/apache/cxf/jaxrs/tracing/htrace/HTraceProvider.java>:[83,33]
cannot find symbol
[ERROR] symbol:   variable HEADER_TRACE_ID
[ERROR] location: class org.apache.cxf.jaxrs.tracing.htrace.HTraceProvider
[ERROR] <https://analysis.apache.org/jenkins/job/cxf-trunk/ws/integration/tracing/tracing-htrace/src/main/java/org/apache/cxf/jaxrs/tracing/htrace/HTraceProvider.java>:[84,46]
cannot find symbol
[ERROR] symbol:   variable HEADER_TRACE_ID
[ERROR] location: class org.apache.cxf.jaxrs.tracing.htrace.HTraceProvider
[ERROR] <https://analysis.apache.org/jenkins/job/cxf-trunk/ws/integration/tracing/tracing-htrace/src/main/java/org/apache/cxf/jaxrs/tracing/htrace/HTraceProvider.java>:[84,80]
cannot find symbol
[ERROR] symbol:   variable HEADER_TRACE_ID
[ERROR] location: class org.apache.cxf.jaxrs.tracing.htrace.HTraceProvider
[ERROR] <https://analysis.apache.org/jenkins/job/cxf-trunk/ws/integration/tracing/tracing-htrace/src/main/java/org/apache/cxf/jaxrs/tracing/htrace/HTraceProvider.java>:[89,30]
cannot find symbol
[ERROR] symbol:   class TraceScope
[ERROR] location: class org.apache.cxf.jaxrs.tracing.htrace.HTraceProvider
[ERROR] <https://analysis.apache.org/jenkins/job/cxf-trunk/ws/integration/tracing/tracing-htrace/src/main/java/org/apache/cxf/jaxrs/tracing/htrace/HTraceProvider.java>:[90,19]
cannot find symbol
[ERROR] symbol:   class TraceScope
[ERROR] location: class org.apache.cxf.jaxrs.tracing.htrace.HTraceProvider
[ERROR] <https://analysis.apache.org/jenkins/job/cxf-trunk/ws/integration/tracing/tracing-htrace/src/main/java/org/apache/cxf/jaxrs/tracing/htrace/HTraceProvider.java>:[90,38]
cannot find symbol
[ERROR] symbol:   class TraceScope
[ERROR] location: class org.apache.cxf.jaxrs.tracing.htrace.HTraceProvider
[ERROR] -> [Help 1]
[ERROR] 
[ERROR] To see the full stack trace of the errors, re-run Maven with the -e switch.
[ERROR] Re-run Maven using the -X switch to enable full debug logging.
[ERROR] 
[ERROR] For more information about the errors and possible solutions, please read the following
articles:
[ERROR] [Help 1] http://cwiki.apache.org/confluence/display/MAVEN/MojoFailureException
[ERROR] 
[ERROR] After correcting the problems, you can resume the build with the command
[ERROR]   mvn <goals> -rf :cxf-integration-tracing-htrace
Sending e-mails to: notifications@cxf.apache.org
channel stopped
Skipping sonar analysis due to bad build status FAILURE

Mime
View raw message